<svg width="1030" height="500" viewBox="0 0 1030 500" fill="none" xmlns="http://www.w3.org/2000/svg">
<rect width="1030" height="500" rx="38" fill="black"/>
<path fill-rule="evenodd" clip-rule="evenodd" d="M514.574 209.056C534.643 209.056 550.912 192.978 550.912 173.146C550.912 153.313 534.643 137.236 514.574 137.236C494.506 137.236 478.237 153.313 478.237 173.146C478.237 192.978 494.506 209.056 514.574 209.056ZM514.574 215.146C538.046 215.146 557.074 196.341 557.074 173.146C557.074 149.95 538.046 131.146 514.574 131.146C491.102 131.146 472.074 149.95 472.074 173.146C472.074 196.341 491.102 215.146 514.574 215.146Z" fill="white"/>
<path fill-rule="evenodd" clip-rule="evenodd" d="M514.574 203.146C530.867 203.146 544.074 189.938 544.074 173.646C544.074 157.353 530.867 144.146 514.574 144.146C511.895 144.146 509.299 144.503 506.832 145.172C511.445 147.137 514.68 151.714 514.68 157.045C514.68 164.169 508.905 169.945 501.78 169.945C495.288 169.945 489.916 165.149 489.014 158.907C486.508 163.244 485.074 168.277 485.074 173.646C485.074 189.938 498.282 203.146 514.574 203.146Z" fill="white"/>
<path fill-rule="evenodd" clip-rule="evenodd" d="M517.602 93.0729C519.904 94.4298 522.862 93.6494 524.21 91.3286C525.557 89.0066 524.783 86.0243 522.479 84.6673C520.177 83.3093 517.218 84.0897 515.871 86.4117C514.525 88.7325 515.299 91.7148 517.602 93.0729ZM554.782 118.414C553.285 120.993 549.998 121.861 547.44 120.352C544.881 118.844 544.021 115.529 545.517 112.95C547.014 110.371 550.301 109.504 552.859 111.012C555.417 112.521 556.278 115.835 554.782 118.414ZM492.64 122.553C495.454 124.214 499.07 123.259 500.716 120.422C502.362 117.585 501.416 113.941 498.602 112.28C495.788 110.621 492.171 111.576 490.525 114.412C488.879 117.249 489.826 120.894 492.64 122.553ZM522.487 222.394C520.637 224.286 517.684 224.752 515.304 223.349C515.137 223.25 514.977 223.145 514.824 223.033C517.431 223.016 519.99 222.798 522.487 222.394ZM539.045 216.554L564.455 213.759C564.387 213.384 564.344 213.009 564.331 212.633L541.344 215.162C540.591 215.646 539.825 216.11 539.045 216.554ZM559.653 194.123L567.366 206.236C567.667 206.009 567.987 205.812 568.316 205.63L560.203 192.887C560.025 193.302 559.842 193.714 559.653 194.123ZM562.19 159.26L579.632 155.56C579.529 155.197 579.451 154.828 579.401 154.453L561.856 158.174C561.971 158.534 562.083 158.896 562.19 159.26ZM547.027 135.724L549.643 123.288C549.27 123.236 548.904 123.151 548.544 123.046L546.051 134.899C546.38 135.17 546.705 135.445 547.027 135.724ZM506.009 222.315C506.784 222.448 507.565 222.563 508.352 222.66L479.018 233.453C478.917 233.083 478.787 232.729 478.633 232.388L506.009 222.315ZM474.068 202.279C474.402 202.745 474.744 203.205 475.094 203.658L473.283 228.314C472.926 228.259 472.568 228.222 472.206 228.222C472.199 228.222 472.192 228.223 472.184 228.224C472.177 228.225 472.169 228.226 472.161 228.226L474.068 202.279ZM465.185 179.808C465.234 180.186 465.287 180.562 465.345 180.937L440.412 187.576C440.346 187.205 440.25 186.838 440.127 186.481L465.185 179.808ZM466.169 161.533C466.049 162.027 465.936 162.524 465.831 163.024L453.292 144.911C453.616 144.72 453.919 144.497 454.209 144.257L466.169 161.533ZM493.127 128.403C492.651 128.63 492.18 128.863 491.713 129.104L493.054 125.017C493.401 125.161 493.759 125.278 494.122 125.37L493.127 128.403ZM504.002 124.702L502.217 122.864C501.966 123.147 501.698 123.411 501.412 123.656L502.715 124.996C503.142 124.893 503.571 124.794 504.002 124.702ZM470.614 103.985C469.267 106.306 466.309 107.088 464.006 105.729C461.704 104.371 460.929 101.389 462.276 99.0683C463.623 96.7474 466.582 95.9659 468.884 97.3239C471.186 98.682 471.961 101.664 470.614 103.985ZM569.44 115.023C571.742 116.381 574.701 115.6 576.047 113.279C577.395 110.958 576.621 107.976 574.317 106.618C572.015 105.26 569.056 106.041 567.709 108.362C566.363 110.683 567.137 113.665 569.44 115.023ZM600.854 156.247C599.507 158.568 596.548 159.349 594.245 157.991C591.942 156.633 591.168 153.651 592.515 151.33C593.862 149.009 596.82 148.228 599.123 149.586C601.426 150.944 602.2 153.926 600.854 156.247ZM530.771 265.867C532.819 267.073 535.448 266.379 536.646 264.317C537.842 262.253 537.154 259.602 535.107 258.395C534.662 258.132 534.189 257.96 533.709 257.872C533.799 257.746 533.884 257.614 533.964 257.477C535.31 255.156 534.536 252.174 532.234 250.816C529.93 249.458 526.972 250.239 525.626 252.56C524.278 254.881 525.053 257.863 527.356 259.221C527.966 259.581 528.623 259.791 529.283 259.862C529.266 259.889 529.25 259.917 529.233 259.946C528.037 262.008 528.725 264.66 530.771 265.867ZM577.996 242.686C576.798 244.749 574.169 245.443 572.122 244.236C570.076 243.029 569.387 240.378 570.583 238.315C571.781 236.251 574.41 235.557 576.458 236.765C578.504 237.972 579.193 240.622 577.996 242.686ZM595.948 199.742C597.995 200.95 600.624 200.255 601.822 198.192C603.019 196.129 602.33 193.477 600.284 192.271C598.237 191.064 595.607 191.758 594.41 193.821C593.213 195.884 593.902 198.536 595.948 199.742ZM499.891 92.3135C498.694 94.3761 496.064 95.0704 494.017 93.863C491.97 92.6567 491.281 90.0051 492.479 87.9425C493.677 85.8788 496.306 85.1845 498.353 86.3919C500.399 87.5993 501.088 90.2498 499.891 92.3135ZM443.279 236.184C445.325 237.391 447.955 236.697 449.152 234.634C450.35 232.57 449.661 229.92 447.615 228.712C445.568 227.505 442.938 228.199 441.741 230.263C440.543 232.326 441.232 234.977 443.279 236.184ZM487.894 261.862C486.696 263.925 484.066 264.618 482.02 263.412C479.973 262.205 479.285 259.554 480.482 257.491C481.679 255.428 484.309 254.734 486.356 255.94C488.402 257.147 489.091 259.799 487.894 261.862ZM428.127 192.372C428.831 192.787 429.604 192.977 430.364 192.964C430.408 192.992 430.452 193.019 430.497 193.046C432.8 194.404 435.758 193.622 437.105 191.301C438.453 188.98 437.677 185.998 435.375 184.64C433.999 183.828 432.388 183.781 431.027 184.37C429.313 184.071 427.518 184.847 426.588 186.45C425.391 188.514 426.079 191.165 428.127 192.372ZM591.052 156.164C589.556 158.743 586.268 159.611 583.711 158.102C581.152 156.593 580.292 153.279 581.788 150.7C583.285 148.121 586.571 147.253 589.13 148.762C591.688 150.271 592.549 153.585 591.052 156.164ZM568.708 217.035C571.267 218.544 574.553 217.677 576.05 215.097C577.547 212.518 576.686 209.205 574.127 207.697C571.569 206.188 568.282 207.056 566.786 209.635C565.289 212.214 566.15 215.527 568.708 217.035ZM446.762 142.964C449.064 144.322 452.023 143.541 453.37 141.22C454.717 138.899 453.942 135.917 451.64 134.558C449.337 133.2 446.379 133.981 445.032 136.303C443.685 138.624 444.46 141.606 446.762 142.964ZM435.907 145.748C434.56 148.07 431.601 148.851 429.299 147.493C426.997 146.134 426.221 143.152 427.569 140.831C428.916 138.51 431.874 137.729 434.177 139.087C436.479 140.445 437.254 143.427 435.907 145.748ZM469.245 239.56C471.548 240.918 474.506 240.137 475.853 237.816C477.2 235.495 476.425 232.513 474.123 231.154C471.821 229.796 468.862 230.578 467.515 232.899C466.168 235.22 466.943 238.202 469.245 239.56ZM583.94 146.387C584.284 146.239 584.637 146.111 585.001 146.013L575.219 117.351C574.876 117.502 574.523 117.629 574.158 117.724L583.94 146.387ZM520.709 226.187C521.074 226.097 521.433 225.986 521.781 225.847L528.733 248.078C528.366 248.164 528.006 248.269 527.658 248.412L520.709 226.187ZM589.413 160.671C589.059 160.795 588.697 160.892 588.326 160.962L595.93 190.019C596.272 189.861 596.624 189.726 596.99 189.629L589.413 160.671ZM565.641 112.913L558.196 114.579C558.141 114.204 558.057 113.835 557.948 113.473L565.393 111.807C565.431 112.081 565.48 112.355 565.551 112.627C565.567 112.689 565.587 112.748 565.607 112.808L565.62 112.847L565.631 112.882L565.641 112.913ZM545.353 110.194L526.213 93.1492C525.986 93.4539 525.739 93.7371 525.469 93.9987L544.61 111.043C544.838 110.741 545.085 110.456 545.353 110.194ZM448.063 145.687L436.184 182.261C435.838 182.115 435.477 182.006 435.113 181.918L446.992 145.344C447.338 145.49 447.698 145.598 448.063 145.687ZM489.103 113.269C489.13 113.223 489.16 113.18 489.191 113.137C489.216 113.102 489.241 113.067 489.264 113.03L473.434 104.408C473.326 104.654 473.208 104.895 473.071 105.13C473.038 105.186 473.001 105.239 472.964 105.292C472.939 105.327 472.914 105.363 472.89 105.399L488.718 114.019C488.833 113.764 488.96 113.514 489.103 113.269ZM581.265 148.34L555.536 121.562C555.824 121.321 556.093 121.057 556.343 120.774L582.072 147.553C581.784 147.794 581.515 148.057 581.265 148.34ZM543.105 116.49L504.282 117.725C504.295 117.345 504.275 116.968 504.237 116.592L543.058 115.357C543.043 115.733 543.064 116.112 543.105 116.49ZM456.371 136.325L488.98 121.331C488.803 120.999 488.641 120.659 488.508 120.302L455.901 135.295C456.081 135.625 456.243 135.966 456.371 136.325ZM435.951 195.504C435.6 195.638 435.239 195.739 434.871 195.816L441.351 218.401L433.013 195.949C432.584 195.922 432.159 195.863 431.743 195.758L443.161 226.511C443.648 226.275 444.164 226.103 444.699 225.995L435.951 195.504ZM462.866 107.339L437.213 138.208C436.949 137.946 436.665 137.7 436.354 137.478L462.006 106.611C462.273 106.874 462.557 107.12 462.866 107.339ZM568.444 241.98L536.842 252.292C536.985 252.642 537.103 253.002 537.189 253.369L568.541 243.14L538.959 258.616C539.159 258.934 539.333 259.267 539.477 259.62L569.287 244.026C568.892 243.394 568.609 242.702 568.444 241.98ZM594.653 201.23C594.868 201.397 595.092 201.555 595.331 201.696C595.383 201.727 595.438 201.753 595.493 201.78L595.493 201.78L595.514 201.79L595.551 201.808C595.57 201.817 595.589 201.826 595.607 201.836L578.333 234.957C578.307 234.94 578.281 234.922 578.255 234.904L578.255 234.904L578.255 234.904C578.208 234.871 578.16 234.839 578.111 234.809C577.862 234.663 577.605 234.534 577.343 234.423L594.653 201.23ZM473.812 99.7193C473.875 99.964 473.923 100.21 473.961 100.457L493.466 95.8501C493.458 95.8456 493.451 95.8417 493.443 95.838L493.431 95.8321L493.418 95.8263L493.409 95.8216L493.403 95.8184C492.99 95.5749 492.62 95.2849 492.276 94.9666L475.186 99.0035L490.84 93.0433C490.677 92.7081 490.552 92.349 490.445 91.9832L473.364 98.4847C473.548 98.8789 473.699 99.29 473.812 99.7193ZM430.95 182.05L430.95 182.05C430.905 182.046 430.86 182.042 430.815 182.042C430.514 182.042 430.217 182.065 429.922 182.107L431.372 150.365C431.663 150.402 431.956 150.425 432.251 150.425C432.505 150.425 432.756 150.401 433.004 150.374L433.829 181.733C433.783 181.73 433.738 181.726 433.692 181.722L433.692 181.722L433.692 181.722L433.692 181.722L433.691 181.722L433.691 181.722L433.691 181.722L433.691 181.722L433.69 181.722L433.69 181.722L433.69 181.722L433.689 181.722L433.689 181.722L433.689 181.722L433.689 181.722C433.613 181.715 433.536 181.708 433.459 181.708C433.205 181.708 432.955 181.731 432.705 181.759L432.105 158.928L431.049 182.058C431.016 182.057 430.983 182.054 430.95 182.051L430.95 182.051L430.95 182.051L430.95 182.05ZM593.177 147.941C593.486 147.726 593.811 147.536 594.151 147.372L576.423 116.667C576.114 116.883 575.79 117.072 575.45 117.236L593.177 147.941ZM478.707 238.154C478.855 237.805 478.979 237.447 479.07 237.083L523.81 252.221C523.66 252.57 523.538 252.928 523.447 253.292L478.707 238.154ZM442.874 140.569C442.824 140.374 442.787 140.179 442.752 139.983L438.942 140.972C439.063 141.33 439.159 141.696 439.224 142.068L443.034 141.079C442.977 140.911 442.92 140.742 442.874 140.569ZM597.366 189.553L596.786 160.897L596.821 160.899L596.855 160.901C596.882 160.904 596.91 160.906 596.938 160.909C597.025 160.916 597.111 160.924 597.199 160.924C597.438 160.924 597.674 160.901 597.91 160.876L598.487 189.423C598.108 189.432 597.733 189.48 597.366 189.553ZM474.946 241.927L481.215 254.119C481.533 253.917 481.861 253.731 482.208 253.586L475.94 241.397C475.621 241.597 475.292 241.779 474.946 241.927ZM566.213 217.423C566.459 217.706 566.727 217.971 567.014 218.217L535.657 250.35C535.414 250.067 535.147 249.802 534.856 249.556L566.213 217.423ZM465.129 235.143C465.14 234.763 465.186 234.388 465.257 234.017L452.504 232.603C452.496 232.981 452.452 233.357 452.379 233.729L465.129 235.143ZM464.494 108.198L453.212 132.561C452.884 132.373 452.54 132.22 452.19 132.088L463.473 107.725C463.801 107.913 464.144 108.066 464.494 108.198ZM467.237 230.277C467.506 230.012 467.8 229.777 468.105 229.559L438.42 193.923C438.151 194.189 437.857 194.423 437.553 194.643L467.237 230.277ZM572.154 220.027C572.531 220.016 572.903 219.974 573.27 219.907L574.701 233.913C574.321 233.919 573.949 233.967 573.583 234.038L572.154 220.027ZM501.869 111.586L516.377 94.6262C516.071 94.3996 515.792 94.1459 515.531 93.8798L501.022 110.841C501.327 111.07 501.605 111.322 501.869 111.586ZM526.968 261.291C526.924 261.648 526.91 262.008 526.925 262.37L491.188 260.569C491.284 259.871 491.259 259.158 491.125 258.452L491.552 258.408L523.243 255.172C523.252 255.547 523.289 255.923 523.357 256.299L492.158 259.485L526.851 261.231C526.889 261.254 526.93 261.27 526.968 261.291ZM479.059 256.347C479.243 256.029 479.46 255.739 479.69 255.462L451.631 235.739C451.627 235.745 451.624 235.751 451.621 235.758L451.621 235.758L451.621 235.758C451.618 235.765 451.615 235.771 451.611 235.777C451.427 236.094 451.21 236.386 450.98 236.663L479.04 256.385C479.043 256.379 479.046 256.372 479.049 256.366L479.052 256.36C479.054 256.356 479.057 256.351 479.059 256.347ZM513.282 90.0063L503.205 90.7935C503.243 90.414 503.252 90.0335 503.224 89.6563L513.49 88.8543C513.49 89.5996 513.606 90.3359 513.83 91.0415L502.115 93.8075C502.141 93.7686 502.168 93.7303 502.195 93.692L502.195 93.6918C502.249 93.6154 502.303 93.539 502.351 93.4575C502.534 93.1404 502.681 92.813 502.807 92.48L513.282 90.0063ZM593.195 199.653C592.987 199.335 592.807 199.003 592.657 198.657L578.079 207.833C578.3 208.137 578.496 208.459 578.67 208.795L593.195 199.653ZM565.677 108.59L526.838 92.1437C527.014 91.8027 527.164 91.4561 527.28 91.1016L566.119 107.548C565.944 107.887 565.795 108.233 565.677 108.59ZM573.274 204.826L584.509 160.69C584.866 160.811 585.228 160.906 585.598 160.973L574.363 205.109C574.007 204.988 573.644 204.893 573.274 204.826Z" fill="white"/>
<path d="M263.22 341C262.779 339.559 262.279 338.078 261.719 336.556C261.198 335.035 260.678 333.514 260.157 331.992H243.944C243.423 333.514 242.883 335.035 242.322 336.556C241.802 338.078 241.322 339.559 240.881 341H231.153C232.714 336.516 234.196 332.373 235.597 328.57C236.998 324.766 238.359 321.183 239.68 317.821C241.041 314.458 242.362 311.275 243.644 308.273C244.965 305.23 246.326 302.268 247.727 299.385H256.674C258.036 302.268 259.377 305.23 260.698 308.273C262.019 311.275 263.34 314.458 264.661 317.821C266.022 321.183 267.403 324.766 268.804 328.57C270.206 332.373 271.687 336.516 273.248 341H263.22ZM251.99 308.813C251.79 309.414 251.49 310.234 251.09 311.275C250.689 312.316 250.229 313.517 249.709 314.878C249.188 316.239 248.608 317.741 247.967 319.382C247.367 321.023 246.746 322.745 246.106 324.546H257.935C257.295 322.745 256.674 321.023 256.074 319.382C255.473 317.741 254.893 316.239 254.332 314.878C253.812 313.517 253.352 312.316 252.951 311.275C252.551 310.234 252.231 309.414 251.99 308.813ZM284.977 320.163C284.977 322.204 285.217 324.046 285.697 325.687C286.218 327.329 286.938 328.75 287.859 329.951C288.82 331.112 289.981 332.013 291.342 332.653C292.703 333.294 294.264 333.614 296.026 333.614C297.747 333.614 299.289 333.294 300.65 332.653C302.051 332.013 303.212 331.112 304.133 329.951C305.093 328.75 305.814 327.329 306.294 325.687C306.815 324.046 307.075 322.204 307.075 320.163C307.075 318.121 306.815 316.279 306.294 314.638C305.814 312.957 305.093 311.535 304.133 310.374C303.212 309.173 302.051 308.253 300.65 307.612C299.289 306.972 297.747 306.651 296.026 306.651C294.264 306.651 292.703 306.992 291.342 307.672C289.981 308.313 288.82 309.234 287.859 310.435C286.938 311.596 286.218 313.017 285.697 314.698C285.217 316.339 284.977 318.161 284.977 320.163ZM316.743 320.163C316.743 323.726 316.203 326.868 315.122 329.59C314.081 332.273 312.64 334.535 310.798 336.376C308.957 338.178 306.755 339.539 304.193 340.46C301.671 341.38 298.948 341.841 296.026 341.841C293.184 341.841 290.501 341.38 287.979 340.46C285.457 339.539 283.255 338.178 281.374 336.376C279.492 334.535 278.011 332.273 276.93 329.59C275.849 326.868 275.309 323.726 275.309 320.163C275.309 316.6 275.869 313.477 276.99 310.795C278.111 308.073 279.612 305.791 281.494 303.949C283.415 302.108 285.617 300.726 288.099 299.806C290.621 298.885 293.264 298.425 296.026 298.425C298.868 298.425 301.551 298.885 304.073 299.806C306.595 300.726 308.797 302.108 310.678 303.949C312.56 305.791 314.041 308.073 315.122 310.795C316.203 313.477 316.743 316.6 316.743 320.163ZM322.422 319.022H339.837V327.128H322.422V319.022ZM346.132 341V299.385H373.996V307.252H355.5V315.959H371.954V323.826H355.5V341H346.132ZM380.614 299.385H389.982V341H380.614V299.385ZM407.481 320.163C407.481 322.204 407.721 324.046 408.202 325.687C408.722 327.329 409.443 328.75 410.363 329.951C411.324 331.112 412.485 332.013 413.846 332.653C415.207 333.294 416.769 333.614 418.53 333.614C420.252 333.614 421.793 333.294 423.154 332.653C424.555 332.013 425.716 331.112 426.637 329.951C427.598 328.75 428.318 327.329 428.799 325.687C429.319 324.046 429.579 322.204 429.579 320.163C429.579 318.121 429.319 316.279 428.799 314.638C428.318 312.957 427.598 311.535 426.637 310.374C425.716 309.173 424.555 308.253 423.154 307.612C421.793 306.972 420.252 306.651 418.53 306.651C416.769 306.651 415.207 306.992 413.846 307.672C412.485 308.313 411.324 309.234 410.363 310.435C409.443 311.596 408.722 313.017 408.202 314.698C407.721 316.339 407.481 318.161 407.481 320.163ZM439.248 320.163C439.248 323.726 438.707 326.868 437.626 329.59C436.585 332.273 435.144 334.535 433.303 336.376C431.461 338.178 429.259 339.539 426.697 340.46C424.175 341.38 421.453 341.841 418.53 341.841C415.688 341.841 413.006 341.38 410.484 340.46C407.961 339.539 405.76 338.178 403.878 336.376C401.996 334.535 400.515 332.273 399.434 329.59C398.353 326.868 397.813 323.726 397.813 320.163C397.813 316.6 398.373 313.477 399.494 310.795C400.615 308.073 402.117 305.791 403.998 303.949C405.92 302.108 408.122 300.726 410.604 299.806C413.126 298.885 415.768 298.425 418.53 298.425C421.373 298.425 424.055 298.885 426.577 299.806C429.099 300.726 431.301 302.108 433.182 303.949C435.064 305.791 436.545 308.073 437.626 310.795C438.707 313.477 439.248 316.6 439.248 320.163ZM480.458 341.841C473.693 341.841 468.528 339.959 464.965 336.196C461.442 332.433 459.681 327.088 459.681 320.163C459.681 316.72 460.221 313.657 461.302 310.975C462.383 308.253 463.864 305.971 465.746 304.129C467.628 302.248 469.869 300.827 472.472 299.866C475.074 298.905 477.896 298.425 480.939 298.425C482.7 298.425 484.301 298.565 485.743 298.845C487.184 299.085 488.445 299.385 489.526 299.746C490.607 300.066 491.507 300.406 492.228 300.766C492.949 301.127 493.469 301.407 493.789 301.607L491.087 309.173C489.806 308.493 488.305 307.912 486.583 307.432C484.902 306.952 482.98 306.711 480.819 306.711C479.377 306.711 477.956 306.952 476.555 307.432C475.194 307.912 473.973 308.693 472.892 309.774C471.851 310.815 471.01 312.176 470.37 313.857C469.729 315.539 469.409 317.58 469.409 319.982C469.409 321.904 469.609 323.706 470.01 325.387C470.45 327.028 471.13 328.45 472.051 329.651C473.012 330.852 474.253 331.812 475.774 332.533C477.296 333.214 479.137 333.554 481.299 333.554C482.66 333.554 483.881 333.474 484.962 333.314C486.043 333.153 487.004 332.973 487.844 332.773C488.685 332.533 489.426 332.273 490.066 331.992C490.707 331.712 491.287 331.452 491.808 331.212L494.39 338.718C493.069 339.519 491.207 340.239 488.805 340.88C486.403 341.52 483.621 341.841 480.458 341.841ZM528.661 325.147C528.661 327.629 528.301 329.911 527.581 331.992C526.86 334.034 525.819 335.796 524.458 337.277C523.097 338.718 521.455 339.839 519.534 340.64C517.652 341.44 515.531 341.841 513.169 341.841C510.847 341.841 508.725 341.44 506.803 340.64C504.922 339.839 503.3 338.718 501.939 337.277C500.578 335.796 499.517 334.034 498.757 331.992C497.996 329.911 497.616 327.629 497.616 325.147C497.616 322.665 497.996 320.403 498.757 318.361C499.557 316.319 500.638 314.578 501.999 313.137C503.4 311.696 505.042 310.575 506.923 309.774C508.845 308.973 510.927 308.573 513.169 308.573C515.45 308.573 517.532 308.973 519.414 309.774C521.335 310.575 522.977 311.696 524.338 313.137C525.699 314.578 526.76 316.319 527.521 318.361C528.281 320.403 528.661 322.665 528.661 325.147ZM519.534 325.147C519.534 322.385 518.973 320.223 517.852 318.661C516.772 317.06 515.21 316.259 513.169 316.259C511.127 316.259 509.546 317.06 508.425 318.661C507.304 320.223 506.743 322.385 506.743 325.147C506.743 327.909 507.304 330.111 508.425 331.752C509.546 333.354 511.127 334.154 513.169 334.154C515.21 334.154 516.772 333.354 517.852 331.752C518.973 330.111 519.534 327.909 519.534 325.147ZM535.593 310.495C537.114 310.054 539.075 309.654 541.477 309.294C543.879 308.893 546.402 308.693 549.044 308.693C551.726 308.693 553.948 309.053 555.709 309.774C557.511 310.455 558.932 311.435 559.973 312.716C561.014 313.998 561.754 315.519 562.195 317.28C562.635 319.042 562.855 321.003 562.855 323.165V341H553.908V324.246C553.908 321.364 553.528 319.322 552.767 318.121C552.006 316.92 550.585 316.319 548.503 316.319C547.863 316.319 547.182 316.359 546.462 316.44C545.741 316.48 545.1 316.54 544.54 316.62V341H535.593V310.495ZM569.453 325.447C569.453 322.645 569.873 320.203 570.714 318.121C571.595 315.999 572.736 314.238 574.137 312.837C575.538 311.435 577.139 310.374 578.941 309.654C580.782 308.933 582.664 308.573 584.585 308.573C589.069 308.573 592.612 309.954 595.214 312.716C597.816 315.439 599.117 319.462 599.117 324.786C599.117 325.307 599.097 325.887 599.057 326.528C599.017 327.128 598.977 327.669 598.937 328.149H578.64C578.841 329.991 579.701 331.452 581.223 332.533C582.744 333.614 584.786 334.154 587.348 334.154C588.989 334.154 590.59 334.014 592.152 333.734C593.753 333.414 595.054 333.033 596.055 332.593L597.256 339.859C596.776 340.099 596.135 340.339 595.334 340.58C594.534 340.82 593.633 341.02 592.632 341.18C591.671 341.38 590.63 341.54 589.509 341.661C588.389 341.781 587.268 341.841 586.147 341.841C583.304 341.841 580.822 341.42 578.7 340.58C576.619 339.739 574.877 338.598 573.476 337.157C572.115 335.676 571.094 333.934 570.414 331.932C569.773 329.931 569.453 327.769 569.453 325.447ZM590.47 322.024C590.43 321.264 590.29 320.523 590.05 319.802C589.85 319.082 589.509 318.441 589.029 317.881C588.589 317.32 588.008 316.86 587.288 316.5C586.607 316.139 585.746 315.959 584.705 315.959C583.705 315.959 582.844 316.139 582.123 316.5C581.403 316.82 580.802 317.26 580.322 317.821C579.841 318.381 579.461 319.042 579.181 319.802C578.941 320.523 578.761 321.264 578.64 322.024H590.47ZM615.991 333.374C616.431 333.414 616.931 333.454 617.492 333.494C618.092 333.494 618.793 333.494 619.594 333.494C624.277 333.494 627.74 332.313 629.982 329.951C632.264 327.589 633.405 324.326 633.405 320.163C633.405 315.799 632.324 312.496 630.162 310.254C628.001 308.013 624.578 306.892 619.894 306.892C619.253 306.892 618.593 306.912 617.912 306.952C617.232 306.952 616.591 306.992 615.991 307.072V333.374ZM643.073 320.163C643.073 323.766 642.513 326.908 641.392 329.59C640.271 332.273 638.669 334.495 636.588 336.256C634.546 338.018 632.044 339.339 629.081 340.219C626.119 341.1 622.796 341.54 619.113 341.54C617.432 341.54 615.47 341.46 613.228 341.3C610.986 341.18 608.785 340.9 606.623 340.46V299.926C608.785 299.525 611.026 299.265 613.348 299.145C615.71 298.985 617.732 298.905 619.413 298.905C622.976 298.905 626.199 299.305 629.081 300.106C632.004 300.907 634.506 302.168 636.588 303.889C638.669 305.611 640.271 307.812 641.392 310.495C642.513 313.177 643.073 316.4 643.073 320.163ZM648.796 325.447C648.796 322.645 649.217 320.203 650.057 318.121C650.938 315.999 652.079 314.238 653.48 312.837C654.881 311.435 656.483 310.374 658.284 309.654C660.126 308.933 662.007 308.573 663.929 308.573C668.413 308.573 671.955 309.954 674.558 312.716C677.16 315.439 678.461 319.462 678.461 324.786C678.461 325.307 678.441 325.887 678.401 326.528C678.361 327.128 678.321 327.669 678.281 328.149H657.984C658.184 329.991 659.045 331.452 660.566 332.533C662.087 333.614 664.129 334.154 666.691 334.154C668.332 334.154 669.934 334.014 671.495 333.734C673.096 333.414 674.398 333.033 675.398 332.593L676.599 339.859C676.119 340.099 675.478 340.339 674.678 340.58C673.877 340.82 672.976 341.02 671.975 341.18C671.015 341.38 669.974 341.54 668.853 341.661C667.732 341.781 666.611 341.841 665.49 341.841C662.648 341.841 660.166 341.42 658.044 340.58C655.962 339.739 654.221 338.598 652.82 337.157C651.458 335.676 650.438 333.934 649.757 331.932C649.116 329.931 648.796 327.769 648.796 325.447ZM669.814 322.024C669.774 321.264 669.634 320.523 669.393 319.802C669.193 319.082 668.853 318.441 668.372 317.881C667.932 317.32 667.352 316.86 666.631 316.5C665.95 316.139 665.09 315.959 664.049 315.959C663.048 315.959 662.187 316.139 661.467 316.5C660.746 316.82 660.146 317.26 659.665 317.821C659.185 318.381 658.805 319.042 658.524 319.802C658.284 320.523 658.104 321.264 657.984 322.024H669.814ZM685.065 301.547L694.013 300.106V309.414H704.762V316.86H694.013V327.969C694.013 329.851 694.333 331.352 694.974 332.473C695.654 333.594 696.995 334.154 698.997 334.154C699.958 334.154 700.939 334.074 701.94 333.914C702.98 333.714 703.921 333.454 704.762 333.133L706.023 340.099C704.942 340.54 703.741 340.92 702.42 341.24C701.099 341.56 699.477 341.721 697.556 341.721C695.114 341.721 693.092 341.4 691.491 340.76C689.889 340.079 688.608 339.158 687.648 337.997C686.687 336.796 686.006 335.355 685.606 333.674C685.246 331.992 685.065 330.131 685.065 328.089V301.547ZM709.374 325.447C709.374 322.645 709.794 320.203 710.635 318.121C711.516 315.999 712.657 314.238 714.058 312.837C715.459 311.435 717.06 310.374 718.862 309.654C720.703 308.933 722.585 308.573 724.507 308.573C728.99 308.573 732.533 309.954 735.135 312.716C737.738 315.439 739.039 319.462 739.039 324.786C739.039 325.307 739.019 325.887 738.979 326.528C738.939 327.128 738.899 327.669 738.859 328.149H718.562C718.762 329.991 719.623 331.452 721.144 332.533C722.665 333.614 724.707 334.154 727.269 334.154C728.91 334.154 730.512 334.014 732.073 333.734C733.674 333.414 734.975 333.033 735.976 332.593L737.177 339.859C736.697 340.099 736.056 340.339 735.256 340.58C734.455 340.82 733.554 341.02 732.553 341.18C731.592 341.38 730.552 341.54 729.431 341.661C728.31 341.781 727.189 341.841 726.068 341.841C723.226 341.841 720.743 341.42 718.622 340.58C716.54 339.739 714.798 338.598 713.397 337.157C712.036 335.676 711.015 333.934 710.335 331.932C709.694 329.931 709.374 327.769 709.374 325.447ZM730.391 322.024C730.351 321.264 730.211 320.523 729.971 319.802C729.771 319.082 729.431 318.441 728.95 317.881C728.51 317.32 727.929 316.86 727.209 316.5C726.528 316.139 725.668 315.959 724.627 315.959C723.626 315.959 722.765 316.139 722.045 316.5C721.324 316.82 720.723 317.26 720.243 317.821C719.763 318.381 719.382 319.042 719.102 319.802C718.862 320.523 718.682 321.264 718.562 322.024H730.391ZM744.442 325.207C744.442 322.925 744.803 320.783 745.523 318.781C746.284 316.74 747.365 314.978 748.766 313.497C750.167 311.976 751.868 310.775 753.87 309.894C755.872 309.013 758.154 308.573 760.716 308.573C762.397 308.573 763.938 308.733 765.34 309.053C766.741 309.334 768.102 309.754 769.423 310.314L767.561 317.46C766.721 317.14 765.8 316.86 764.799 316.62C763.798 316.379 762.677 316.259 761.436 316.259C758.794 316.259 756.813 317.08 755.491 318.721C754.21 320.363 753.57 322.525 753.57 325.207C753.57 328.049 754.17 330.251 755.371 331.812C756.612 333.374 758.754 334.154 761.797 334.154C762.878 334.154 764.039 334.054 765.28 333.854C766.521 333.654 767.662 333.334 768.702 332.893L769.963 340.219C768.923 340.66 767.622 341.04 766.06 341.36C764.499 341.681 762.778 341.841 760.896 341.841C758.014 341.841 755.531 341.42 753.45 340.58C751.368 339.699 749.647 338.518 748.285 337.037C746.964 335.555 745.984 333.814 745.343 331.812C744.742 329.771 744.442 327.569 744.442 325.207ZM775.668 301.547L784.616 300.106V309.414H795.365V316.86H784.616V327.969C784.616 329.851 784.936 331.352 785.577 332.473C786.257 333.594 787.598 334.154 789.6 334.154C790.561 334.154 791.541 334.074 792.542 333.914C793.583 333.714 794.524 333.454 795.365 333.133L796.626 340.099C795.545 340.54 794.344 340.92 793.023 341.24C791.702 341.56 790.08 341.721 788.159 341.721C785.717 341.721 783.695 341.4 782.094 340.76C780.492 340.079 779.211 339.158 778.25 337.997C777.29 336.796 776.609 335.355 776.209 333.674C775.848 331.992 775.668 330.131 775.668 328.089V301.547ZM264.78 375C264.463 374.158 264.163 373.336 263.883 372.532C263.602 371.709 263.312 370.877 263.013 370.035H254.206L252.438 375H249.605C250.353 372.943 251.055 371.045 251.709 369.306C252.364 367.548 252.999 365.884 253.617 364.313C254.252 362.742 254.879 361.246 255.496 359.825C256.113 358.385 256.758 356.964 257.431 355.561H259.928C260.601 356.964 261.246 358.385 261.863 359.825C262.48 361.246 263.097 362.742 263.715 364.313C264.35 365.884 264.995 367.548 265.65 369.306C266.304 371.045 267.006 372.943 267.754 375H264.78ZM262.228 367.791C261.629 366.164 261.031 364.593 260.433 363.079C259.853 361.545 259.245 360.077 258.609 358.675C257.955 360.077 257.328 361.545 256.73 363.079C256.15 364.593 255.571 366.164 254.991 367.791H262.228ZM281.426 374.579C280.828 374.729 280.033 374.888 279.042 375.056C278.07 375.224 276.938 375.309 275.648 375.309C274.526 375.309 273.582 375.15 272.815 374.832C272.048 374.495 271.431 374.028 270.964 373.429C270.496 372.831 270.16 372.13 269.954 371.325C269.748 370.503 269.645 369.596 269.645 368.605V360.414H272.254V368.044C272.254 369.82 272.534 371.092 273.095 371.858C273.656 372.625 274.601 373.008 275.929 373.008C276.209 373.008 276.499 372.999 276.798 372.98C277.097 372.962 277.378 372.943 277.64 372.924C277.901 372.887 278.135 372.859 278.341 372.84C278.565 372.803 278.724 372.765 278.818 372.728V360.414H281.426V374.579ZM288.361 360.414H293.887V362.602H288.361V369.334C288.361 370.063 288.417 370.671 288.529 371.157C288.641 371.625 288.81 371.999 289.034 372.279C289.258 372.541 289.539 372.728 289.876 372.84C290.212 372.952 290.605 373.008 291.054 373.008C291.839 373.008 292.465 372.924 292.933 372.756C293.419 372.569 293.756 372.438 293.943 372.363L294.448 374.523C294.186 374.654 293.728 374.813 293.073 375C292.419 375.206 291.671 375.309 290.829 375.309C289.838 375.309 289.015 375.187 288.361 374.944C287.725 374.682 287.211 374.299 286.818 373.794C286.425 373.289 286.145 372.672 285.977 371.943C285.827 371.195 285.752 370.334 285.752 369.362V356.347L288.361 355.898V360.414ZM309.698 367.707C309.698 368.866 309.529 369.914 309.193 370.849C308.856 371.784 308.379 372.588 307.762 373.261C307.164 373.934 306.444 374.458 305.602 374.832C304.761 375.187 303.845 375.365 302.853 375.365C301.862 375.365 300.946 375.187 300.105 374.832C299.263 374.458 298.534 373.934 297.917 373.261C297.318 372.588 296.851 371.784 296.514 370.849C296.178 369.914 296.009 368.866 296.009 367.707C296.009 366.566 296.178 365.528 296.514 364.593C296.851 363.64 297.318 362.826 297.917 362.153C298.534 361.48 299.263 360.966 300.105 360.61C300.946 360.236 301.862 360.049 302.853 360.049C303.845 360.049 304.761 360.236 305.602 360.61C306.444 360.966 307.164 361.48 307.762 362.153C308.379 362.826 308.856 363.64 309.193 364.593C309.529 365.528 309.698 366.566 309.698 367.707ZM306.977 367.707C306.977 366.061 306.603 364.762 305.855 363.808C305.126 362.836 304.125 362.349 302.853 362.349C301.582 362.349 300.572 362.836 299.824 363.808C299.095 364.762 298.73 366.061 298.73 367.707C298.73 369.353 299.095 370.662 299.824 371.634C300.572 372.588 301.582 373.065 302.853 373.065C304.125 373.065 305.126 372.588 305.855 371.634C306.603 370.662 306.977 369.353 306.977 367.707ZM313.368 360.835C313.966 360.685 314.752 360.526 315.724 360.358C316.715 360.19 317.856 360.105 319.146 360.105C320.081 360.105 320.867 360.236 321.502 360.498C322.138 360.741 322.671 361.106 323.101 361.592C323.232 361.499 323.438 361.368 323.718 361.199C323.999 361.031 324.345 360.872 324.756 360.723C325.168 360.554 325.626 360.414 326.131 360.302C326.635 360.171 327.178 360.105 327.757 360.105C328.879 360.105 329.796 360.274 330.506 360.61C331.217 360.928 331.769 361.386 332.161 361.985C332.573 362.583 332.844 363.294 332.975 364.117C333.124 364.939 333.199 365.837 333.199 366.809V375H330.591V367.37C330.591 366.51 330.544 365.772 330.45 365.154C330.375 364.537 330.217 364.023 329.973 363.612C329.749 363.2 329.431 362.901 329.02 362.714C328.627 362.508 328.113 362.406 327.477 362.406C326.598 362.406 325.869 362.527 325.289 362.77C324.728 362.995 324.345 363.2 324.139 363.387C324.289 363.873 324.401 364.406 324.476 364.986C324.55 365.566 324.588 366.174 324.588 366.809V375H321.979V367.37C321.979 366.51 321.932 365.772 321.839 365.154C321.745 364.537 321.577 364.023 321.334 363.612C321.11 363.2 320.792 362.901 320.38 362.714C319.988 362.508 319.483 362.406 318.866 362.406C318.604 362.406 318.323 362.415 318.024 362.434C317.725 362.452 317.435 362.48 317.155 362.518C316.893 362.536 316.65 362.564 316.425 362.602C316.201 362.639 316.051 362.667 315.976 362.686V375H313.368V360.835ZM342.465 373.121C343.082 373.121 343.624 373.111 344.092 373.093C344.578 373.055 344.98 372.999 345.298 372.924V368.577C345.111 368.483 344.802 368.408 344.372 368.352C343.961 368.277 343.456 368.24 342.858 368.24C342.465 368.24 342.044 368.268 341.595 368.324C341.165 368.38 340.763 368.502 340.389 368.689C340.034 368.857 339.735 369.1 339.492 369.418C339.248 369.717 339.127 370.119 339.127 370.624C339.127 371.559 339.426 372.214 340.025 372.588C340.623 372.943 341.436 373.121 342.465 373.121ZM342.24 360.049C343.288 360.049 344.167 360.19 344.877 360.47C345.606 360.732 346.186 361.115 346.616 361.62C347.065 362.106 347.383 362.695 347.57 363.387C347.757 364.06 347.85 364.808 347.85 365.631V374.748C347.626 374.785 347.308 374.841 346.897 374.916C346.504 374.972 346.055 375.028 345.55 375.084C345.045 375.14 344.494 375.187 343.895 375.224C343.316 375.281 342.736 375.309 342.156 375.309C341.334 375.309 340.576 375.224 339.884 375.056C339.192 374.888 338.594 374.626 338.089 374.271C337.584 373.897 337.191 373.41 336.911 372.812C336.63 372.214 336.49 371.494 336.49 370.652C336.49 369.848 336.649 369.156 336.967 368.577C337.304 367.997 337.752 367.529 338.313 367.174C338.874 366.819 339.529 366.557 340.277 366.389C341.025 366.22 341.81 366.136 342.633 366.136C342.895 366.136 343.166 366.155 343.447 366.192C343.727 366.211 343.989 366.248 344.232 366.305C344.494 366.342 344.718 366.379 344.905 366.417C345.092 366.454 345.223 366.482 345.298 366.501V365.772C345.298 365.341 345.251 364.921 345.158 364.509C345.064 364.079 344.896 363.705 344.653 363.387C344.41 363.051 344.073 362.789 343.643 362.602C343.232 362.396 342.689 362.293 342.016 362.293C341.156 362.293 340.399 362.359 339.744 362.49C339.108 362.602 338.631 362.723 338.313 362.854L338.005 360.694C338.342 360.545 338.903 360.405 339.688 360.274C340.473 360.124 341.324 360.049 342.24 360.049ZM354.623 360.414H360.149V362.602H354.623V369.334C354.623 370.063 354.68 370.671 354.792 371.157C354.904 371.625 355.072 371.999 355.297 372.279C355.521 372.541 355.802 372.728 356.138 372.84C356.475 372.952 356.867 373.008 357.316 373.008C358.102 373.008 358.728 372.924 359.196 372.756C359.682 372.569 360.018 372.438 360.205 372.363L360.71 374.523C360.449 374.654 359.99 374.813 359.336 375C358.681 375.206 357.933 375.309 357.092 375.309C356.101 375.309 355.278 375.187 354.623 374.944C353.988 374.682 353.473 374.299 353.081 373.794C352.688 373.289 352.408 372.672 352.239 371.943C352.09 371.195 352.015 370.334 352.015 369.362V356.347L354.623 355.898V360.414ZM366.078 375H363.469V360.414H366.078V375ZM364.759 357.777C364.292 357.777 363.89 357.628 363.553 357.328C363.235 357.011 363.076 356.59 363.076 356.066C363.076 355.543 363.235 355.131 363.553 354.832C363.89 354.514 364.292 354.355 364.759 354.355C365.227 354.355 365.619 354.514 365.937 354.832C366.274 355.131 366.442 355.543 366.442 356.066C366.442 356.59 366.274 357.011 365.937 357.328C365.619 357.628 365.227 357.777 364.759 357.777ZM376.903 375.337C375.725 375.337 374.687 375.15 373.789 374.776C372.91 374.402 372.162 373.878 371.545 373.205C370.947 372.532 370.498 371.737 370.199 370.821C369.9 369.886 369.75 368.857 369.75 367.735C369.75 366.613 369.909 365.585 370.227 364.65C370.564 363.715 371.031 362.91 371.629 362.237C372.228 361.545 372.957 361.012 373.817 360.638C374.696 360.246 375.669 360.049 376.735 360.049C377.389 360.049 378.044 360.105 378.698 360.218C379.353 360.33 379.979 360.507 380.577 360.751L379.988 362.967C379.596 362.78 379.137 362.63 378.614 362.518C378.109 362.406 377.567 362.349 376.987 362.349C375.528 362.349 374.406 362.808 373.621 363.724C372.854 364.64 372.471 365.977 372.471 367.735C372.471 368.52 372.555 369.24 372.723 369.895C372.91 370.549 373.191 371.11 373.565 371.578C373.958 372.045 374.453 372.41 375.052 372.672C375.65 372.915 376.379 373.037 377.239 373.037C377.931 373.037 378.558 372.971 379.119 372.84C379.68 372.709 380.119 372.569 380.437 372.419L380.802 374.607C380.652 374.701 380.437 374.794 380.157 374.888C379.876 374.963 379.558 375.028 379.203 375.084C378.848 375.159 378.464 375.215 378.053 375.252C377.66 375.309 377.277 375.337 376.903 375.337ZM398.622 375.421C397.257 375.421 396.013 375.196 394.891 374.748C393.769 374.299 392.806 373.644 392.002 372.784C391.198 371.924 390.571 370.867 390.122 369.614C389.692 368.343 389.477 366.894 389.477 365.267C389.477 363.64 389.72 362.2 390.207 360.947C390.712 359.675 391.385 358.609 392.226 357.749C393.068 356.889 394.049 356.235 395.171 355.786C396.293 355.337 397.49 355.113 398.762 355.113C399.566 355.113 400.286 355.169 400.922 355.281C401.576 355.393 402.137 355.524 402.605 355.674C403.091 355.823 403.484 355.973 403.783 356.122C404.082 356.272 404.288 356.384 404.4 356.459L403.615 358.703C403.446 358.591 403.203 358.469 402.885 358.338C402.567 358.207 402.203 358.076 401.791 357.946C401.399 357.815 400.959 357.712 400.473 357.637C400.005 357.544 399.529 357.497 399.042 357.497C398.014 357.497 397.088 357.674 396.265 358.03C395.443 358.385 394.741 358.899 394.162 359.573C393.582 360.246 393.133 361.069 392.815 362.041C392.516 362.995 392.366 364.07 392.366 365.267C392.366 366.426 392.497 367.483 392.759 368.436C393.04 369.39 393.451 370.213 393.993 370.905C394.536 371.578 395.209 372.101 396.013 372.475C396.836 372.85 397.789 373.037 398.874 373.037C400.127 373.037 401.165 372.906 401.988 372.644C402.81 372.382 403.428 372.148 403.839 371.943L404.54 374.187C404.409 374.28 404.176 374.402 403.839 374.551C403.502 374.682 403.082 374.813 402.577 374.944C402.072 375.075 401.483 375.187 400.81 375.281C400.136 375.374 399.407 375.421 398.622 375.421ZM419.953 367.707C419.953 368.866 419.784 369.914 419.448 370.849C419.111 371.784 418.634 372.588 418.017 373.261C417.419 373.934 416.699 374.458 415.857 374.832C415.016 375.187 414.1 375.365 413.109 375.365C412.117 375.365 411.201 375.187 410.36 374.832C409.518 374.458 408.789 373.934 408.172 373.261C407.573 372.588 407.106 371.784 406.769 370.849C406.433 369.914 406.264 368.866 406.264 367.707C406.264 366.566 406.433 365.528 406.769 364.593C407.106 363.64 407.573 362.826 408.172 362.153C408.789 361.48 409.518 360.966 410.36 360.61C411.201 360.236 412.117 360.049 413.109 360.049C414.1 360.049 415.016 360.236 415.857 360.61C416.699 360.966 417.419 361.48 418.017 362.153C418.634 362.826 419.111 363.64 419.448 364.593C419.784 365.528 419.953 366.566 419.953 367.707ZM417.232 367.707C417.232 366.061 416.858 364.762 416.11 363.808C415.381 362.836 414.38 362.349 413.109 362.349C411.837 362.349 410.827 362.836 410.079 363.808C409.35 364.762 408.985 366.061 408.985 367.707C408.985 369.353 409.35 370.662 410.079 371.634C410.827 372.588 411.837 373.065 413.109 373.065C414.38 373.065 415.381 372.588 416.11 371.634C416.858 370.662 417.232 369.353 417.232 367.707ZM423.623 360.835C424.221 360.685 425.016 360.526 426.007 360.358C426.998 360.19 428.139 360.105 429.429 360.105C430.589 360.105 431.552 360.274 432.318 360.61C433.085 360.928 433.693 361.386 434.142 361.985C434.609 362.564 434.936 363.266 435.123 364.089C435.31 364.911 435.404 365.818 435.404 366.809V375H432.795V367.37C432.795 366.473 432.73 365.706 432.599 365.07C432.487 364.435 432.29 363.92 432.01 363.528C431.729 363.135 431.355 362.854 430.888 362.686C430.42 362.499 429.841 362.406 429.149 362.406C428.868 362.406 428.578 362.415 428.279 362.434C427.98 362.452 427.69 362.48 427.41 362.518C427.148 362.536 426.905 362.564 426.68 362.602C426.475 362.639 426.325 362.667 426.232 362.686V375H423.623V360.835ZM438.916 367.735C438.916 366.445 439.103 365.323 439.477 364.369C439.851 363.397 440.347 362.593 440.964 361.957C441.581 361.321 442.292 360.844 443.096 360.526C443.9 360.208 444.723 360.049 445.564 360.049C447.528 360.049 449.033 360.666 450.08 361.901C451.127 363.116 451.651 364.977 451.651 367.483C451.651 367.595 451.651 367.744 451.651 367.931C451.651 368.1 451.642 368.259 451.623 368.408H441.637C441.749 369.923 442.189 371.073 442.956 371.858C443.722 372.644 444.919 373.037 446.546 373.037C447.462 373.037 448.229 372.962 448.846 372.812C449.482 372.644 449.959 372.485 450.277 372.335L450.641 374.523C450.323 374.691 449.762 374.869 448.958 375.056C448.173 375.243 447.275 375.337 446.265 375.337C444.994 375.337 443.891 375.15 442.956 374.776C442.039 374.383 441.282 373.85 440.683 373.177C440.085 372.504 439.636 371.709 439.337 370.792C439.057 369.858 438.916 368.838 438.916 367.735ZM448.93 366.305C448.949 365.126 448.65 364.163 448.033 363.415C447.434 362.649 446.602 362.265 445.536 362.265C444.938 362.265 444.405 362.387 443.937 362.63C443.488 362.854 443.105 363.154 442.787 363.528C442.469 363.902 442.217 364.332 442.03 364.818C441.862 365.304 441.749 365.8 441.693 366.305H448.93ZM467.22 355.365C469.95 355.365 472.044 355.889 473.503 356.936C474.98 357.964 475.719 359.507 475.719 361.564C475.719 362.686 475.513 363.649 475.102 364.453C474.709 365.239 474.13 365.884 473.363 366.389C472.615 366.875 471.699 367.23 470.614 367.455C469.529 367.679 468.304 367.791 466.939 367.791H464.78V375H462.059V355.842C462.825 355.655 463.676 355.533 464.611 355.477C465.565 355.402 466.434 355.365 467.22 355.365ZM467.444 357.749C466.285 357.749 465.397 357.777 464.78 357.833V365.463H466.827C467.762 365.463 468.604 365.407 469.352 365.295C470.1 365.164 470.726 364.958 471.231 364.678C471.755 364.378 472.157 363.976 472.437 363.471C472.718 362.967 472.858 362.321 472.858 361.536C472.858 360.788 472.708 360.171 472.409 359.685C472.129 359.198 471.736 358.815 471.231 358.535C470.745 358.235 470.174 358.03 469.52 357.918C468.865 357.805 468.174 357.749 467.444 357.749ZM478.956 375V353.682L481.565 353.233V360.694C482.051 360.507 482.565 360.367 483.107 360.274C483.668 360.162 484.22 360.105 484.762 360.105C485.922 360.105 486.885 360.274 487.651 360.61C488.418 360.928 489.026 361.386 489.475 361.985C489.942 362.564 490.269 363.266 490.456 364.089C490.643 364.911 490.737 365.818 490.737 366.809V375H488.128V367.37C488.128 366.473 488.063 365.706 487.932 365.07C487.82 364.435 487.623 363.92 487.343 363.528C487.062 363.135 486.688 362.854 486.221 362.686C485.753 362.499 485.174 362.406 484.482 362.406C484.201 362.406 483.911 362.424 483.612 362.462C483.313 362.499 483.023 362.546 482.743 362.602C482.481 362.639 482.238 362.686 482.013 362.742C481.808 362.798 481.658 362.845 481.565 362.882V375H478.956ZM507.856 367.707C507.856 368.866 507.687 369.914 507.351 370.849C507.014 371.784 506.537 372.588 505.92 373.261C505.322 373.934 504.602 374.458 503.76 374.832C502.919 375.187 502.002 375.365 501.011 375.365C500.02 375.365 499.104 375.187 498.262 374.832C497.421 374.458 496.692 373.934 496.075 373.261C495.476 372.588 495.009 371.784 494.672 370.849C494.335 369.914 494.167 368.866 494.167 367.707C494.167 366.566 494.335 365.528 494.672 364.593C495.009 363.64 495.476 362.826 496.075 362.153C496.692 361.48 497.421 360.966 498.262 360.61C499.104 360.236 500.02 360.049 501.011 360.049C502.002 360.049 502.919 360.236 503.76 360.61C504.602 360.966 505.322 361.48 505.92 362.153C506.537 362.826 507.014 363.64 507.351 364.593C507.687 365.528 507.856 366.566 507.856 367.707ZM505.135 367.707C505.135 366.061 504.761 364.762 504.013 363.808C503.283 362.836 502.283 362.349 501.011 362.349C499.74 362.349 498.73 362.836 497.982 363.808C497.253 364.762 496.888 366.061 496.888 367.707C496.888 369.353 497.253 370.662 497.982 371.634C498.73 372.588 499.74 373.065 501.011 373.065C502.283 373.065 503.283 372.588 504.013 371.634C504.761 370.662 505.135 369.353 505.135 367.707ZM513.966 360.414H519.492V362.602H513.966V369.334C513.966 370.063 514.022 370.671 514.134 371.157C514.247 371.625 514.415 371.999 514.639 372.279C514.864 372.541 515.144 372.728 515.481 372.84C515.817 372.952 516.21 373.008 516.659 373.008C517.444 373.008 518.071 372.924 518.538 372.756C519.024 372.569 519.361 372.438 519.548 372.363L520.053 374.523C519.791 374.654 519.333 374.813 518.678 375C518.024 375.206 517.276 375.309 516.434 375.309C515.443 375.309 514.621 375.187 513.966 374.944C513.33 374.682 512.816 374.299 512.423 373.794C512.031 373.289 511.75 372.672 511.582 371.943C511.432 371.195 511.357 370.334 511.357 369.362V356.347L513.966 355.898V360.414ZM535.303 367.707C535.303 368.866 535.135 369.914 534.798 370.849C534.461 371.784 533.985 372.588 533.367 373.261C532.769 373.934 532.049 374.458 531.208 374.832C530.366 375.187 529.45 375.365 528.459 375.365C527.468 375.365 526.551 375.187 525.71 374.832C524.868 374.458 524.139 373.934 523.522 373.261C522.924 372.588 522.456 371.784 522.119 370.849C521.783 369.914 521.615 368.866 521.615 367.707C521.615 366.566 521.783 365.528 522.119 364.593C522.456 363.64 522.924 362.826 523.522 362.153C524.139 361.48 524.868 360.966 525.71 360.61C526.551 360.236 527.468 360.049 528.459 360.049C529.45 360.049 530.366 360.236 531.208 360.61C532.049 360.966 532.769 361.48 533.367 362.153C533.985 362.826 534.461 363.64 534.798 364.593C535.135 365.528 535.303 366.566 535.303 367.707ZM532.582 367.707C532.582 366.061 532.208 364.762 531.46 363.808C530.731 362.836 529.73 362.349 528.459 362.349C527.187 362.349 526.177 362.836 525.429 363.808C524.7 364.762 524.335 366.061 524.335 367.707C524.335 369.353 524.7 370.662 525.429 371.634C526.177 372.588 527.187 373.065 528.459 373.065C529.73 373.065 530.731 372.588 531.46 371.634C532.208 370.662 532.582 369.353 532.582 367.707ZM544.359 360.105C544.583 360.105 544.836 360.124 545.116 360.162C545.415 360.18 545.705 360.218 545.986 360.274C546.266 360.311 546.519 360.358 546.743 360.414C546.986 360.451 547.164 360.489 547.276 360.526L546.827 362.798C546.621 362.723 546.275 362.639 545.789 362.546C545.322 362.434 544.714 362.377 543.966 362.377C543.48 362.377 542.994 362.434 542.507 362.546C542.04 362.639 541.731 362.705 541.582 362.742V375H538.973V361.031C539.59 360.807 540.357 360.601 541.273 360.414C542.189 360.208 543.218 360.105 544.359 360.105ZM548.98 367.735C548.98 366.445 549.167 365.323 549.541 364.369C549.915 363.397 550.41 362.593 551.027 361.957C551.644 361.321 552.355 360.844 553.159 360.526C553.963 360.208 554.786 360.049 555.628 360.049C557.591 360.049 559.096 360.666 560.144 361.901C561.191 363.116 561.714 364.977 561.714 367.483C561.714 367.595 561.714 367.744 561.714 367.931C561.714 368.1 561.705 368.259 561.686 368.408H551.701C551.813 369.923 552.252 371.073 553.019 371.858C553.786 372.644 554.982 373.037 556.609 373.037C557.526 373.037 558.292 372.962 558.909 372.812C559.545 372.644 560.022 372.485 560.34 372.335L560.705 374.523C560.387 374.691 559.826 374.869 559.022 375.056C558.236 375.243 557.339 375.337 556.329 375.337C555.057 375.337 553.954 375.15 553.019 374.776C552.103 374.383 551.345 373.85 550.747 373.177C550.148 372.504 549.7 371.709 549.4 370.792C549.12 369.858 548.98 368.838 548.98 367.735ZM558.994 366.305C559.012 365.126 558.713 364.163 558.096 363.415C557.498 362.649 556.665 362.265 555.6 362.265C555.001 362.265 554.468 362.387 554.001 362.63C553.552 362.854 553.169 363.154 552.851 363.528C552.533 363.902 552.28 364.332 552.093 364.818C551.925 365.304 551.813 365.8 551.757 366.305H558.994ZM571.801 375.337C570.623 375.337 569.585 375.15 568.687 374.776C567.809 374.402 567.061 373.878 566.443 373.205C565.845 372.532 565.396 371.737 565.097 370.821C564.798 369.886 564.648 368.857 564.648 367.735C564.648 366.613 564.807 365.585 565.125 364.65C565.462 363.715 565.929 362.91 566.528 362.237C567.126 361.545 567.855 361.012 568.716 360.638C569.594 360.246 570.567 360.049 571.633 360.049C572.287 360.049 572.942 360.105 573.596 360.218C574.251 360.33 574.877 360.507 575.476 360.751L574.887 362.967C574.494 362.78 574.036 362.63 573.512 362.518C573.007 362.406 572.465 362.349 571.885 362.349C570.427 362.349 569.305 362.808 568.519 363.724C567.752 364.64 567.369 365.977 567.369 367.735C567.369 368.52 567.453 369.24 567.622 369.895C567.809 370.549 568.089 371.11 568.463 371.578C568.856 372.045 569.351 372.41 569.95 372.672C570.548 372.915 571.277 373.037 572.138 373.037C572.83 373.037 573.456 372.971 574.017 372.84C574.578 372.709 575.017 372.569 575.335 372.419L575.7 374.607C575.55 374.701 575.335 374.794 575.055 374.888C574.774 374.963 574.456 375.028 574.101 375.084C573.746 375.159 573.362 375.215 572.951 375.252C572.558 375.309 572.175 375.337 571.801 375.337ZM577.687 367.735C577.687 366.445 577.874 365.323 578.248 364.369C578.622 363.397 579.118 362.593 579.735 361.957C580.352 361.321 581.062 360.844 581.867 360.526C582.671 360.208 583.493 360.049 584.335 360.049C586.298 360.049 587.804 360.666 588.851 361.901C589.898 363.116 590.422 364.977 590.422 367.483C590.422 367.595 590.422 367.744 590.422 367.931C590.422 368.1 590.412 368.259 590.394 368.408H580.408C580.52 369.923 580.96 371.073 581.726 371.858C582.493 372.644 583.69 373.037 585.317 373.037C586.233 373.037 587 372.962 587.617 372.812C588.253 372.644 588.729 372.485 589.047 372.335L589.412 374.523C589.094 374.691 588.533 374.869 587.729 375.056C586.944 375.243 586.046 375.337 585.036 375.337C583.765 375.337 582.661 375.15 581.726 374.776C580.81 374.383 580.053 373.85 579.454 373.177C578.856 372.504 578.407 371.709 578.108 370.792C577.827 369.858 577.687 368.838 577.687 367.735ZM587.701 366.305C587.72 365.126 587.42 364.163 586.803 363.415C586.205 362.649 585.373 362.265 584.307 362.265C583.709 362.265 583.176 362.387 582.708 362.63C582.259 362.854 581.876 363.154 581.558 363.528C581.24 363.902 580.988 364.332 580.801 364.818C580.632 365.304 580.52 365.8 580.464 366.305H587.701ZM604.295 367.735C604.295 366.033 603.874 364.724 603.033 363.808C602.191 362.892 601.069 362.434 599.667 362.434C598.882 362.434 598.264 362.462 597.816 362.518C597.386 362.574 597.04 362.639 596.778 362.714V371.914C597.096 372.176 597.554 372.429 598.152 372.672C598.751 372.915 599.405 373.037 600.116 373.037C600.864 373.037 601.5 372.906 602.023 372.644C602.565 372.363 603.005 371.989 603.341 371.522C603.678 371.036 603.921 370.475 604.071 369.839C604.22 369.184 604.295 368.483 604.295 367.735ZM607.016 367.735C607.016 368.838 606.866 369.858 606.567 370.792C606.287 371.728 605.866 372.532 605.305 373.205C604.744 373.878 604.052 374.402 603.229 374.776C602.425 375.15 601.5 375.337 600.452 375.337C599.611 375.337 598.863 375.224 598.208 375C597.573 374.776 597.096 374.561 596.778 374.355V380.189H594.169V360.863C594.786 360.713 595.553 360.554 596.469 360.386C597.404 360.199 598.479 360.105 599.695 360.105C600.817 360.105 601.827 360.283 602.724 360.638C603.622 360.994 604.389 361.499 605.024 362.153C605.66 362.808 606.146 363.612 606.483 364.565C606.838 365.5 607.016 366.557 607.016 367.735ZM613.127 360.414H618.653V362.602H613.127V369.334C613.127 370.063 613.183 370.671 613.296 371.157C613.408 371.625 613.576 371.999 613.8 372.279C614.025 372.541 614.305 372.728 614.642 372.84C614.979 372.952 615.371 373.008 615.82 373.008C616.605 373.008 617.232 372.924 617.699 372.756C618.186 372.569 618.522 372.438 618.709 372.363L619.214 374.523C618.952 374.654 618.494 374.813 617.84 375C617.185 375.206 616.437 375.309 615.596 375.309C614.605 375.309 613.782 375.187 613.127 374.944C612.491 374.682 611.977 374.299 611.584 373.794C611.192 373.289 610.911 372.672 610.743 371.943C610.593 371.195 610.519 370.334 610.519 369.362V356.347L613.127 355.898V360.414ZM634.464 367.707C634.464 368.866 634.296 369.914 633.959 370.849C633.623 371.784 633.146 372.588 632.529 373.261C631.93 373.934 631.21 374.458 630.369 374.832C629.527 375.187 628.611 375.365 627.62 375.365C626.629 375.365 625.712 375.187 624.871 374.832C624.029 374.458 623.3 373.934 622.683 373.261C622.085 372.588 621.617 371.784 621.281 370.849C620.944 369.914 620.776 368.866 620.776 367.707C620.776 366.566 620.944 365.528 621.281 364.593C621.617 363.64 622.085 362.826 622.683 362.153C623.3 361.48 624.029 360.966 624.871 360.61C625.712 360.236 626.629 360.049 627.62 360.049C628.611 360.049 629.527 360.236 630.369 360.61C631.21 360.966 631.93 361.48 632.529 362.153C633.146 362.826 633.623 363.64 633.959 364.593C634.296 365.528 634.464 366.566 634.464 367.707ZM631.743 367.707C631.743 366.061 631.369 364.762 630.621 363.808C629.892 362.836 628.891 362.349 627.62 362.349C626.348 362.349 625.338 362.836 624.59 363.808C623.861 364.762 623.496 366.061 623.496 367.707C623.496 369.353 623.861 370.662 624.59 371.634C625.338 372.588 626.348 373.065 627.62 373.065C628.891 373.065 629.892 372.588 630.621 371.634C631.369 370.662 631.743 369.353 631.743 367.707ZM643.52 360.105C643.744 360.105 643.997 360.124 644.277 360.162C644.576 360.18 644.866 360.218 645.147 360.274C645.427 360.311 645.68 360.358 645.904 360.414C646.147 360.451 646.325 360.489 646.437 360.526L645.988 362.798C645.783 362.723 645.437 362.639 644.95 362.546C644.483 362.434 643.875 362.377 643.127 362.377C642.641 362.377 642.155 362.434 641.669 362.546C641.201 362.639 640.892 362.705 640.743 362.742V375H638.134V361.031C638.751 360.807 639.518 360.601 640.434 360.414C641.351 360.208 642.379 360.105 643.52 360.105ZM671.575 365.267C671.575 366.95 671.313 368.418 670.79 369.67C670.266 370.905 669.527 371.933 668.574 372.756C667.62 373.56 666.479 374.168 665.152 374.579C663.824 374.972 662.365 375.168 660.776 375.168C659.99 375.168 659.121 375.131 658.167 375.056C657.232 375 656.381 374.878 655.615 374.691V355.842C656.381 355.655 657.232 355.533 658.167 355.477C659.121 355.402 659.99 355.365 660.776 355.365C662.365 355.365 663.824 355.571 665.152 355.982C666.479 356.375 667.62 356.983 668.574 357.805C669.527 358.609 670.266 359.638 670.79 360.891C671.313 362.125 671.575 363.584 671.575 365.267ZM661 372.784C663.581 372.784 665.507 372.13 666.779 370.821C668.05 369.493 668.686 367.642 668.686 365.267C668.686 362.892 668.05 361.05 666.779 359.741C665.507 358.413 663.581 357.749 661 357.749C660.234 357.749 659.635 357.759 659.205 357.777C658.794 357.796 658.504 357.815 658.335 357.833V372.7C658.504 372.719 658.794 372.737 659.205 372.756C659.635 372.775 660.234 372.784 661 372.784ZM674.629 367.735C674.629 366.445 674.816 365.323 675.19 364.369C675.564 363.397 676.06 362.593 676.677 361.957C677.294 361.321 678.005 360.844 678.809 360.526C679.613 360.208 680.436 360.049 681.277 360.049C683.241 360.049 684.746 360.666 685.793 361.901C686.841 363.116 687.364 364.977 687.364 367.483C687.364 367.595 687.364 367.744 687.364 367.931C687.364 368.1 687.355 368.259 687.336 368.408H677.35C677.463 369.923 677.902 371.073 678.669 371.858C679.435 372.644 680.632 373.037 682.259 373.037C683.175 373.037 683.942 372.962 684.559 372.812C685.195 372.644 685.672 372.485 685.99 372.335L686.354 374.523C686.036 374.691 685.475 374.869 684.671 375.056C683.886 375.243 682.988 375.337 681.979 375.337C680.707 375.337 679.604 375.15 678.669 374.776C677.752 374.383 676.995 373.85 676.397 373.177C675.798 372.504 675.349 371.709 675.05 370.792C674.77 369.858 674.629 368.838 674.629 367.735ZM684.643 366.305C684.662 365.126 684.363 364.163 683.746 363.415C683.147 362.649 682.315 362.265 681.249 362.265C680.651 362.265 680.118 362.387 679.65 362.63C679.202 362.854 678.818 363.154 678.5 363.528C678.182 363.902 677.93 364.332 677.743 364.818C677.575 365.304 677.463 365.8 677.406 366.305H684.643ZM693.552 360.414H699.078V362.602H693.552V369.334C693.552 370.063 693.608 370.671 693.72 371.157C693.832 371.625 694.001 371.999 694.225 372.279C694.449 372.541 694.73 372.728 695.067 372.84C695.403 372.952 695.796 373.008 696.245 373.008C697.03 373.008 697.656 372.924 698.124 372.756C698.61 372.569 698.947 372.438 699.134 372.363L699.639 374.523C699.377 374.654 698.919 374.813 698.264 375C697.61 375.206 696.862 375.309 696.02 375.309C695.029 375.309 694.206 375.187 693.552 374.944C692.916 374.682 692.402 374.299 692.009 373.794C691.616 373.289 691.336 372.672 691.168 371.943C691.018 371.195 690.943 370.334 690.943 369.362V356.347L693.552 355.898V360.414ZM701.31 367.735C701.31 366.445 701.497 365.323 701.871 364.369C702.245 363.397 702.74 362.593 703.357 361.957C703.975 361.321 704.685 360.844 705.489 360.526C706.293 360.208 707.116 360.049 707.958 360.049C709.921 360.049 711.427 360.666 712.474 361.901C713.521 363.116 714.045 364.977 714.045 367.483C714.045 367.595 714.045 367.744 714.045 367.931C714.045 368.1 714.035 368.259 714.016 368.408H704.031C704.143 369.923 704.582 371.073 705.349 371.858C706.116 372.644 707.313 373.037 708.939 373.037C709.856 373.037 710.622 372.962 711.24 372.812C711.875 372.644 712.352 372.485 712.67 372.335L713.035 374.523C712.717 374.691 712.156 374.869 711.352 375.056C710.566 375.243 709.669 375.337 708.659 375.337C707.387 375.337 706.284 375.15 705.349 374.776C704.433 374.383 703.675 373.85 703.077 373.177C702.479 372.504 702.03 371.709 701.731 370.792C701.45 369.858 701.31 368.838 701.31 367.735ZM711.324 366.305C711.342 365.126 711.043 364.163 710.426 363.415C709.828 362.649 708.996 362.265 707.93 362.265C707.331 362.265 706.798 362.387 706.331 362.63C705.882 362.854 705.499 363.154 705.181 363.528C704.863 363.902 704.61 364.332 704.423 364.818C704.255 365.304 704.143 365.8 704.087 366.305H711.324ZM724.131 375.337C722.953 375.337 721.915 375.15 721.018 374.776C720.139 374.402 719.391 373.878 718.774 373.205C718.175 372.532 717.726 371.737 717.427 370.821C717.128 369.886 716.978 368.857 716.978 367.735C716.978 366.613 717.137 365.585 717.455 364.65C717.792 363.715 718.259 362.91 718.858 362.237C719.456 361.545 720.185 361.012 721.046 360.638C721.925 360.246 722.897 360.049 723.963 360.049C724.617 360.049 725.272 360.105 725.926 360.218C726.581 360.33 727.207 360.507 727.806 360.751L727.217 362.967C726.824 362.78 726.366 362.63 725.842 362.518C725.337 362.406 724.795 362.349 724.215 362.349C722.757 362.349 721.635 362.808 720.849 363.724C720.083 364.64 719.699 365.977 719.699 367.735C719.699 368.52 719.783 369.24 719.952 369.895C720.139 370.549 720.419 371.11 720.793 371.578C721.186 372.045 721.681 372.41 722.28 372.672C722.878 372.915 723.608 373.037 724.468 373.037C725.16 373.037 725.786 372.971 726.347 372.84C726.908 372.709 727.348 372.569 727.665 372.419L728.03 374.607C727.88 374.701 727.665 374.794 727.385 374.888C727.104 374.963 726.787 375.028 726.431 375.084C726.076 375.159 725.693 375.215 725.281 375.252C724.888 375.309 724.505 375.337 724.131 375.337ZM733.271 360.414H738.797V362.602H733.271V369.334C733.271 370.063 733.327 370.671 733.439 371.157C733.552 371.625 733.72 371.999 733.944 372.279C734.169 372.541 734.449 372.728 734.786 372.84C735.122 372.952 735.515 373.008 735.964 373.008C736.749 373.008 737.376 372.924 737.843 372.756C738.329 372.569 738.666 372.438 738.853 372.363L739.358 374.523C739.096 374.654 738.638 374.813 737.983 375C737.329 375.206 736.581 375.309 735.739 375.309C734.748 375.309 733.926 375.187 733.271 374.944C732.635 374.682 732.121 374.299 731.728 373.794C731.336 373.289 731.055 372.672 730.887 371.943C730.737 371.195 730.662 370.334 730.662 369.362V356.347L733.271 355.898V360.414ZM744.725 375H742.116V360.414H744.725V375ZM743.407 357.777C742.939 357.777 742.537 357.628 742.201 357.328C741.883 357.011 741.724 356.59 741.724 356.066C741.724 355.543 741.883 355.131 742.201 354.832C742.537 354.514 742.939 354.355 743.407 354.355C743.874 354.355 744.267 354.514 744.585 354.832C744.921 355.131 745.09 355.543 745.09 356.066C745.09 356.59 744.921 357.011 744.585 357.328C744.267 357.628 743.874 357.777 743.407 357.777ZM762.086 367.707C762.086 368.866 761.918 369.914 761.581 370.849C761.245 371.784 760.768 372.588 760.151 373.261C759.552 373.934 758.832 374.458 757.991 374.832C757.149 375.187 756.233 375.365 755.242 375.365C754.251 375.365 753.335 375.187 752.493 374.832C751.652 374.458 750.922 373.934 750.305 373.261C749.707 372.588 749.239 371.784 748.903 370.849C748.566 369.914 748.398 368.866 748.398 367.707C748.398 366.566 748.566 365.528 748.903 364.593C749.239 363.64 749.707 362.826 750.305 362.153C750.922 361.48 751.652 360.966 752.493 360.61C753.335 360.236 754.251 360.049 755.242 360.049C756.233 360.049 757.149 360.236 757.991 360.61C758.832 360.966 759.552 361.48 760.151 362.153C760.768 362.826 761.245 363.64 761.581 364.593C761.918 365.528 762.086 366.566 762.086 367.707ZM759.365 367.707C759.365 366.061 758.991 364.762 758.243 363.808C757.514 362.836 756.514 362.349 755.242 362.349C753.97 362.349 752.961 362.836 752.213 363.808C751.483 364.762 751.119 366.061 751.119 367.707C751.119 369.353 751.483 370.662 752.213 371.634C752.961 372.588 753.97 373.065 755.242 373.065C756.514 373.065 757.514 372.588 758.243 371.634C758.991 370.662 759.365 369.353 759.365 367.707ZM765.756 360.835C766.355 360.685 767.149 360.526 768.14 360.358C769.132 360.19 770.272 360.105 771.563 360.105C772.722 360.105 773.685 360.274 774.452 360.61C775.218 360.928 775.826 361.386 776.275 361.985C776.742 362.564 777.07 363.266 777.257 364.089C777.444 364.911 777.537 365.818 777.537 366.809V375H774.929V367.37C774.929 366.473 774.863 365.706 774.732 365.07C774.62 364.435 774.424 363.92 774.143 363.528C773.863 363.135 773.489 362.854 773.021 362.686C772.554 362.499 771.974 362.406 771.282 362.406C771.002 362.406 770.712 362.415 770.413 362.434C770.113 362.452 769.823 362.48 769.543 362.518C769.281 362.536 769.038 362.564 768.814 362.602C768.608 362.639 768.458 362.667 768.365 362.686V375H765.756V360.835ZM405.116 387.233C405.882 387.233 406.537 387.289 407.079 387.401C407.64 387.514 408.033 387.617 408.257 387.71L407.78 389.954C407.556 389.842 407.238 389.739 406.827 389.645C406.415 389.533 405.91 389.477 405.312 389.477C404.097 389.477 403.246 389.814 402.76 390.487C402.273 391.142 402.03 392.03 402.03 393.152V394.414H407.64V396.602H402.03V409H399.422V393.096C399.422 391.226 399.88 389.786 400.796 388.776C401.712 387.747 403.152 387.233 405.116 387.233ZM423.117 401.707C423.117 402.866 422.948 403.914 422.612 404.849C422.275 405.784 421.798 406.588 421.181 407.261C420.583 407.934 419.863 408.458 419.021 408.832C418.18 409.187 417.264 409.365 416.272 409.365C415.281 409.365 414.365 409.187 413.524 408.832C412.682 408.458 411.953 407.934 411.336 407.261C410.737 406.588 410.27 405.784 409.933 404.849C409.597 403.914 409.428 402.866 409.428 401.707C409.428 400.566 409.597 399.528 409.933 398.593C410.27 397.64 410.737 396.826 411.336 396.153C411.953 395.48 412.682 394.966 413.524 394.61C414.365 394.236 415.281 394.049 416.272 394.049C417.264 394.049 418.18 394.236 419.021 394.61C419.863 394.966 420.583 395.48 421.181 396.153C421.798 396.826 422.275 397.64 422.612 398.593C422.948 399.528 423.117 400.566 423.117 401.707ZM420.396 401.707C420.396 400.061 420.022 398.762 419.274 397.808C418.544 396.836 417.544 396.349 416.272 396.349C415.001 396.349 413.991 396.836 413.243 397.808C412.514 398.762 412.149 400.061 412.149 401.707C412.149 403.353 412.514 404.662 413.243 405.634C413.991 406.588 415.001 407.065 416.272 407.065C417.544 407.065 418.544 406.588 419.274 405.634C420.022 404.662 420.396 403.353 420.396 401.707ZM432.172 394.105C432.397 394.105 432.649 394.124 432.93 394.162C433.229 394.18 433.519 394.218 433.799 394.274C434.08 394.311 434.332 394.358 434.557 394.414C434.8 394.451 434.977 394.489 435.09 394.526L434.641 396.798C434.435 396.723 434.089 396.639 433.603 396.546C433.135 396.434 432.528 396.377 431.78 396.377C431.293 396.377 430.807 396.434 430.321 396.546C429.854 396.639 429.545 396.705 429.395 396.742V409H426.787V395.031C427.404 394.807 428.171 394.601 429.087 394.414C430.003 394.208 431.032 394.105 432.172 394.105ZM457.254 409C456.936 408.158 456.637 407.336 456.357 406.532C456.076 405.709 455.786 404.877 455.487 404.035H446.679L444.912 409H442.079C442.827 406.943 443.529 405.045 444.183 403.306C444.838 401.548 445.473 399.884 446.09 398.313C446.726 396.742 447.353 395.246 447.97 393.825C448.587 392.385 449.232 390.964 449.905 389.561H452.402C453.075 390.964 453.72 392.385 454.337 393.825C454.954 395.246 455.571 396.742 456.188 398.313C456.824 399.884 457.469 401.548 458.124 403.306C458.778 405.045 459.48 406.943 460.228 409H457.254ZM454.702 401.791C454.103 400.164 453.505 398.593 452.907 397.079C452.327 395.545 451.719 394.077 451.083 392.675C450.429 394.077 449.802 395.545 449.204 397.079C448.624 398.593 448.045 400.164 447.465 401.791H454.702ZM461.561 399.267C461.561 397.602 461.804 396.134 462.29 394.863C462.795 393.591 463.468 392.535 464.31 391.693C465.17 390.833 466.161 390.188 467.283 389.758C468.424 389.328 469.63 389.113 470.902 389.113C472.154 389.113 473.333 389.328 474.436 389.758C475.558 390.188 476.54 390.833 477.381 391.693C478.223 392.535 478.886 393.591 479.373 394.863C479.878 396.134 480.13 397.602 480.13 399.267C480.13 400.931 479.878 402.399 479.373 403.67C478.886 404.942 478.223 406.008 477.381 406.868C476.54 407.71 475.558 408.345 474.436 408.776C473.333 409.206 472.154 409.421 470.902 409.421C469.63 409.421 468.424 409.206 467.283 408.776C466.161 408.345 465.17 407.71 464.31 406.868C463.468 406.008 462.795 404.942 462.29 403.67C461.804 402.399 461.561 400.931 461.561 399.267ZM464.422 399.267C464.422 400.445 464.572 401.52 464.871 402.492C465.17 403.446 465.591 404.26 466.133 404.933C466.694 405.606 467.367 406.13 468.153 406.504C468.957 406.859 469.854 407.037 470.845 407.037C471.837 407.037 472.725 406.859 473.51 406.504C474.296 406.13 474.959 405.606 475.502 404.933C476.063 404.26 476.493 403.446 476.792 402.492C477.091 401.52 477.241 400.445 477.241 399.267C477.241 398.089 477.091 397.023 476.792 396.069C476.493 395.097 476.063 394.274 475.502 393.601C474.959 392.927 474.296 392.413 473.51 392.058C472.725 391.684 471.837 391.497 470.845 391.497C469.854 391.497 468.957 391.684 468.153 392.058C467.367 392.413 466.694 392.927 466.133 393.601C465.591 394.274 465.17 395.097 464.871 396.069C464.572 397.023 464.422 398.089 464.422 399.267ZM482.495 399.379H489.424V401.819H482.495V399.379ZM492.56 409V389.561H504.285V391.89H495.281V397.752H503.275V400.052H495.281V409H492.56ZM507.626 389.561H510.347V409H507.626V389.561ZM514.374 399.267C514.374 397.602 514.617 396.134 515.103 394.863C515.608 393.591 516.281 392.535 517.123 391.693C517.983 390.833 518.974 390.188 520.096 389.758C521.237 389.328 522.443 389.113 523.714 389.113C524.967 389.113 526.145 389.328 527.249 389.758C528.371 390.188 529.352 390.833 530.194 391.693C531.035 392.535 531.699 393.591 532.186 394.863C532.69 396.134 532.943 397.602 532.943 399.267C532.943 400.931 532.69 402.399 532.186 403.67C531.699 404.942 531.035 406.008 530.194 406.868C529.352 407.71 528.371 408.345 527.249 408.776C526.145 409.206 524.967 409.421 523.714 409.421C522.443 409.421 521.237 409.206 520.096 408.776C518.974 408.345 517.983 407.71 517.123 406.868C516.281 406.008 515.608 404.942 515.103 403.67C514.617 402.399 514.374 400.931 514.374 399.267ZM517.235 399.267C517.235 400.445 517.384 401.52 517.684 402.492C517.983 403.446 518.404 404.26 518.946 404.933C519.507 405.606 520.18 406.13 520.966 406.504C521.77 406.859 522.667 407.037 523.658 407.037C524.649 407.037 525.538 406.859 526.323 406.504C527.108 406.13 527.772 405.606 528.315 404.933C528.876 404.26 529.306 403.446 529.605 402.492C529.904 401.52 530.054 400.445 530.054 399.267C530.054 398.089 529.904 397.023 529.605 396.069C529.306 395.097 528.876 394.274 528.315 393.601C527.772 392.927 527.108 392.413 526.323 392.058C525.538 391.684 524.649 391.497 523.658 391.497C522.667 391.497 521.77 391.684 520.966 392.058C520.18 392.413 519.507 392.927 518.946 393.601C518.404 394.274 517.983 395.097 517.684 396.069C517.384 397.023 517.235 398.089 517.235 399.267ZM543.483 389.561H546.204V409H543.483V389.561ZM550.848 394.835C551.446 394.685 552.232 394.526 553.204 394.358C554.195 394.19 555.336 394.105 556.626 394.105C557.561 394.105 558.346 394.236 558.982 394.498C559.618 394.741 560.151 395.106 560.581 395.592C560.712 395.499 560.918 395.368 561.198 395.199C561.479 395.031 561.825 394.872 562.236 394.723C562.647 394.554 563.106 394.414 563.611 394.302C564.115 394.171 564.658 394.105 565.237 394.105C566.359 394.105 567.276 394.274 567.986 394.61C568.697 394.928 569.249 395.386 569.641 395.985C570.053 396.583 570.324 397.294 570.455 398.117C570.604 398.939 570.679 399.837 570.679 400.809V409H568.07V401.37C568.07 400.51 568.024 399.772 567.93 399.154C567.855 398.537 567.696 398.023 567.453 397.612C567.229 397.2 566.911 396.901 566.5 396.714C566.107 396.508 565.593 396.406 564.957 396.406C564.078 396.406 563.349 396.527 562.769 396.77C562.208 396.995 561.825 397.2 561.619 397.387C561.769 397.873 561.881 398.406 561.956 398.986C562.03 399.566 562.068 400.174 562.068 400.809V409H559.459V401.37C559.459 400.51 559.412 399.772 559.319 399.154C559.225 398.537 559.057 398.023 558.814 397.612C558.59 397.2 558.272 396.901 557.86 396.714C557.468 396.508 556.963 396.406 556.346 396.406C556.084 396.406 555.803 396.415 555.504 396.434C555.205 396.452 554.915 396.48 554.635 396.518C554.373 396.536 554.13 396.564 553.905 396.602C553.681 396.639 553.531 396.667 553.456 396.686V409H550.848V394.835ZM579.945 407.121C580.562 407.121 581.104 407.111 581.572 407.093C582.058 407.055 582.46 406.999 582.778 406.924V402.577C582.591 402.483 582.282 402.408 581.852 402.352C581.441 402.277 580.936 402.24 580.338 402.24C579.945 402.24 579.524 402.268 579.075 402.324C578.645 402.38 578.243 402.502 577.869 402.689C577.514 402.857 577.215 403.1 576.972 403.418C576.728 403.717 576.607 404.119 576.607 404.624C576.607 405.559 576.906 406.214 577.504 406.588C578.103 406.943 578.916 407.121 579.945 407.121ZM579.72 394.049C580.768 394.049 581.647 394.19 582.357 394.47C583.086 394.732 583.666 395.115 584.096 395.62C584.545 396.106 584.863 396.695 585.05 397.387C585.237 398.06 585.33 398.808 585.33 399.631V408.748C585.106 408.785 584.788 408.841 584.377 408.916C583.984 408.972 583.535 409.028 583.03 409.084C582.525 409.14 581.974 409.187 581.375 409.224C580.796 409.281 580.216 409.309 579.636 409.309C578.813 409.309 578.056 409.224 577.364 409.056C576.672 408.888 576.074 408.626 575.569 408.271C575.064 407.897 574.671 407.41 574.391 406.812C574.11 406.214 573.97 405.494 573.97 404.652C573.97 403.848 574.129 403.156 574.447 402.577C574.784 401.997 575.232 401.529 575.793 401.174C576.354 400.819 577.009 400.557 577.757 400.389C578.505 400.22 579.29 400.136 580.113 400.136C580.375 400.136 580.646 400.155 580.927 400.192C581.207 400.211 581.469 400.248 581.712 400.305C581.974 400.342 582.198 400.379 582.385 400.417C582.572 400.454 582.703 400.482 582.778 400.501V399.772C582.778 399.341 582.731 398.921 582.638 398.509C582.544 398.079 582.376 397.705 582.133 397.387C581.89 397.051 581.553 396.789 581.123 396.602C580.712 396.396 580.169 396.293 579.496 396.293C578.636 396.293 577.878 396.359 577.224 396.49C576.588 396.602 576.111 396.723 575.793 396.854L575.485 394.694C575.821 394.545 576.382 394.405 577.168 394.274C577.953 394.124 578.804 394.049 579.72 394.049ZM598.807 407.541C598.583 407.691 598.143 407.887 597.489 408.13C596.853 408.355 596.105 408.467 595.245 408.467C594.366 408.467 593.534 408.327 592.749 408.046C591.982 407.766 591.309 407.336 590.729 406.756C590.149 406.158 589.691 405.419 589.354 404.54C589.018 403.661 588.85 402.614 588.85 401.398C588.85 400.333 589.009 399.36 589.326 398.481C589.644 397.584 590.102 396.817 590.701 396.181C591.318 395.527 592.066 395.022 592.945 394.666C593.824 394.292 594.815 394.105 595.918 394.105C597.134 394.105 598.19 394.199 599.088 394.386C600.004 394.554 600.771 394.713 601.388 394.863V407.878C601.388 410.122 600.808 411.749 599.649 412.759C598.489 413.769 596.732 414.273 594.375 414.273C593.459 414.273 592.59 414.199 591.767 414.049C590.963 413.899 590.261 413.722 589.663 413.516L590.14 411.244C590.663 411.45 591.299 411.627 592.047 411.777C592.814 411.945 593.609 412.029 594.432 412.029C595.984 412.029 597.096 411.721 597.769 411.104C598.461 410.487 598.807 409.505 598.807 408.158V407.541ZM598.779 396.714C598.517 396.639 598.162 396.574 597.713 396.518C597.283 396.443 596.694 396.406 595.946 396.406C594.544 396.406 593.459 396.864 592.692 397.78C591.944 398.696 591.57 399.912 591.57 401.426C591.57 402.268 591.673 402.988 591.879 403.586C592.103 404.185 592.393 404.68 592.749 405.073C593.123 405.466 593.543 405.756 594.011 405.943C594.497 406.13 594.993 406.223 595.497 406.223C596.189 406.223 596.825 406.13 597.405 405.943C597.985 405.737 598.443 405.503 598.779 405.241V396.714ZM605.066 401.735C605.066 400.445 605.253 399.323 605.627 398.369C606.001 397.397 606.497 396.593 607.114 395.957C607.731 395.321 608.441 394.844 609.245 394.526C610.05 394.208 610.872 394.049 611.714 394.049C613.677 394.049 615.183 394.666 616.23 395.901C617.277 397.116 617.801 398.977 617.801 401.483C617.801 401.595 617.801 401.744 617.801 401.931C617.801 402.1 617.791 402.259 617.773 402.408H607.787C607.899 403.923 608.338 405.073 609.105 405.858C609.872 406.644 611.069 407.037 612.696 407.037C613.612 407.037 614.379 406.962 614.996 406.812C615.631 406.644 616.108 406.485 616.426 406.335L616.791 408.523C616.473 408.691 615.912 408.869 615.108 409.056C614.322 409.243 613.425 409.337 612.415 409.337C611.143 409.337 610.04 409.15 609.105 408.776C608.189 408.383 607.432 407.85 606.833 407.177C606.235 406.504 605.786 405.709 605.487 404.792C605.206 403.858 605.066 402.838 605.066 401.735ZM615.08 400.305C615.099 399.126 614.799 398.163 614.182 397.415C613.584 396.649 612.752 396.265 611.686 396.265C611.087 396.265 610.554 396.387 610.087 396.63C609.638 396.854 609.255 397.154 608.937 397.528C608.619 397.902 608.367 398.332 608.18 398.818C608.011 399.304 607.899 399.8 607.843 400.305H615.08ZM624.942 407.121C626.008 407.121 626.793 406.98 627.298 406.7C627.822 406.419 628.084 405.971 628.084 405.353C628.084 404.718 627.831 404.213 627.326 403.839C626.821 403.465 625.989 403.044 624.83 402.577C624.269 402.352 623.727 402.128 623.203 401.903C622.698 401.66 622.259 401.38 621.885 401.062C621.511 400.744 621.211 400.361 620.987 399.912C620.763 399.463 620.65 398.911 620.65 398.257C620.65 396.967 621.127 395.947 622.081 395.199C623.035 394.433 624.334 394.049 625.98 394.049C626.391 394.049 626.803 394.077 627.214 394.133C627.626 394.171 628.009 394.227 628.364 394.302C628.719 394.358 629.028 394.423 629.29 394.498C629.57 394.573 629.785 394.638 629.935 394.694L629.458 396.939C629.178 396.789 628.738 396.639 628.14 396.49C627.541 396.321 626.821 396.237 625.98 396.237C625.251 396.237 624.615 396.387 624.073 396.686C623.53 396.967 623.259 397.415 623.259 398.032C623.259 398.35 623.315 398.631 623.427 398.874C623.558 399.117 623.745 399.341 623.988 399.547C624.25 399.734 624.568 399.912 624.942 400.08C625.316 400.248 625.765 400.426 626.288 400.613C626.98 400.875 627.597 401.137 628.14 401.398C628.682 401.642 629.14 401.931 629.514 402.268C629.907 402.605 630.206 403.016 630.412 403.502C630.618 403.97 630.72 404.549 630.72 405.241C630.72 406.588 630.215 407.607 629.206 408.299C628.215 408.991 626.793 409.337 624.942 409.337C623.652 409.337 622.642 409.224 621.913 409C621.183 408.794 620.688 408.635 620.426 408.523L620.903 406.279C621.202 406.391 621.679 406.56 622.333 406.784C622.988 407.008 623.857 407.121 624.942 407.121Z" fill="white"/>
</svg>
