<?xml version="1.0" encoding="UTF-8" standalone="no"?>
<!-- Created with Inkscape (http://www.inkscape.org/) -->
<svg
    xmlns:inkscape="http://www.inkscape.org/namespaces/inkscape"
    xmlns:rdf="http://www.w3.org/1999/02/22-rdf-syntax-ns#"
    xmlns="http://www.w3.org/2000/svg"
    xmlns:sodipodi="http://sodipodi.sourceforge.net/DTD/sodipodi-0.dtd"
    xmlns:cc="http://creativecommons.org/ns#"
    xmlns:xlink="http://www.w3.org/1999/xlink"
    xmlns:dc="http://purl.org/dc/elements/1.1/"
    xmlns:svg="http://www.w3.org/2000/svg"
    xmlns:ns1="http://sozi.baierouge.fr"
    id="svg2"
    sodipodi:docname="New document 1"
    viewBox="0 0 172.4 210.81"
    version="1.1"
    inkscape:version="0.48.2 r9819"
  >
  <defs
      id="defs4"
    >
    <filter
        id="filter3927"
        inkscape:collect="always"
        color-interpolation-filters="sRGB"
      >
      <feGaussianBlur
          id="feGaussianBlur3929"
          stdDeviation="1.9161226"
          inkscape:collect="always"
      />
    </filter
    >
    <radialGradient
        id="radialGradient3938"
        gradientUnits="userSpaceOnUse"
        cy="544.65"
        cx="331.35"
        gradientTransform="matrix(1 0 0 .84344 3.684 85.273)"
        r="86.201"
        inkscape:collect="always"
      >
      <stop
          id="stop3900"
          style="stop-color:#ffffff"
          offset="0"
      />
      <stop
          id="stop3902"
          style="stop-color:#e6e6e6"
          offset="1"
      />
    </radialGradient
    >
  </defs
  >
  <sodipodi:namedview
      id="base"
      bordercolor="#666666"
      inkscape:pageshadow="2"
      inkscape:window-y="26"
      fit-margin-left="0"
      pagecolor="#ffffff"
      fit-margin-top="0"
      inkscape:window-maximized="1"
      inkscape:zoom="1.3314685"
      inkscape:window-x="0"
      inkscape:window-height="744"
      showgrid="false"
      borderopacity="1.0"
      inkscape:current-layer="layer1"
      inkscape:cx="27.32021"
      inkscape:cy="23.00951"
      fit-margin-right="0"
      fit-margin-bottom="0"
      inkscape:window-width="1280"
      inkscape:pageopacity="0.0"
      inkscape:document-units="px"
  />
  <g
      id="layer1"
      inkscape:label="Layer 1"
      inkscape:groupmode="layer"
      transform="translate(-248.83 -436.03)"
    >
    <path
        id="path3910"
        style="filter:url(#filter3927);fill:#666666"
        inkscape:connector-curvature="0"
        d="m248.83 436.03v31.438 2.5312 142.81c0 0.014 0.20519 0.0312 0.4375 0.0312-0.23231 0-0.4375 0.0312-0.4375 0.0312v33.969c0 0.01 0.20519 0 0.4375 0h171.56 0.40625v-33.969c0-0.01-0.17394-0.0312-0.40625-0.0312 0.2323 0 0.40625-0.0172 0.40625-0.0312v-142.81-2.5312-31.438c0-0.003-0.17395 0-0.40625 0h-171.56c-0.23231 0-0.4375-0.003-0.4375 0z"
    />
    <g
        id="g3931"
        transform="translate(0 -4.5028)"
      >
      <path
          id="rect4064"
          style="fill:url(#radialGradient3938)"
          inkscape:connector-curvature="0"
          d="m249.25 471.94h171.56c0.2323 0 0.41932 0.0113 0.41932 0.0254v145.36c0 0.014-0.18702 0.025-0.41932 0.025h-171.56c-0.23231 0-0.41933-0.011-0.41933-0.025v-145.36c0-0.0141 0.18702-0.0254 0.41933-0.0254z"
      />
      <path
          id="rect4066"
          style="fill:#808080"
          inkscape:connector-curvature="0"
          d="m249.25 440.53h171.56c0.2323 0 0.41932 0.003 0.41932 0.006v33.965c0 0.003-0.18702 0.006-0.41932 0.006h-171.56c-0.23231 0-0.41933-0.003-0.41933-0.006v-33.965c0-0.003 0.18702-0.006 0.41933-0.006z"
      />
      <path
          id="rect4088"
          style="fill:#808080"
          inkscape:connector-curvature="0"
          d="m249.25 617.36h171.56c0.23231 0 0.41932 0 0.41932 0.01v33.965s-0.18701 0.01-0.41932 0.01h-171.56c-0.23231 0-0.41933 0-0.41933-0.01v-33.965s0.18702-0.01 0.41933-0.01z"
      />
      <text
          id="text3122"
          style="font-size:138.16px;font-family:Sans;letter-spacing:0px;line-height:125%;word-spacing:0px;fill:#808080"
          sodipodi:linespacing="125%"
          y="595.72357"
          x="294.6897"
          xml:space="preserve"
        >
        <tspan
            id="tspan3124"
            y="595.72357"
            x="294.6897"
            style="font-weight:bold;fill:#808080"
            sodipodi:role="line"
          >?</tspan
        >
      </text
      >
    </g
    >
  </g
  >
  <metadata
    >
    <rdf:RDF
      >
      <cc:Work
        >
        <dc:format
          >image/svg+xml</dc:format
        >
        <dc:type
            rdf:resource="http://purl.org/dc/dcmitype/StillImage"
        />
        <cc:license
            rdf:resource="http://creativecommons.org/licenses/publicdomain/"
        />
        <dc:publisher
          >
          <cc:Agent
              rdf:about="http://openclipart.org/"
            >
            <dc:title
              >Openclipart</dc:title
            >
          </cc:Agent
          >
        </dc:publisher
        >
        <dc:title
          >Unknown File </dc:title
        >
        <dc:date
          >2012-01-17T11:50:01</dc:date
        >
        <dc:description
          >Unknown file icon</dc:description
        >
        <dc:source
          >https://openclipart.org/detail/167183/unknown-file--by-gsagri04</dc:source
        >
        <dc:creator
          >
          <cc:Agent
            >
            <dc:title
              >gsagri04</dc:title
            >
          </cc:Agent
          >
        </dc:creator
        >
        <dc:subject
          >
          <rdf:Bag
            >
            <rdf:li
              >art</rdf:li
            >
            <rdf:li
              >clip</rdf:li
            >
            <rdf:li
              >computer</rdf:li
            >
            <rdf:li
              >file</rdf:li
            >
            <rdf:li
              >icon</rdf:li
            >
            <rdf:li
              >unknown</rdf:li
            >
            <rdf:li
              >web</rdf:li
            >
            <rdf:li
              >webicon</rdf:li
            >
          </rdf:Bag
          >
        </dc:subject
        >
      </cc:Work
      >
      <cc:License
          rdf:about="http://creativecommons.org/licenses/publicdomain/"
        >
        <cc:permits
            rdf:resource="http://creativecommons.org/ns#Reproduction"
        />
        <cc:permits
            rdf:resource="http://creativecommons.org/ns#Distribution"
        />
        <cc:permits
            rdf:resource="http://creativecommons.org/ns#DerivativeWorks"
        />
      </cc:License
      >
    </rdf:RDF
    >
  </metadata
  >
</svg
>
