{
    "firstName": "Alma",
    "lastName": "Quintana",
    "email": "aquintana@rmail.com",
    "password": "aquintana",
    "isAdmin": true
}

{
    "firstName": "Esteban",
    "lastName": "Solares",
    "email": "esolares@rmail.com",
    "password": "esolares",
    "isAdmin": false
}

{
    "firstName": "Dario",
    "lastName": "Guerra",
    "email": "dguerra@rmail.com",
    "password": "dguerra",
    "isAdmin": false
}

{
    "firstName": "Brenda",
    "lastName": "Castillo",
    "email": "bcastillo@rmail.com",
    "password": "bcastillo",
    "isAdmin": false
}

{
    "firstName": "Zoe",
    "lastName": "Solares",
    "email": "zsolares@rmail.com",
    "password": "zsolares",
    "isAdmin": false
}

{
    "firstName": "Leonardo",
    "lastName": "Solares",
    "email": "lsolares@rmail.com",
    "password": "lsolares",
    "isAdmin": false
}

{
    "firstName": "Lys",
    "lastName": "Antoine",
    "email": "lantoines@rmail.com",
    "password": "lantoine",
    "isAdmin": false
}

{
    "firstName": "Inigo",
    "lastName": "Lazcano",
    "email": "ilazcano@rmail.com",
    "password": "ilazcano",
    "isAdmin": false
}

{
    "firstName": "Julieta",
    "lastName": "Lazcano",
    "email": "jlazcano@rmail.com",
    "password": "jlazcano",
    "isAdmin": true
}