{
    "email": "joegoldberg@fracode.co",
    "password": "j.goldberg",
    "isAdmin": true
}

{
    "email": "lovequinn@fracode.co",
    "password": "l.quinn",
    "isAdmin": true
}

{
    "email": "guineverebeck@fracode.co",
    "password": "g.beck",
    "isAdmin": true
}

{
    "email": "fortyquinn@fracode.co",
    "password": "f.quinn",
    "isAdmin": false
}

{
    "email": "elliealves@fracode.co",
    "password": "e.alves",
    "isAdmin": false
}

{
    "email": "delilahalves@fracode.co",
    "password": "d.alves",
    "isAdmin": false
}

{
    "email": "karenminty@fracode.co",
    "password": "k.minty",
    "isAdmin": false
}

{
    "email": "candacestoneg@fracode.co",
    "password": "c.stone",
    "isAdmin": false
}