1559921900
s:353:"HTTP/1.1 200 OK
Server: nginx
Date: Fri, 07 Jun 2019 13:38:19 GMT
Content-Type: application/json; charset=utf-8
Content-Length: 15
X-XSS-Protection: 1; mode=block
X-Content-Type-Options: nosniff
X-Frame-Options: SAMEORIGIN
Access-Control-Allow-Origin: *
X-UA-Compatible: IE=Edge,chrome=1
Strict-Transport-Security: max-age=0

{"services":[]}";