show1,PJ Masks
show2,Doc McStuffins
show3,Goldie & Bear
show4,The Lion Guard
show5,Sofia the First
show6,Sheriff Callie's Wild West
show7,My Friends Tigger & Pooh
show8,Mickey Mouse Clubhouse
show9,Elena of Avalor
show10,Little Einsteins
show11,Jake and the Never Land Pirates
show12,Kate and Mim-Mim
show13,Miles From Tomorrowland
show14,Chicken Little
show15,Octonauts
show16,Handy Manny
show17,The Lion Guard: Return of the Roar
show18,Little Einsteins: Rocket's Firebird Rescue
show19,Kate & Mim-Mim
show20,Pocahontas
