show1,Science Channel On Demand
show2,NON-HUT
show3,VOD and AOT
show4,Van Helsing
show5,Tia Mowry at Home
show6,Panic 9-1-1
show7,Ghost Stalkers
show8,Ferris Bueller's Day Off
show9,Air Disasters
show10,Impractical Jokers: Inside Jokes
show11,Tenacious D in: The Pick of Destiny
show12,The Flight of the Phoenix
show13,Liar Liar
show14,Shetland
show15,Rev Run's Sunday Suppers
