,Word,Frequency
108,software architecture,20
49,model checking,13
421,software process improvement,12
44,verification,11
16,empirical software engineering,11
232,software metrics,11
103,traceability,10
43,security,9
293,testing,9
184,uml,9
276,engineering management,8
183,reverse engineering,8
42,reliability,7
655,requirements engineering,7
110,fault-tolerance,7
272,project management,7
395,simulation,7
366,empirical validation,7
129,metrics,7
106,documentation,7
67,requirements,7
148,web applications,6
145,formal methods,6
569,process improvement,6
61,software testing,6
310,programming,6
436,software cost estimation,6
111,trustworthiness,6
109,dependability,6
505,empirical study,6
867,function points,5
407,real-time systems,5
301,software performance,5
141,survey,5
4,use cases,5
414,program comprehension,5
360,service architecture,5
294,unified modeling language,5
101,non-functional requirements,5
65,software components,5
1,software development,5
354,object-oriented programming,4
179,maintenance,4
761,practitioners,4
91,eclipse,4
231,software maintenance,4
775,industrial case study,4
52,cots,4
68,scenarios,4
397,middleware,4
707,case study,4
95,empirical studies,4
560,controlled experiment,4
41,performance,4
99,impact analysis,4
241,java,4
303,systems engineering and theory,4
240,static analysis,4
39,experimentation,4
296,costs,4
21,software product line,4
631,factor analysis,4
606,multimedia,3
1092,passive testing,3
603,hypermedia,3
368,object-oriented systems,3
265,obstacle analysis,3
262,anomaly-handling,3
1093,simple connection protocol,3
359,reference architecture,3
928,maintenance estimates,3
365,effort prediction model,3
264,contingency requirements,3
367,function point analysis,3
1091,extended finite state machine,3
370,theoretical validation,3
665,languages,3
263,autonomy,3
369,size measures,3
1037,component documentation,3
147,temporal logic,3
149,3-valued logic,3
766,estimation methods,3
302,software systems,3
305,cultural differences,3
306,job shop scheduling,3
193,test oracles,3
192,replay,3
191,tool support,3
298,performance analysis,3
207,software specification,3
307,joining processes,3
308,personnel,3
309,product development,3
280,prototypes,3
635,object-oriented,3
268,computer science,3
311,system testing,3
1054,problem frames,3
581,object-orientation,3
267,safety-critical software,3
172,design patterns,3
758,capability maturity model,3
1038,third-party component,3
266,requirements evolution,3
158,inconsistency,3
153,refinement,3
152,negotiation,3
151,model merging,3
706,agile methodologies,3
125,quality attributes,3
386,software risk,3
459,prediction accuracy,3
916,architectural viewpoint,3
915,architectural view,3
409,implementation,3
410,specification,3
879,enterprise integration,3
76,ontology,3
513,software verification,3
838,embedded systems,3
422,software project management,3
66,software services,3
536,ethics,3
64,off-the-shelf software,3
63,evaluation,3
60,database,3
424,context-awareness,3
1118,electronic process guide,3
31,extreme programming,3
510,software reuse,3
511,integrated environments,3
40,measurement,3
917,dsp,3
413,object orientation,3
512,performance modeling and prediction,3
100,link retrieval,3
479,software bidding model,3
926,effort,3
925,duration,3
671,design,3
924,development estimates,3
923,software reliability,3
90,aspect-oriented software development,3
394,regression analysis,3
102,system quality,3
927,estimation accuracy,3
987,world wide web,2
451,object-oriented software,2
988,action research,2
794,motivators,2
1001,process engineering,2
883,cost estimation models,2
1000,descriptive process modelling,2
285,information analysis,2
844,software complexity,2
888,conceptual modelling,2
450,class analysis,2
297,government,2
506,framework,2
985,search engine,2
282,traffic control,2
889,development orientation,2
1002,qualitative research methods,2
890,generic conceptual model,2
784,evaluation metrics,2
983,reference architectures,2
487,conflict,2
854,natural language processing,2
785,magnitude of relative error,2
270,industrial relations,2
491,stochastic petri nets,2
855,requirement traceability,2
492,dependability analysis,2
868,interactive systems,2
869,virtual worlds,2
493,parametric fault tree,2
494,stochastic well-formed nets,2
878,reuse,2
269,guidelines,2
788,linear regression,2
271,production,2
281,research and development management,2
460,prediction models,2
273,recycling,2
274,air safety,2
856,rule-based traceability reasoning,2
275,air traffic control,2
786,project cost estimation,2
277,environmental management,2
278,humans,2
477,monte carlo simulation,2
458,mean magnitude of relative error,2
279,navigation,2
981,enterprise models,2
514,control flow,2
362,wireless service,2
818,sdl,2
527,ctl,2
833,survey methods,2
529,multi-valued logic,2
832,software engineering curricula,2
943,software process simulation,2
356,software visualization,2
942,simplified dynamic model,2
358,quality attribute,2
403,restructuring,2
361,service category,2
941,initial estimations,2
348,electronic commerce,2
940,early stages of software projects,2
390,cost estimation,2
251,architectural style,2
546,tracing,2
545,testing strategies,2
544,testing and debugging,2
543,software architectures,2
380,user interfaces,2
825,simulated annealing,2
384,functional failure analysis,2
387,uml performance failure,2
550,software process modeling,2
554,object-oriented analysis and design,2
437,software productivity measurement,2
425,game theory,2
515,coverage criteria,2
516,data flow,2
517,ddgraph,2
518,spanning sets,2
519,subsumption,2
840,intelligent systems,2
428,reflection,2
427,quality of service,2
982,integrated information systems,2
385,nonfunctional requirements,2
426,mobile computing,2
798,software engineering education,2
561,design pattern,2
316,quality management,2
977,mobile agents,2
423,conflict resolution,2
803,execution slice,2
570,risk management,2
568,stochastic process algebras,2
331,usability,2
567,performance modeling,2
566,performance evaluation tools,2
565,model aggregation,2
562,analysis techniques and methods,2
597,missing data,2
779,meta-analysis,2
250,product lines,2
1067,business community,2
744,feedback,2
124,composition,2
743,experience sampling,2
742,data collection,2
740,object-oriented design,2
119,research paradigms,2
98,change identification,2
97,methodological issues,2
96,evidence,2
672,theory,2
673,conceptual modeling,2
89,software design,2
88,ambiguity,2
87,programming teams,2
86,pair programming,2
85,compatibility,2
1101,business process modelling,2
127,evolutionary software,2
128,life and mission critical software,2
131,software independent verification and validation,2
751,situation model,2
1069,web services,2
157,detection,2
156,visual editor plug-in,2
155,graph transformation,2
154,generation,2
752,text comprehension,2
146,linear temporal logic,2
750,program model,2
745,qualitative studies,2
749,mental representation,2
748,expertise,2
653,telecommunications,2
746,software engineering experiments,2
656,"d.2.1 [software engineering]: requirements/specifications - methodologies (e.g., object-oriented, structured)",2
657,f.3.1 [logics and meanings of programs]: specifying and verifying and reasoning about programs,2
133,space shuttle program,2
1102,social care systems,2
79,roles scheme,2
78,project-based course,2
26,software modeling,2
723,metaphor,2
33,software quality,2
32,productivity,2
1126,referential integrity metrics,2
1127,formal language definition,2
1128,information system integrity,2
27,debugging,2
25,software analysis,2
725,software quality management systems,2
24,separation of concerns,2
23,technology transfer,2
1129,information system specification,2
1130,information system transactions,2
10,end-user software engineering,2
711,field studies,2
703,scalability,2
724,qualitative methods,2
46,cocomo,2
77,project metrics,2
729,empirical body of knowledge,2
75,cots component identification,2
74,cots component assessment and selection,2
730,testing techniques,2
678,"meta-object models, actors",2
679,middleware services,2
680,quality-of-service,2
681,"reflection, theoretical foundations",2
683,evolution,2
48,groupware,2
1113,security modeling,2
1114,web engineering,2
1115,business process,2
1116,business process management,2
1117,business process reengineering,2
51,thinkteam,2
50,publish/subscribe notification,2
1068,technology deployment experience,2
130,process characterization,2
858,software process,2
227,scientific computing,2
176,logical views,2
637,soundness,2
636,prototype-based,2
611,performance modeling and analysis,2
182,points-to analysis,2
634,control-flow analysis,2
633,concurrency,2
632,systems development methodology,2
630,analysis and design,2
762,project,2
610,parallel programs,2
206,relational methods,2
205,alloy,2
243,ltl,2
763,software lifecycle,2
1043,integrity constraints,2
484,risk assessment,2
1035,model evaluation framework,2
239,instrumentation,2
778,collinearity,2
236,animation,2
1036,prototype tool evaluation,2
777,ck metrics,2
234,model-checking,2
1041,database sampling,2
760,organization,2
174,synchronization,2
759,correspondence analysis,2
211,program analysis,2
619,empirical analysis,2
757,replicated experiment,2
1062,uml based development method,2
249,black box testing,2
1025,software process models,2
599,software effort prediction,2
616,regression test selection,2
1061,requirement specification,2
615,experiment,2
1033,evaluation process,2
776,empirical research,2
1059,'rich' workpieces frame,2
208,software validation,2
613,workload characterization,2
1034,evaluation results,2
210,machine learning,2
612,performance prediction,2
1060,design specification,2
728,process knowledge elicitation,1
771,effort prediction models,1
772,multiple regression models,1
726,descriptive software process modeling,1
839,human performance,1
773,web hypermedia applications,1
727,process improvement ethics,1
722,software measurement,1
774,empirical assessment,1
842,safety-critical systems,1
841,operator performance,1
846,technology impact,1
843,socio-technical studies,1
853,requirements verification,1
857,safety related software,1
708,scientific software,1
709,software engineers,1
710,tailoring methodologies,1
712,work practices,1
713,agile development,1
782,requirements management and practice,1
714,ethnographic studies,1
715,xp community,1
716,xp culture,1
717,xp team,1
718,reading technique,1
852,multiprocessor systems,1
787,gamma analysis,1
851,high level petri nets,1
850,protocol,1
849,multimedia streaming,1
848,buffer utilization,1
719,software inspection,1
720,usage-based reading,1
721,software design prediction,1
781,industrial experience in process improvement,1
780,empirical studies of software process,1
847,adaptive transmission rates,1
769,architectural evaluation,1
845,software evaluation,1
770,case-based reasoning techniques,1
755,methodological support,1
768,multi-organisational software cost databases,1
824,self-improving processes,1
822,relationships,1
821,referential integrity,1
741,object-process methodology,1
820,odmg-3.0,1
783,software productivity,1
799,tertiary education,1
747,test management,1
800,industry training,1
801,industry/university collaboration,1
802,distance between features,1
804,invoking input,1
805,program features,1
819,object databases,1
806,adaptive multimedia,1
817,fault detection,1
807,network-aware application,1
816,architectural design,1
815,workflow management,1
814,web publishing,1
813,process model,1
812,e-commerce,1
811,software environments,1
810,metamodeling,1
753,case tools,1
809,lifecycle validation,1
808,video streaming,1
756,modelling tool,1
823,multimedia data storage,1
826,tertiary storage subsystems,1
789,service requests,1
739,is development methodologies,1
790,software reliability growth models,1
837,software partitioning,1
836,design recovery,1
835,cohesion and coupling,1
834,clustering,1
767,model evaluation,1
791,experimental design,1
792,experimental replication,1
793,software reading techniques,1
795,multidimensional scaling,1
754,human-computer interface,1
732,data analysis,1
831,tamper detection,1
733,formal technical reviews,1
830,rsa,1
829,md5,1
828,halftone image,1
827,crisscross technique,1
796,software practitioners,1
797,ssa,1
765,missingness mechanism,1
764,data imputation,1
734,log-linear modeling,1
735,participant roles,1
736,peer review meetings,1
737,process measurements,1
738,functional design,1
731,cognitive activities,1
0,flexible plan driven processes,1
859,structured software inspection technique,1
1053,literature review,1
1040,data cleaning,1
1042,denotational semantics,1
1044,legacy systems,1
1045,undecidability,1
1046,access control policies,1
1047,aspects,1
1048,models,1
1049,role-based access control,1
1050,corrective software maintenance,1
1051,management,1
1052,domain modelling,1
1055,knowledge discovery in databases,1
1032,unified modeling language (uml),1
1056,organizational memory,1
1057,participatory design,1
1058,user participation,1
1063,agent,1
1064,cultural heritage,1
1065,virtual visit,1
1066,web application,1
1070,andersen algorithm,1
1071,fahndrich algorithm,1
1072,pointer analysis,1
1073,communication,1
1039,cohesion,1
1031,object modelling,1
1075,requirements elicitation,1
1016,computing,1
1005,collaboration diagrams,1
1006,experiments,1
1007,interaction diagrams,1
1008,method/model evaluation,1
1009,object-oriented analysis,1
1010,sequence diagrams,1
1011,concurrency control,1
1012,consistency management,1
1013,distributed object system,1
1014,replication,1
1015,classification system,1
1017,reference discipline,1
1030,formal semantics,1
1018,research approach,1
1019,research method,1
1020,unit of analysis,1
1021,computer-based systems,1
1022,emotions,1
1023,organizational transformation,1
1024,new product development,1
1026,component-based development,1
1027,theoretical foundation,1
1028,variability,1
1029,test driven development,1
1074,content analysis,1
1076,human factors,1
860,task directed inspection,1
1133,functional dependencies,1
1111,intention driven modeling,1
1112,organizational change,1
1119,distributed architecture,1
1120,peer-to-peer,1
1121,personalization,1
1122,universal accessibility,1
1123,information technology industry,1
1124,information technology productivity,1
1125,productive efficiency,1
1131,armstrong relation,1
1132,database prototyping,1
1134,information system development,1
1109,enterprise modeling,1
1135,legacy migration,1
1136,inverted file,1
1137,pat array,1
1138,signature file,1
1139,architectural complexity,1
1140,complexity modeling,1
1141,decision support complexity,1
1142,functional complexity,1
1143,structural complexity,1
1144,user interface complexity,1
1145,experimental software engineering,1
1110,guidance,1
1108,change process modeling,1
1077,java programming,1
1089,concept-based transformations,1
1078,classical decision-making model,1
1079,requirement engineering activities,1
1080,requirements decisions,1
1081,learning effectiveness,1
1082,software project management education,1
1083,system dynamics simulation,1
1084,document type definitions,1
1085,extensible markup language,1
1086,schema integration,1
1087,active libraries,1
1088,c++ metaprogramming,1
1090,extensible compilers,1
1107,retrieval evaluation,1
1094,software cost reduction,1
1095,specification style,1
1096,understandability,1
1097,behavioral modeling,1
1098,object-oriented software development,1
1099,statechart diagram,1
1100,the unified modeling language,1
1103,approximate retrieval,1
1104,boolean retrieval,1
1105,multi-faceted classification,1
1106,plain-text retrieval,1
1004,statecharts,1
1003,frameworks,1
999,system development methodologies,1
909,life cycle process,1
898,soft-goal interdependency graphs,1
899,software re-engineering,1
900,software architecture evaluation,1
901,software architecture styles,1
902,cellular networks,1
903,management systems,1
904,network provider,1
905,service provider,1
906,product line development,1
907,software safety and reliability,1
908,iterative development,1
910,pipelining,1
896,thermodynamics,1
911,process models,1
912,timeboxing,1
913,domain orientation,1
914,software development environment,1
918,dataflow algorithm,1
919,firewall algorithm,1
920,reduction algorithm,1
921,slicing algorithm,1
922,nested design,1
929,conjoint analysis,1
930,external software quality,1
897,de-motivators,1
895,obfuscation,1
998,opm,1
875,business pattern,1
861,tdi,1
862,level of analysis = profession,1
863,reference discipline = not applicable,1
864,research approach = evaluative-other,1
865,research method = literature analysis,1
866,topic = computing research,1
870,synthetic web data generation,1
871,web database performance,1
872,web warehousing,1
873,cost model,1
874,inheritance depth,1
876,domain analysis,1
894,kolmogorov complexity,1
877,pattern development,1
880,modeling,1
881,technological infrastructure,1
882,virtual enterprise,1
884,massive software maintenance,1
885,statistical process control,1
886,iterative and incremental specification,1
887,many-valued reasoning,1
891,data compression,1
892,entropy,1
893,information theory,1
931,information system managers,1
932,organizational software,1
933,software features,1
979,mobile objects,1
967,key encapsulation,1
968,key recovery system,1
969,petrinet modeling,1
970,computer security,1
971,information assurance,1
972,security-engineering,1
973,distributed computing,1
974,internet agents,1
975,internet programming,1
976,migration patterns,1
978,mobile code,1
980,formal description techniques,1
934,software learnability,1
984,reconfigurability,1
986,web-crawling,1
989,base subset,1
990,embedded system,1
991,iso c,1
992,adissa,1
993,data modeling,1
994,foom,1
995,functional analysis,1
996,method engineering,1
997,method evaluation and comparison,1
966,cryptography,1
965,workflow management systems,1
964,workflow,1
963,time constraints,1
935,software response time,1
936,cleanroom certification,1
937,software development methodologies,1
938,software engineering experiment,1
939,software process and product metrics,1
945,inconsistency management,1
946,design of experiments,1
947,model characterization,1
948,sensitivity analysis,1
949,distributed processes,1
950,process landscaping,1
951,process modelling language,1
952,empirical probability density distribution,1
953,filtering,1
954,network architecture,1
955,neural network,1
956,scaling function,1
957,software operational profile,1
958,software reliability modeling,1
959,process modelling,1
960,rolenact,1
961,software development process,1
962,queuing model,1
944,inconsistency handling,1
573,finite-state abstraction,1
705,testing technique selection,1
260,goal-oriented requirements analysis,1
246,runtime monitoring,1
247,safety analysis,1
248,vector clock,1
252,graph transformation system,1
253,modeling middleware platforms,1
254,service-oriented architectures,1
255,assume-guarantee,1
256,modular flow analysis,1
257,card sorting,1
258,classification,1
259,requirements change,1
261,user-centered conceptual design,1
304,vehicle crash testing,1
283,bridges,1
284,heart,1
286,multivalued logic,1
287,telematics,1
288,connectors,1
289,indium tin oxide,1
290,postal services,1
291,publishing,1
292,tellurium,1
295,xml,1
299,predictive models,1
245,predictive analysis,1
244,multithreaded program,1
242,jmpax,1
238,buffer overrun,1
204,structural heuristics,1
209,aspect mining,1
212,autonomic management,1
213,decision policies,1
214,j2ee,1
215,dynamic analysis,1
216,execution traces,1
217,path testing,1
218,program invariants,1
219,test data generation,1
220,b abstract machine(bam),1
221,b method,1
222,b operation,1
223,class operation,1
224,class understanding,1
225,concept analysis,1
226,automated software engineering,1
228,user interface requirements,1
229,xml technology,1
230,module cohesion,1
233,software restructuring,1
235,software architecture analysis,1
237,ebxml,1
300,robustness,1
312,concurrent engineering,1
202,program slicing,1
357,visual patterns,1
343,software prototyping,1
344,software tools,1
345,table lookup,1
346,art,1
347,educational institutions,1
349,internet,1
350,legislation,1
351,medical services,1
352,privacy,1
353,taxonomy,1
355,smalltalk,1
363,profiling,1
313,enterprise resource planning,1
364,software deployment,1
371,project memory,1
372,recommender system,1
373,software artifacts,1
374,software development teams,1
375,user studies,1
376,domain-specific architectures,1
377,human factors in software design,1
378,middleware/business logic,1
379,specialized application languages,1
381,web site management/development tools,1
342,software development management,1
341,physics computing,1
340,natural languages,1
339,councils,1
314,measurement standards,1
315,packaging,1
317,software standards,1
318,standards development,1
319,standards organizations,1
320,computer architecture,1
321,counting circuits,1
322,delay,1
323,shape,1
324,requirements specification,1
325,visualization,1
326,computer bugs,1
327,concrete,1
328,software debugging,1
329,strategic planning,1
330,time to market,1
332,costing,1
333,design engineering,1
334,economics,1
335,large-scale systems,1
336,nasa,1
337,system analysis and design,1
338,watches,1
203,guided search,1
201,forward dynamic program slicing,1
383,research methodology,1
72,tacit knowledge solicitation,1
53,enterprise application integration,1
54,integration architectures,1
55,multi-fidelity applications,1
56,resource allocation,1
57,resource-aware,1
58,service composition,1
59,ubiquitous computing,1
62,transaction,1
69,folklore elicitation,1
70,high productivity development time experimental studies,1
71,hypothesis generation,1
73,testable hypotheses,1
113,real-time embedded systems,1
80,human aspects,1
81,access-control policies,1
82,change-impact analysis,1
83,decision diagram,1
84,xacml,1
92,aspect-oriented programming,1
93,modular reasoning,1
94,modularity,1
104,architecture model,1
105,assumption,1
107,knowledge management,1
47,incremental cross-validation,1
45,calibration,1
38,requirements prioritization,1
37,net present value (npv),1
2,estimation,1
3,incremental development,1
5,aop,1
6,aspect weaver,1
7,bpel,1
8,domain-specific aspect language,1
9,software adaptability,1
11,error prevention,1
12,program generation,1
13,spreadsheet,1
14,template,1
15,type system,1
17,multiple regression,1
18,software field quality,1
19,testing metrics,1
20,product line introduction,1
22,systematic software reuse,1
28,end-user programming,1
29,fault localization,1
30,agile software development,1
34,decomposition,1
35,feature sequencing,1
36,financial analysis,1
112,abstract interpretation,1
114,real-time model checking,1
200,failure-inducing input,1
181,ownership,1
166,web services composition,1
167,model-based testing,1
168,component adaptation,1
169,component assembly,1
170,component based software engineering,1
171,concurrent programming,1
173,interfaces,1
175,formal concept analysis,1
177,mixins,1
178,traits,1
180,software evolution,1
185,aore,1
115,cbse,1
186,aosd,1
187,aspect mining and identification,1
188,aspect oriented requirements engineering,1
189,automation,1
190,concern identification,1
194,design differencing,1
195,design mentoring,1
196,design understanding,1
197,structural evolution,1
198,automated debugging,1
199,backward dynamic,1
165,semantic web services,1
164,qos-awareness,1
163,owl-s,1
162,automata theory,1
116,foundational theory,1
117,reliability composition,1
118,research design,1
120,software profession,1
121,technical writing,1
122,validation,1
123,components,1
126,system analysis,1
132,software safety,1
134,analysis,1
135,certification,1
136,component,1
137,composition languages,1
138,trusted components,1
139,education,1
140,international,1
142,corrective maintenance maturity,1
143,maintainer's education,1
144,training,1
150,inconsistency detection,1
159,description logics,1
160,model consistency checking,1
161,software design verification,1
382,controlled experiments,1
388,accuracy indicators,1
704,characterisation schema,1
607,spacebased relations,1
592,full information maximum likelihood,1
593,imputation methods,1
594,listwise deletion,1
595,log-log regression,1
596,mean imputation,1
598,similar response pattern imputation,1
600,design representation,1
601,events,1
602,formal model,1
604,interactive behavior,1
605,labyrinth,1
608,spreadsheets,1
628,task and data parallelism,1
609,visual programming,1
614,effort estimation,1
617,regression testing,1
618,selective retest,1
620,modechart,1
621,requirements analysis,1
622,timing constraints,1
623,coordination language,1
624,data distribution types,1
625,hierarchical module structure,1
626,message-passing program,1
591,erp,1
590,transient and steady-state analysis,1
589,preemptive policies,1
588,markov regenerative processes,1
553,object systems,1
555,trace containment,1
556,acsr,1
557,process scheduling,1
558,spin,1
559,comments,1
563,change effort,1
564,design alternatives,1
571,system failures,1
572,data-flow analysis,1
574,formal specification,1
575,scr requirements,1
576,calculi for mobility,1
577,enhanced operational semantics,1
578,formal methodology,1
579,performance evaluation,1
580,stochastic models,1
582,refinement calculi,1
583,semantic models,1
584,probability,1
585,proof,1
586,safety,1
587,software fault tolerance,1
627,mpi,1
629,transformation system,1
551,wireless internet services,1
690,modal logics,1
674,data mart,1
675,data warehouse,1
676,design method,1
677,software quality management,1
682,design environment,1
684,mae,1
685,system model,1
686,assumptions,1
687,chemical abstract machine model,1
688,component-based systems,1
689,mobile processes,1
691,name-passing process calculi,1
638,data model,1
692,transition systems,1
693,context sensitivity,1
694,def-use analysis,1
695,side-effect analysis,1
696,algorithms,1
697,d.1.7 [programming techniques]: visual programming,1
698,d.2.5 [software engineering]: testing and debugging,1
699,d.2.6 [software engineering]: programming environments,1
700,h.4.1 [information systems applications]: office automation,1
701,coordination of heterogeneous agents,1
702,policy enforcement,1
670,type checking,1
669,roles,1
668,principals,1
667,policies,1
639,process support,1
640,research impact,1
641,software configuration management,1
642,versioning,1
643,workspace management,1
644,χ chek,1
645,fairness,1
646,partiality,1
647,programming languages,1
648,component architecture,1
649,feature interaction,1
650,network addressing,1
651,network protocols,1
652,network security,1
654,process measurement,1
658,confidentiality,1
659,d.4.6 [operating systems]: security and protection -information flow controls,1
660,declassification,1
661,downgrading,1
662,end-to-end,1
663,information flow controls,1
664,integrity,1
666,lattice,1
552,inheritance,1
549,reference process model,1
389,arbitrary function approximators,1
448,object-oriented modeling,1
435,requirements management,1
438,and/or graph,1
439,heuristic search,1
440,local model checking,1
441,state explosion,1
442,directed graphical model,1
443,dominance tree,1
444,generalized conditional independence,1
445,reengineering,1
446,reuse candidate,1
447,aggregation,1
449,whole-part relationship,1
467,multiprocessor schedulability,1
452,test coverage,1
453,quality and reliability,1
454,reliability modeling,1
455,web applications and web server logs,1
456,workload measurement,1
457,world wide web (www) and internet,1
461,c.2.8.d mobile computing/mobile environments,1
462,c.2.8.e mobile computing/support services,1
463,j.8.l internet applications/middleware,1
464,j.9.a mobile applications/location-dependent and sensitive,1
465,hard real-time systems,1
434,evolutionary change,1
433,change management,1
432,mobility,1
431,internet computing,1
391,cross-validation,1
392,empirical methods,1
393,estimation by analogy,1
396,validity,1
398,prism-mw,1
399,def-use testing,1
400,exceptions,1
401,test coverage metrics,1
402,and reengineering,1
404,agility,1
405,complex systems,1
406,information representation,1
408,fault coverage,1
411,timed automaton,1
412,information retrieval,1
415,redocumentation,1
416,benchmarking,1
417,best practice identification,1
418,data envelopment analysis (dea),1
419,enterprise resource planning (erp),1
420,multivariate productivity measurements,1
429,agents,1
430,coordination,1
466,interprocess communication,1
468,nondeterministic time parameters,1
548,process elicitation,1
530,query checking,1
507,learning,1
508,process quality,1
509,product line,1
520,assertion checkers,1
521,runtime monitors,1
522,software/program verification,1
523,specification language,1
524,automatic tools for human-computer interaction,1
525,models for interactive software systems,1
526,task models,1
528,model understanding,1
531,tlqsolver,1
469,preemptive scheduling,1
532,compatibility and substitutability of components,1
533,component-based software development,1
534,interface definition languages,1
535,protocols,1
537,legal issues,1
538,common-mode failure,1
539,demand space partitioning,1
540,design diversity,1
541,software fault-tolerance,1
542,subdomain testing,1
547,mobile services commerce,1
504,application framework,1
503,transformation,1
502,search-based software engineering,1
501,evolutionary testing,1
470,preemptive time petri nets,1
471,reactive systems,1
472,state space analysis,1
473,timeliness predictability,1
474,bidding,1
475,contingency costs,1
476,model validation,1
478,risk,1
480,software projects,1
481,dynamic complexity,1
482,dynamic coupling,1
483,markov model,1
485,severity of failure,1
486,uml specification,1
488,confusion,1
489,modeling methodology,1
490,priorities,1
495,continuous-time markov chain,1
496,lumping,1
497,steady-state analysis,1
498,transient analysis,1
499,uniformization,1
500,automated test data generation,1
1146,single-case experimental designs,1
