<?xml version="1.0" encoding="utf-8"?>
<!-- Generator: Adobe Illustrator 19.0.0, SVG Export Plug-In . SVG Version: 6.00 Build 0)  -->
<svg version="1.1"
	 id="svg1392" xmlns:svg="http://www.w3.org/2000/svg" xmlns:dc="http://purl.org/dc/elements/1.1/" xmlns:rdf="http://www.w3.org/1999/02/22-rdf-syntax-ns#" xmlns:sodipodi="http://sodipodi.sourceforge.net/DTD/sodipodi-0.dtd" xmlns:cc="http://creativecommons.org/ns#" xmlns:inkscape="http://www.inkscape.org/namespaces/inkscape"
	 xmlns="http://www.w3.org/2000/svg" xmlns:xlink="http://www.w3.org/1999/xlink" x="0px" y="0px" viewBox="56 -56 612 612"
	 style="enable-background:new 56 -56 612 612;" xml:space="preserve">
<style type="text/css">
	.st0{fill:#3B5998;}
	.st1{fill:#FFFFFF;}
</style>
<g id="ic_x5F_facebook">
	<g id="ic_x5F_mail" transform="translate(-58.515,-15.604444)">
		<g id="g1402">
			<path id="path1404" class="st0" d="M196.9-23.1c-41.3,0-64.6,21.4-64.6,65v450.1c0,40.8,20.9,62.2,62.2,62.2h452
				c41.3,0,62.2-20.3,62.2-62.2V42c0-42.6-20.9-65-63.5-65C645.2-23.1,196.7-23.2,196.9-23.1z"/>
		</g>
	</g>
	<rect x="257.6" y="30.1" class="st1" width="319.5" height="478.5"/>
	<path class="st0" d="M80.9,484.2c0,25.9,21,46.8,46.8,46.8h468.5c25.9,0,46.8-21,46.8-46.8V15.8c0-25.9-21-46.8-46.8-46.8H127.8
		c-25.9,0-46.8,21-46.8,46.8L80.9,484.2L80.9,484.2z M373.7,460.8V273.4h-46.8v-70.3h46.8c0-120.7,5.1-128.8,152.3-128.8v70.3
		c-77.5,0-70.3,4.3-70.3,58.6H526v70.3h-70.3v187.4L373.7,460.8L373.7,460.8z"/>
</g>
</svg>
