%YAML 1.1
%TAG !u! tag:unity3d.com,2011:
--- !u!21 &2100000
Material:
  serializedVersion: 6
  m_ObjectHideFlags: 0
  m_CorrespondingSourceObject: {fileID: 0}
  m_PrefabInstance: {fileID: 0}
  m_PrefabAsset: {fileID: 0}
  m_Name: OmnesSDF Material_d4
  m_Shader: {fileID: 4800000, guid: 68e6db2ebdc24f95958faec2be5558d6, type: 3}
  m_ShaderKeywords: BEVEL_ON UNDERLAY_ON
  m_LightmapFlags: 4
  m_EnableInstancingVariants: 0
  m_DoubleSidedGI: 0
  m_CustomRenderQueue: -1
  stringTagMap: {}
  disabledShaderPasses: []
  m_SavedProperties:
    serializedVersion: 3
    m_TexEnvs:
    - _BumpMap:
        m_Texture: {fileID: 0}
        m_Scale: {x: 1, y: 1}
        m_Offset: {x: 0, y: 0}
    - _Cube:
        m_Texture: {fileID: 0}
        m_Scale: {x: 1, y: 1}
        m_Offset: {x: 0, y: 0}
    - _FaceTex:
        m_Texture: {fileID: 0}
        m_Scale: {x: 1, y: 0.74}
        m_Offset: {x: 0, y: 0.08}
    - _MainTex:
        m_Texture: {fileID: 2800000, guid: 2baf691fc4644bec8446ff204e758eea, type: 3}
        m_Scale: {x: 1, y: 1}
        m_Offset: {x: 0, y: 0}
    - _OutlineTex:
        m_Texture: {fileID: 0}
        m_Scale: {x: 0, y: 0}
        m_Offset: {x: 0, y: 0}
    m_Ints: []
    m_Floats:
    - _Ambient: 0.822
    - _Bevel: 0.25
    - _BevelClamp: 0.348
    - _BevelOffset: 0.25
    - _BevelRoundness: 0.776
    - _BevelWidth: 0.218
    - _BumpFace: 0
    - _BumpOutline: 0
    - _ColorMask: 15
    - _Diffuse: 0.562
    - _FaceDilate: -0.03
    - _FaceUVSpeedX: 0
    - _FaceUVSpeedY: 0
    - _GlowInner: 0.577
    - _GlowOffset: -0.29
    - _GlowOuter: 0.43
    - _GlowPower: 1
    - _GradientScale: 6
    - _LightAngle: 2.32
    - _MaskSoftnessX: 0
    - _MaskSoftnessY: 0
    - _OutlineSoftness: 0.192
    - _OutlineUVSpeedX: 0
    - _OutlineUVSpeedY: 0
    - _OutlineWidth: 0.445
    - _PerspectiveFilter: 0.875
    - _Reflectivity: 15
    - _ScaleRatioA: 0.8333333
    - _ScaleRatioB: 0.70208335
    - _ScaleRatioC: 0.26003087
    - _ScaleX: 1
    - _ScaleY: 1
    - _ShaderFlags: 1
    - _Sharpness: 0
    - _SpecularPower: 1.14
    - _Stencil: 0
    - _StencilComp: 8
    - _StencilOp: 0
    - _StencilReadMask: 255
    - _StencilWriteMask: 255
    - _TextureHeight: 512
    - _TextureWidth: 512
    - _UnderlayDilate: 1
    - _UnderlayOffsetX: 1
    - _UnderlayOffsetY: 1
    - _UnderlaySoftness: 0.7
    - _VertexOffsetX: 0
    - _VertexOffsetY: 0
    - _WeightBold: 0.75
    - _WeightNormal: 0
    m_Colors:
    - _ClipRect: {r: -32767, g: -32767, b: 32767, a: 32767}
    - _EnvMatrixRotation: {r: 0, g: 0, b: 0, a: 0}
    - _FaceColor: {r: 0.9940476, g: 1, b: 1, a: 1}
    - _GlowColor: {r: 0.2862745, g: 0.6156863, b: 0.2196079, a: 1}
    - _MaskCoord: {r: 0, g: 0, b: 32767, a: 32767}
    - _OutlineColor: {r: 0.7924528, g: 0.1981132, b: 0.4780056, a: 1}
    - _ReflectFaceColor: {r: 1, g: 0.5597302, b: 0.3915094, a: 1}
    - _ReflectOutlineColor: {r: 0.8207547, g: 0, b: 0, a: 0}
    - _SpecularColor: {r: 1, g: 1, b: 1, a: 1}
    - _UnderlayColor: {r: 0, g: 0, b: 0, a: 0.472}
  m_BuildTextureStacks: []
