{"sky":
   [
      [
         {"index":[1],
          "ascension":[20],
          "declination":[10],
          "rate":[1],
          "coarse":[120],
          "fine":[0],
          "RMS":[20],
          "sinusoids":[1],
          "polarisation":[1,0,0,-1],
          "BW":[3457],
          "skyImage":["twoDots.png"],
          "skyImageDimension":[3]
          }
      ]
   ]
}