{"sky":
   [
      [
         {"index":[1],
          "ascension":[20],
          "declination":[10],
          "rate":[0],
          "coarse":[66],
          "fine":[0],
          "RMS":[20],
          "sinusoids":[-3072],
          "pulseWidth":[512],
          "polarisation":[1,0,1,0],
          "BW":[9000],
          "skyImage":["twoDots.png"],
          "skyImageDimension":[3]
          }
      ]

   ]
}