{"sky":
   [
      [
         {"index":[1],
          "ascension":[20],
          "declination":[10],
          "rate":[1],
          "coarse":[66],
          "fine":[0],
          "RMS":[20],
          "sinusoids":[0],
          "polarisation":[1,0,0,-1],
          "BW":[6000],
          "skyImage":["SixteenDots.png"],
          "skyImageDimension":[3]
          }
      ]

   ]
}