{
  "TablesList": [
    //{
    //  "Queue": "Upd_1",
    //  "perconaTable": "Contact",
    //  "bpmTable": "Contact",
    //  "syncDirect": "perconaToBpm", // "bpmToPercona"   // "perconaToBpm"  // "duplex"
    //  "action": "update" // "update"  // "analysis" // "analysisBpm" // "analysisPercona"
    //}
    //,
    //{
    //  "Queue": "Upd_1",
    //  "perconaTable": "CardAccount",
    //  "bpmTable": "CardAccount",
    //  "syncDirect": "perconaToBpm", // "bpmToPercona"   // "perconaToBpm"  // "duplex"
    //  "action": "analysis", // "update"  // "analysis" // "analysisBpm" // "analysisPercona"
    //  "extendedBpmColumnName": "",
    //  "extendedPerconaColumnName": ""
    //}
    //,
    //{
    //  "Queue": "Upd_1",
    //  "perconaTable": "Card",
    //  "bpmTable": "Card",
    //  "syncDirect": "perconaToBpm", // "bpmToPercona"   // "perconaToBpm"  // "duplex"
    //  "action": "analysis", // "update"  // "analysis" // "analysisBpm" // "analysisPercona"
    //  "extendedBpmColumnName": "",
    //  "extendedPerconaColumnName": ""
    //}
    //,
    //{
    //  "Queue": "Upd_1",
    //  "perconaTable": "Account",
    //  "bpmTable": "Account",
    //  "syncDirect": "perconaToBpm", // "bpmToPercona"   // "perconaToBpm"  // "duplex"
    //  "action": "analysis", // "update"  // "analysis" // "analysisBpm" // "analysisPercona"
    //  "extendedBpmColumnName": "",
    //  "extendedPerconaColumnName": ""
    //}
    //,
    //{
    //  "Queue": "Upd_1",
    //  "perconaTable": "Product",
    //  "bpmTable": "Product",
    //  "syncDirect": "perconaToBpm", // "bpmToPercona"   // "perconaToBpm"  // "duplex"
    //  "action": "analysis", // "update"  // "analysis" // "analysisBpm" // "analysisPercona"
    //  "extendedBpmColumnName": "",
    //  "extendedPerconaColumnName": ""
    //}
    //,
    //{
    //  "Queue": "Upd_1",
    //  "perconaTable": "Purchase",
    //  "bpmTable": "Order",
    //  "syncDirect": "perconaToBpm", // "bpmToPercona"   // "perconaToBpm"  // "duplex"
    //  "action": "analysis", // "update"  // "analysis" // "analysisBpm" // "analysisPercona"
    //  "extendedBpmColumnName": "",
    //  "extendedPerconaColumnName": ""
    //}
    //,
    //{
    //  "Queue": "Upd_1",
    //  "perconaTable": "ProductInPurchase",
    //  "bpmTable": "OrderProduct",
    //  "syncDirect": "perconaToBpm", // "bpmToPercona"   // "perconaToBpm"  // "duplex"
    //  "action": "analysis", // "update"  // "analysis" // "analysisBpm" // "analysisPercona"
    //  "extendedBpmColumnName": "",
    //  "extendedPerconaColumnName": ""
    //}
    //,
    //{
    //  "Queue": "Upd_1",
    //  "perconaTable": "CommercialNetwork",
    //  "bpmTable": "CommercialNetwork",
    //  "syncDirect": "perconaToBpm", // "bpmToPercona"   // "perconaToBpm"  // "duplex"
    //  "action": "analysis", // "update"  // "analysis" // "analysisBpm" // "analysisPercona"
    //  "extendedBpmColumnName": "",
    //  "extendedPerconaColumnName": ""
    //}
    //,
    //{
    //  "Queue": "Upd_1",
    //  "perconaTable": "Campaign",
    //  "bpmTable": "Campaing",
    //  "syncDirect": "perconaToBpm", // "bpmToPercona"   // "perconaToBpm"  // "duplex"
    //  "action": "analysis", // "update"  // "analysis" // "analysisBpm" // "analysisPercona"
    //  "extendedBpmColumnName": "",
    //  "extendedPerconaColumnName": ""
    //}
    //,
    {
      "Queue": "Transaction_PerconaToBpm",
      "perconaTable": "Transaction",
      "bpmTable": "Transaction",
      "syncDirect": "perconaToBpm", // "bpmToPercona"   // "perconaToBpm"  // "duplex"
      "action": "update", // "update"  // "analysis" // "analysisBpm" // "analysisPercona"
      "extendedBpmColumnName": "", //"SourceChargingTransactionId",
      "extendedPerconaColumnName": "" //"SourceChargingTransactionId"
    },
    {
      "Queue": "Transaction_BpmToPerconaDelete",
      "perconaTable": "Transaction",
      "bpmTable": "Transaction",
      "syncDirect": "bpmToPercona", // "bpmToPercona"   // "perconaToBpm"  // "duplex"
      "action": "delete", // "update"  // "delete" // "analysis" // "analysisBpm" // "analysisPercona"
      "extendedBpmColumnName": "", //"SourceChargingTransactionId",
      "extendedPerconaColumnName": "" //"SourceChargingTransactionId"
    },
    {
      "Queue": "Transaction_BpmToPerconaAnalsis",
      "perconaTable": "Transaction",
      "bpmTable": "Transaction",
      "syncDirect": "duplex", // "bpmToPercona"   // "perconaToBpm"  // "duplex"
      "action": "analysis" // "update"  // "delete" // "analysis" // "analysisBpm" // "analysisPercona"
    }
  ]
}
