<svg xmlns="http://www.w3.org/2000/svg" xmlns:xlink="http://www.w3.org/1999/xlink" width="16.97" height="16.97" viewBox="0 0 16.97 16.97">
  <defs>
    <clipPath id="clip-path">
      <path id="Close_Button" data-name="Close Button" d="M5,12V7H0V5H5V0H7V5h5V7H7v5Z" transform="translate(9 0.515) rotate(45)" fill="#747e89"/>
    </clipPath>
  </defs>
  <g id="Group_3043" data-name="Group 3043" transform="translate(-0.515 -0.515)" clip-path="url(#clip-path)">
    <g id="_Atoms_Colour_White" data-name="⚙️Atoms/Colour/White">
      <rect id="_Atoms_Colour_White_background" data-name="⚙️Atoms/Colour/White background" width="18" height="18" fill="#747e89"/>
      <rect id="Colour" width="18" height="18" fill="#747e89" opacity="0.5"/>
    </g>
  </g>
</svg>
