{
  "plugins": [],
  "BaseCallsDirectory" : "../tests/mockFiles/SmallTestBaseCalls",
  "RunInfoPath": "../tests/mockFiles/Run/RunInfo.xml",
  "SampleSheetPath": "../tests/mockFiles/Run/SampleSheet.csv",
  "lanes": "1",
  "tiles": "1101",
  "reads": "2R,2B,2B,2R"
}
