{
  "plugins": [
    {
      "pluginPath": "../plugins/binary/libReadPositionParser.so",
      "configPath": "../tests/mockFiles/ReadPositionParserTestFiles/mockReadPositionParser_locs.json",
      "inputFragments": {},
      "outputFragments": {
        "preprocessing": [
          {
            "name": "ReadPositionFragment",
            "type": "POSITION"
          }
        ]
      }
    }
  ],
  "ramLimit": "500",
  "BaseCallsDirectory" : "../tests/mockFiles/TestBaseCalls",
  "RunInfoPath": "../tests/mockFiles/Run/RunInfo.xml",
  "SampleSheetPath": "../tests/mockFiles/Run/SampleSheet.csv"
}

