{
 "plugins": [
    {
      "pluginPath": "./../plugins/binary/libBcl2FastQ.so",
      "configPath": "../config/fastQHeader.json",
      "inputFragments": [
      ],
      "outputFragments": [
      ]
    }
  ],
 "RunInfoPath": "./mockRunInfo.xml",
 "SampleSheetPath": "../tests/mockFiles/Run/SampleSheet.csv",
 "sample-ID": "181217_18-9040_Gern-Mikrobiom A1"
}
