%YAML 1.1
%TAG !u! tag:unity3d.com,2011:
--- !u!1 &5738326744931682371
GameObject:
  m_ObjectHideFlags: 0
  m_CorrespondingSourceObject: {fileID: 0}
  m_PrefabInstance: {fileID: 0}
  m_PrefabAsset: {fileID: 0}
  serializedVersion: 6
  m_Component:
  - component: {fileID: 5738326744931682392}
  - component: {fileID: 5738326744931682375}
  - component: {fileID: 5738326744931682374}
  - component: {fileID: 5738326744931682373}
  - component: {fileID: 5738326744931682372}
  - component: {fileID: -3819280539939819802}
  m_Layer: 0
  m_Name: Obstacle
  m_TagString: Untagged
  m_Icon: {fileID: 0}
  m_NavMeshLayer: 0
  m_StaticEditorFlags: 0
  m_IsActive: 1
--- !u!4 &5738326744931682392
Transform:
  m_ObjectHideFlags: 0
  m_CorrespondingSourceObject: {fileID: 0}
  m_PrefabInstance: {fileID: 0}
  m_PrefabAsset: {fileID: 0}
  m_GameObject: {fileID: 5738326744931682371}
  m_LocalRotation: {x: 0, y: 0, z: -0.0034557567, w: 0.9999941}
  m_LocalPosition: {x: 0, y: -0.0398, z: 0}
  m_LocalScale: {x: 1, y: 0.7756003, z: 1}
  m_Children: []
  m_Father: {fileID: 0}
  m_RootOrder: 0
  m_LocalEulerAnglesHint: {x: 0, y: 0, z: -0.39600003}
--- !u!114 &5738326744931682375
MonoBehaviour:
  m_ObjectHideFlags: 0
  m_CorrespondingSourceObject: {fileID: 0}
  m_PrefabInstance: {fileID: 0}
  m_PrefabAsset: {fileID: 0}
  m_GameObject: {fileID: 5738326744931682371}
  m_Enabled: 1
  m_EditorHideFlags: 0
  m_Script: {fileID: 11500000, guid: 8233d90336aea43098adf6dbabd606a2, type: 3}
  m_Name: 
  m_EditorClassIdentifier: 
  m_MeshFormatVersion: 1
  m_Faces:
  - m_Indexes: 000000000100000002000000010000000300000002000000
    m_SmoothingGroup: 0
    m_Uv:
      m_UseWorldSpace: 0
      m_FlipU: 0
      m_FlipV: 0
      m_SwapUV: 0
      m_Fill: 1
      m_Scale: {x: 1, y: 1}
      m_Offset: {x: 0, y: 0}
      m_Rotation: 0
      m_Anchor: 9
    m_Material: {fileID: 0}
    m_SubmeshIndex: 0
    m_ManualUV: 0
    elementGroup: -1
    m_TextureGroup: -1
  - m_Indexes: 040000000500000006000000050000000700000006000000
    m_SmoothingGroup: 0
    m_Uv:
      m_UseWorldSpace: 0
      m_FlipU: 0
      m_FlipV: 0
      m_SwapUV: 0
      m_Fill: 1
      m_Scale: {x: 1, y: 1}
      m_Offset: {x: 0, y: 0}
      m_Rotation: 0
      m_Anchor: 9
    m_Material: {fileID: 0}
    m_SubmeshIndex: 0
    m_ManualUV: 0
    elementGroup: -1
    m_TextureGroup: -1
  - m_Indexes: 08000000090000000a000000090000000b0000000a000000
    m_SmoothingGroup: 0
    m_Uv:
      m_UseWorldSpace: 0
      m_FlipU: 0
      m_FlipV: 0
      m_SwapUV: 0
      m_Fill: 1
      m_Scale: {x: 1, y: 1}
      m_Offset: {x: 0, y: 0}
      m_Rotation: 0
      m_Anchor: 9
    m_Material: {fileID: 0}
    m_SubmeshIndex: 0
    m_ManualUV: 0
    elementGroup: -1
    m_TextureGroup: -1
  - m_Indexes: 0c0000000d0000000e0000000d0000000f0000000e000000
    m_SmoothingGroup: 0
    m_Uv:
      m_UseWorldSpace: 0
      m_FlipU: 0
      m_FlipV: 0
      m_SwapUV: 0
      m_Fill: 1
      m_Scale: {x: 1, y: 1}
      m_Offset: {x: 0, y: 0}
      m_Rotation: 0
      m_Anchor: 9
    m_Material: {fileID: 0}
    m_SubmeshIndex: 0
    m_ManualUV: 0
    elementGroup: -1
    m_TextureGroup: -1
  - m_Indexes: 100000001100000012000000110000001300000012000000
    m_SmoothingGroup: 0
    m_Uv:
      m_UseWorldSpace: 0
      m_FlipU: 0
      m_FlipV: 0
      m_SwapUV: 0
      m_Fill: 1
      m_Scale: {x: 1, y: 1}
      m_Offset: {x: 0, y: 0}
      m_Rotation: 0
      m_Anchor: 9
    m_Material: {fileID: 0}
    m_SubmeshIndex: 0
    m_ManualUV: 0
    elementGroup: -1
    m_TextureGroup: -1
  - m_Indexes: 140000001500000016000000150000001700000016000000
    m_SmoothingGroup: 0
    m_Uv:
      m_UseWorldSpace: 0
      m_FlipU: 0
      m_FlipV: 0
      m_SwapUV: 0
      m_Fill: 1
      m_Scale: {x: 1, y: 1}
      m_Offset: {x: 0, y: 0}
      m_Rotation: 0
      m_Anchor: 9
    m_Material: {fileID: 0}
    m_SubmeshIndex: 0
    m_ManualUV: 0
    elementGroup: -1
    m_TextureGroup: -1
  - m_Indexes: 18000000190000001a000000190000001b0000001a000000
    m_SmoothingGroup: 0
    m_Uv:
      m_UseWorldSpace: 0
      m_FlipU: 0
      m_FlipV: 0
      m_SwapUV: 0
      m_Fill: 1
      m_Scale: {x: 1, y: 1}
      m_Offset: {x: 0, y: 0}
      m_Rotation: 0
      m_Anchor: 9
    m_Material: {fileID: 0}
    m_SubmeshIndex: 0
    m_ManualUV: 0
    elementGroup: -1
    m_TextureGroup: -1
  - m_Indexes: 1c0000001d0000001e0000001d0000001f0000001e000000
    m_SmoothingGroup: 0
    m_Uv:
      m_UseWorldSpace: 0
      m_FlipU: 0
      m_FlipV: 0
      m_SwapUV: 0
      m_Fill: 1
      m_Scale: {x: 1, y: 1}
      m_Offset: {x: 0, y: 0}
      m_Rotation: 0
      m_Anchor: 9
    m_Material: {fileID: 0}
    m_SubmeshIndex: 0
    m_ManualUV: 0
    elementGroup: -1
    m_TextureGroup: -1
  - m_Indexes: 200000002100000022000000210000002300000022000000
    m_SmoothingGroup: 0
    m_Uv:
      m_UseWorldSpace: 0
      m_FlipU: 0
      m_FlipV: 0
      m_SwapUV: 0
      m_Fill: 1
      m_Scale: {x: 1, y: 1}
      m_Offset: {x: 0, y: 0}
      m_Rotation: 0
      m_Anchor: 9
    m_Material: {fileID: 0}
    m_SubmeshIndex: 0
    m_ManualUV: 0
    elementGroup: -1
    m_TextureGroup: -1
  - m_Indexes: 240000002500000026000000250000002700000026000000
    m_SmoothingGroup: 0
    m_Uv:
      m_UseWorldSpace: 0
      m_FlipU: 0
      m_FlipV: 0
      m_SwapUV: 0
      m_Fill: 1
      m_Scale: {x: 1, y: 1}
      m_Offset: {x: 0, y: 0}
      m_Rotation: 0
      m_Anchor: 9
    m_Material: {fileID: 0}
    m_SubmeshIndex: 0
    m_ManualUV: 0
    elementGroup: -1
    m_TextureGroup: -1
  - m_Indexes: 28000000290000002a000000290000002b0000002a000000
    m_SmoothingGroup: 0
    m_Uv:
      m_UseWorldSpace: 0
      m_FlipU: 0
      m_FlipV: 0
      m_SwapUV: 0
      m_Fill: 1
      m_Scale: {x: 1, y: 1}
      m_Offset: {x: 0, y: 0}
      m_Rotation: 0
      m_Anchor: 9
    m_Material: {fileID: 0}
    m_SubmeshIndex: 0
    m_ManualUV: 0
    elementGroup: -1
    m_TextureGroup: -1
  - m_Indexes: 2c0000002d0000002e0000002d0000002f0000002e000000
    m_SmoothingGroup: 0
    m_Uv:
      m_UseWorldSpace: 0
      m_FlipU: 0
      m_FlipV: 0
      m_SwapUV: 0
      m_Fill: 1
      m_Scale: {x: 1, y: 1}
      m_Offset: {x: 0, y: 0}
      m_Rotation: 0
      m_Anchor: 9
    m_Material: {fileID: 0}
    m_SubmeshIndex: 0
    m_ManualUV: 0
    elementGroup: -1
    m_TextureGroup: -1
  - m_Indexes: 300000003100000032000000310000003300000032000000
    m_SmoothingGroup: 0
    m_Uv:
      m_UseWorldSpace: 0
      m_FlipU: 0
      m_FlipV: 0
      m_SwapUV: 0
      m_Fill: 1
      m_Scale: {x: 1, y: 1}
      m_Offset: {x: 0, y: 0}
      m_Rotation: 0
      m_Anchor: 9
    m_Material: {fileID: 0}
    m_SubmeshIndex: 0
    m_ManualUV: 0
    elementGroup: -1
    m_TextureGroup: -1
  - m_Indexes: 340000003500000036000000350000003700000036000000
    m_SmoothingGroup: 0
    m_Uv:
      m_UseWorldSpace: 0
      m_FlipU: 0
      m_FlipV: 0
      m_SwapUV: 0
      m_Fill: 1
      m_Scale: {x: 1, y: 1}
      m_Offset: {x: 0, y: 0}
      m_Rotation: 0
      m_Anchor: 9
    m_Material: {fileID: 0}
    m_SubmeshIndex: 0
    m_ManualUV: 0
    elementGroup: -1
    m_TextureGroup: -1
  - m_Indexes: 38000000390000003a000000390000003b0000003a000000
    m_SmoothingGroup: 0
    m_Uv:
      m_UseWorldSpace: 0
      m_FlipU: 0
      m_FlipV: 0
      m_SwapUV: 0
      m_Fill: 1
      m_Scale: {x: 1, y: 1}
      m_Offset: {x: 0, y: 0}
      m_Rotation: 0
      m_Anchor: 9
    m_Material: {fileID: 0}
    m_SubmeshIndex: 0
    m_ManualUV: 0
    elementGroup: -1
    m_TextureGroup: -1
  - m_Indexes: 3c0000003d0000003e0000003d0000003f0000003e000000
    m_SmoothingGroup: 0
    m_Uv:
      m_UseWorldSpace: 0
      m_FlipU: 0
      m_FlipV: 0
      m_SwapUV: 0
      m_Fill: 1
      m_Scale: {x: 1, y: 1}
      m_Offset: {x: 0, y: 0}
      m_Rotation: 0
      m_Anchor: 9
    m_Material: {fileID: 0}
    m_SubmeshIndex: 0
    m_ManualUV: 0
    elementGroup: -1
    m_TextureGroup: -1
  - m_Indexes: 400000004100000042000000410000004300000042000000
    m_SmoothingGroup: 0
    m_Uv:
      m_UseWorldSpace: 0
      m_FlipU: 0
      m_FlipV: 0
      m_SwapUV: 0
      m_Fill: 1
      m_Scale: {x: 1, y: 1}
      m_Offset: {x: 0, y: 0}
      m_Rotation: 0
      m_Anchor: 9
    m_Material: {fileID: 0}
    m_SubmeshIndex: 0
    m_ManualUV: 0
    elementGroup: -1
    m_TextureGroup: -1
  - m_Indexes: 440000004500000046000000450000004700000046000000
    m_SmoothingGroup: 0
    m_Uv:
      m_UseWorldSpace: 0
      m_FlipU: 0
      m_FlipV: 0
      m_SwapUV: 0
      m_Fill: 1
      m_Scale: {x: 1, y: 1}
      m_Offset: {x: 0, y: 0}
      m_Rotation: 0
      m_Anchor: 9
    m_Material: {fileID: 0}
    m_SubmeshIndex: 0
    m_ManualUV: 0
    elementGroup: -1
    m_TextureGroup: -1
  - m_Indexes: 48000000490000004a000000490000004b0000004a000000
    m_SmoothingGroup: 0
    m_Uv:
      m_UseWorldSpace: 0
      m_FlipU: 0
      m_FlipV: 0
      m_SwapUV: 0
      m_Fill: 1
      m_Scale: {x: 1, y: 1}
      m_Offset: {x: 0, y: 0}
      m_Rotation: 0
      m_Anchor: 9
    m_Material: {fileID: 0}
    m_SubmeshIndex: 0
    m_ManualUV: 0
    elementGroup: -1
    m_TextureGroup: -1
  - m_Indexes: 4c0000004d0000004e0000004d0000004f0000004e000000
    m_SmoothingGroup: 0
    m_Uv:
      m_UseWorldSpace: 0
      m_FlipU: 0
      m_FlipV: 0
      m_SwapUV: 0
      m_Fill: 1
      m_Scale: {x: 1, y: 1}
      m_Offset: {x: 0, y: 0}
      m_Rotation: 0
      m_Anchor: 9
    m_Material: {fileID: 0}
    m_SubmeshIndex: 0
    m_ManualUV: 0
    elementGroup: -1
    m_TextureGroup: -1
  - m_Indexes: 500000005100000052000000510000005300000052000000
    m_SmoothingGroup: 0
    m_Uv:
      m_UseWorldSpace: 0
      m_FlipU: 0
      m_FlipV: 0
      m_SwapUV: 0
      m_Fill: 1
      m_Scale: {x: 1, y: 1}
      m_Offset: {x: 0, y: 0}
      m_Rotation: 0
      m_Anchor: 9
    m_Material: {fileID: 0}
    m_SubmeshIndex: 0
    m_ManualUV: 0
    elementGroup: -1
    m_TextureGroup: -1
  - m_Indexes: 540000005500000056000000550000005700000056000000
    m_SmoothingGroup: 0
    m_Uv:
      m_UseWorldSpace: 0
      m_FlipU: 0
      m_FlipV: 0
      m_SwapUV: 0
      m_Fill: 1
      m_Scale: {x: 1, y: 1}
      m_Offset: {x: 0, y: 0}
      m_Rotation: 0
      m_Anchor: 9
    m_Material: {fileID: 0}
    m_SubmeshIndex: 0
    m_ManualUV: 0
    elementGroup: -1
    m_TextureGroup: -1
  - m_Indexes: 58000000590000005a000000590000005b0000005a000000
    m_SmoothingGroup: 0
    m_Uv:
      m_UseWorldSpace: 0
      m_FlipU: 0
      m_FlipV: 0
      m_SwapUV: 0
      m_Fill: 1
      m_Scale: {x: 1, y: 1}
      m_Offset: {x: 0, y: 0}
      m_Rotation: 0
      m_Anchor: 9
    m_Material: {fileID: 0}
    m_SubmeshIndex: 0
    m_ManualUV: 0
    elementGroup: -1
    m_TextureGroup: -1
  - m_Indexes: 5c0000005d0000005e0000005d0000005f0000005e000000
    m_SmoothingGroup: 0
    m_Uv:
      m_UseWorldSpace: 0
      m_FlipU: 0
      m_FlipV: 0
      m_SwapUV: 0
      m_Fill: 1
      m_Scale: {x: 1, y: 1}
      m_Offset: {x: 0, y: 0}
      m_Rotation: 0
      m_Anchor: 9
    m_Material: {fileID: 0}
    m_SubmeshIndex: 0
    m_ManualUV: 0
    elementGroup: -1
    m_TextureGroup: -1
  - m_Indexes: 600000006100000062000000610000006300000062000000
    m_SmoothingGroup: 0
    m_Uv:
      m_UseWorldSpace: 0
      m_FlipU: 0
      m_FlipV: 0
      m_SwapUV: 0
      m_Fill: 1
      m_Scale: {x: 1, y: 1}
      m_Offset: {x: 0, y: 0}
      m_Rotation: 0
      m_Anchor: 9
    m_Material: {fileID: 0}
    m_SubmeshIndex: 0
    m_ManualUV: 0
    elementGroup: -1
    m_TextureGroup: -1
  - m_Indexes: 640000006500000066000000650000006700000066000000
    m_SmoothingGroup: 0
    m_Uv:
      m_UseWorldSpace: 0
      m_FlipU: 0
      m_FlipV: 0
      m_SwapUV: 0
      m_Fill: 1
      m_Scale: {x: 1, y: 1}
      m_Offset: {x: 0, y: 0}
      m_Rotation: 0
      m_Anchor: 9
    m_Material: {fileID: 0}
    m_SubmeshIndex: 0
    m_ManualUV: 0
    elementGroup: -1
    m_TextureGroup: -1
  - m_Indexes: 68000000690000006a000000690000006b0000006a000000
    m_SmoothingGroup: 0
    m_Uv:
      m_UseWorldSpace: 0
      m_FlipU: 0
      m_FlipV: 0
      m_SwapUV: 0
      m_Fill: 1
      m_Scale: {x: 1, y: 1}
      m_Offset: {x: 0, y: 0}
      m_Rotation: 0
      m_Anchor: 9
    m_Material: {fileID: 0}
    m_SubmeshIndex: 0
    m_ManualUV: 0
    elementGroup: -1
    m_TextureGroup: -1
  - m_Indexes: 6c0000006d0000006e0000006d0000006f0000006e000000
    m_SmoothingGroup: 0
    m_Uv:
      m_UseWorldSpace: 0
      m_FlipU: 0
      m_FlipV: 0
      m_SwapUV: 0
      m_Fill: 1
      m_Scale: {x: 1, y: 1}
      m_Offset: {x: 0, y: 0}
      m_Rotation: 0
      m_Anchor: 9
    m_Material: {fileID: 0}
    m_SubmeshIndex: 0
    m_ManualUV: 0
    elementGroup: -1
    m_TextureGroup: -1
  - m_Indexes: 700000007100000072000000710000007300000072000000
    m_SmoothingGroup: 0
    m_Uv:
      m_UseWorldSpace: 0
      m_FlipU: 0
      m_FlipV: 0
      m_SwapUV: 0
      m_Fill: 1
      m_Scale: {x: 1, y: 1}
      m_Offset: {x: 0, y: 0}
      m_Rotation: 0
      m_Anchor: 9
    m_Material: {fileID: 0}
    m_SubmeshIndex: 0
    m_ManualUV: 0
    elementGroup: -1
    m_TextureGroup: -1
  - m_Indexes: 740000007500000076000000750000007700000076000000
    m_SmoothingGroup: 0
    m_Uv:
      m_UseWorldSpace: 0
      m_FlipU: 0
      m_FlipV: 0
      m_SwapUV: 0
      m_Fill: 1
      m_Scale: {x: 1, y: 1}
      m_Offset: {x: 0, y: 0}
      m_Rotation: 0
      m_Anchor: 9
    m_Material: {fileID: 0}
    m_SubmeshIndex: 0
    m_ManualUV: 0
    elementGroup: -1
    m_TextureGroup: -1
  - m_Indexes: 78000000790000007a000000790000007b0000007a000000
    m_SmoothingGroup: 0
    m_Uv:
      m_UseWorldSpace: 0
      m_FlipU: 0
      m_FlipV: 0
      m_SwapUV: 0
      m_Fill: 1
      m_Scale: {x: 1, y: 1}
      m_Offset: {x: 0, y: 0}
      m_Rotation: 0
      m_Anchor: 9
    m_Material: {fileID: 0}
    m_SubmeshIndex: 0
    m_ManualUV: 0
    elementGroup: -1
    m_TextureGroup: -1
  - m_Indexes: 7c0000007d0000007e0000007d0000007f0000007e000000
    m_SmoothingGroup: 0
    m_Uv:
      m_UseWorldSpace: 0
      m_FlipU: 0
      m_FlipV: 0
      m_SwapUV: 0
      m_Fill: 1
      m_Scale: {x: 1, y: 1}
      m_Offset: {x: 0, y: 0}
      m_Rotation: 0
      m_Anchor: 9
    m_Material: {fileID: 0}
    m_SubmeshIndex: 0
    m_ManualUV: 0
    elementGroup: -1
    m_TextureGroup: -1
  - m_Indexes: 800000008100000082000000810000008300000082000000
    m_SmoothingGroup: 0
    m_Uv:
      m_UseWorldSpace: 0
      m_FlipU: 0
      m_FlipV: 0
      m_SwapUV: 0
      m_Fill: 1
      m_Scale: {x: 1, y: 1}
      m_Offset: {x: 0, y: 0}
      m_Rotation: 0
      m_Anchor: 9
    m_Material: {fileID: 0}
    m_SubmeshIndex: 0
    m_ManualUV: 0
    elementGroup: -1
    m_TextureGroup: -1
  - m_Indexes: 840000008500000086000000850000008700000086000000
    m_SmoothingGroup: 0
    m_Uv:
      m_UseWorldSpace: 0
      m_FlipU: 0
      m_FlipV: 0
      m_SwapUV: 0
      m_Fill: 1
      m_Scale: {x: 1, y: 1}
      m_Offset: {x: 0, y: 0}
      m_Rotation: 0
      m_Anchor: 9
    m_Material: {fileID: 0}
    m_SubmeshIndex: 0
    m_ManualUV: 0
    elementGroup: -1
    m_TextureGroup: -1
  - m_Indexes: 88000000890000008a000000890000008b0000008a000000
    m_SmoothingGroup: 0
    m_Uv:
      m_UseWorldSpace: 0
      m_FlipU: 0
      m_FlipV: 0
      m_SwapUV: 0
      m_Fill: 1
      m_Scale: {x: 1, y: 1}
      m_Offset: {x: 0, y: 0}
      m_Rotation: 0
      m_Anchor: 9
    m_Material: {fileID: 0}
    m_SubmeshIndex: 0
    m_ManualUV: 0
    elementGroup: -1
    m_TextureGroup: -1
  - m_Indexes: 8c0000008d0000008e0000008d0000008f0000008e000000
    m_SmoothingGroup: 0
    m_Uv:
      m_UseWorldSpace: 0
      m_FlipU: 0
      m_FlipV: 0
      m_SwapUV: 0
      m_Fill: 1
      m_Scale: {x: 1, y: 1}
      m_Offset: {x: 0, y: 0}
      m_Rotation: 0
      m_Anchor: 9
    m_Material: {fileID: 0}
    m_SubmeshIndex: 0
    m_ManualUV: 0
    elementGroup: -1
    m_TextureGroup: -1
  - m_Indexes: 900000009100000092000000910000009300000092000000
    m_SmoothingGroup: 0
    m_Uv:
      m_UseWorldSpace: 0
      m_FlipU: 0
      m_FlipV: 0
      m_SwapUV: 0
      m_Fill: 1
      m_Scale: {x: 1, y: 1}
      m_Offset: {x: 0, y: 0}
      m_Rotation: 0
      m_Anchor: 9
    m_Material: {fileID: 0}
    m_SubmeshIndex: 0
    m_ManualUV: 0
    elementGroup: -1
    m_TextureGroup: -1
  - m_Indexes: 940000009500000096000000950000009700000096000000
    m_SmoothingGroup: 0
    m_Uv:
      m_UseWorldSpace: 0
      m_FlipU: 0
      m_FlipV: 0
      m_SwapUV: 0
      m_Fill: 1
      m_Scale: {x: 1, y: 1}
      m_Offset: {x: 0, y: 0}
      m_Rotation: 0
      m_Anchor: 9
    m_Material: {fileID: 0}
    m_SubmeshIndex: 0
    m_ManualUV: 0
    elementGroup: -1
    m_TextureGroup: -1
  - m_Indexes: 98000000990000009a000000990000009b0000009a000000
    m_SmoothingGroup: 0
    m_Uv:
      m_UseWorldSpace: 0
      m_FlipU: 0
      m_FlipV: 0
      m_SwapUV: 0
      m_Fill: 1
      m_Scale: {x: 1, y: 1}
      m_Offset: {x: 0, y: 0}
      m_Rotation: 0
      m_Anchor: 9
    m_Material: {fileID: 0}
    m_SubmeshIndex: 0
    m_ManualUV: 0
    elementGroup: -1
    m_TextureGroup: -1
  - m_Indexes: 9c0000009d0000009e0000009d0000009f0000009e000000
    m_SmoothingGroup: 0
    m_Uv:
      m_UseWorldSpace: 0
      m_FlipU: 0
      m_FlipV: 0
      m_SwapUV: 0
      m_Fill: 1
      m_Scale: {x: 1, y: 1}
      m_Offset: {x: 0, y: 0}
      m_Rotation: 0
      m_Anchor: 9
    m_Material: {fileID: 0}
    m_SubmeshIndex: 0
    m_ManualUV: 0
    elementGroup: -1
    m_TextureGroup: -1
  - m_Indexes: a0000000a1000000a2000000a1000000a3000000a2000000
    m_SmoothingGroup: 0
    m_Uv:
      m_UseWorldSpace: 0
      m_FlipU: 0
      m_FlipV: 0
      m_SwapUV: 0
      m_Fill: 1
      m_Scale: {x: 1, y: 1}
      m_Offset: {x: 0, y: 0}
      m_Rotation: 0
      m_Anchor: 9
    m_Material: {fileID: 0}
    m_SubmeshIndex: 0
    m_ManualUV: 0
    elementGroup: -1
    m_TextureGroup: -1
  - m_Indexes: a4000000a5000000a6000000a5000000a7000000a6000000
    m_SmoothingGroup: 0
    m_Uv:
      m_UseWorldSpace: 0
      m_FlipU: 0
      m_FlipV: 0
      m_SwapUV: 0
      m_Fill: 1
      m_Scale: {x: 1, y: 1}
      m_Offset: {x: 0, y: 0}
      m_Rotation: 0
      m_Anchor: 9
    m_Material: {fileID: 0}
    m_SubmeshIndex: 0
    m_ManualUV: 0
    elementGroup: -1
    m_TextureGroup: -1
  - m_Indexes: a8000000a9000000aa000000a9000000ab000000aa000000
    m_SmoothingGroup: 0
    m_Uv:
      m_UseWorldSpace: 0
      m_FlipU: 0
      m_FlipV: 0
      m_SwapUV: 0
      m_Fill: 1
      m_Scale: {x: 1, y: 1}
      m_Offset: {x: 0, y: 0}
      m_Rotation: 0
      m_Anchor: 9
    m_Material: {fileID: 0}
    m_SubmeshIndex: 0
    m_ManualUV: 0
    elementGroup: -1
    m_TextureGroup: -1
  - m_Indexes: ac000000ad000000ae000000ad000000af000000ae000000
    m_SmoothingGroup: 0
    m_Uv:
      m_UseWorldSpace: 0
      m_FlipU: 0
      m_FlipV: 0
      m_SwapUV: 0
      m_Fill: 1
      m_Scale: {x: 1, y: 1}
      m_Offset: {x: 0, y: 0}
      m_Rotation: 0
      m_Anchor: 9
    m_Material: {fileID: 0}
    m_SubmeshIndex: 0
    m_ManualUV: 0
    elementGroup: -1
    m_TextureGroup: -1
  - m_Indexes: b0000000b1000000b2000000b1000000b3000000b2000000
    m_SmoothingGroup: 0
    m_Uv:
      m_UseWorldSpace: 0
      m_FlipU: 0
      m_FlipV: 0
      m_SwapUV: 0
      m_Fill: 1
      m_Scale: {x: 1, y: 1}
      m_Offset: {x: 0, y: 0}
      m_Rotation: 0
      m_Anchor: 9
    m_Material: {fileID: 0}
    m_SubmeshIndex: 0
    m_ManualUV: 0
    elementGroup: -1
    m_TextureGroup: -1
  - m_Indexes: b4000000b5000000b6000000b5000000b7000000b6000000
    m_SmoothingGroup: 0
    m_Uv:
      m_UseWorldSpace: 0
      m_FlipU: 0
      m_FlipV: 0
      m_SwapUV: 0
      m_Fill: 1
      m_Scale: {x: 1, y: 1}
      m_Offset: {x: 0, y: 0}
      m_Rotation: 0
      m_Anchor: 9
    m_Material: {fileID: 0}
    m_SubmeshIndex: 0
    m_ManualUV: 0
    elementGroup: -1
    m_TextureGroup: -1
  - m_Indexes: b8000000b9000000ba000000b9000000bb000000ba000000
    m_SmoothingGroup: 0
    m_Uv:
      m_UseWorldSpace: 0
      m_FlipU: 0
      m_FlipV: 0
      m_SwapUV: 0
      m_Fill: 1
      m_Scale: {x: 1, y: 1}
      m_Offset: {x: 0, y: 0}
      m_Rotation: 0
      m_Anchor: 9
    m_Material: {fileID: 0}
    m_SubmeshIndex: 0
    m_ManualUV: 0
    elementGroup: -1
    m_TextureGroup: -1
  - m_Indexes: bc000000bd000000be000000bd000000bf000000be000000
    m_SmoothingGroup: 0
    m_Uv:
      m_UseWorldSpace: 0
      m_FlipU: 0
      m_FlipV: 0
      m_SwapUV: 0
      m_Fill: 1
      m_Scale: {x: 1, y: 1}
      m_Offset: {x: 0, y: 0}
      m_Rotation: 0
      m_Anchor: 9
    m_Material: {fileID: 0}
    m_SubmeshIndex: 0
    m_ManualUV: 0
    elementGroup: -1
    m_TextureGroup: -1
  - m_Indexes: c0000000c1000000c2000000c1000000c3000000c2000000
    m_SmoothingGroup: 0
    m_Uv:
      m_UseWorldSpace: 0
      m_FlipU: 0
      m_FlipV: 0
      m_SwapUV: 0
      m_Fill: 1
      m_Scale: {x: 1, y: 1}
      m_Offset: {x: 0, y: 0}
      m_Rotation: 0
      m_Anchor: 9
    m_Material: {fileID: 0}
    m_SubmeshIndex: 0
    m_ManualUV: 0
    elementGroup: -1
    m_TextureGroup: -1
  - m_Indexes: c4000000c5000000c6000000c5000000c7000000c6000000
    m_SmoothingGroup: 0
    m_Uv:
      m_UseWorldSpace: 0
      m_FlipU: 0
      m_FlipV: 0
      m_SwapUV: 0
      m_Fill: 1
      m_Scale: {x: 1, y: 1}
      m_Offset: {x: 0, y: 0}
      m_Rotation: 0
      m_Anchor: 9
    m_Material: {fileID: 0}
    m_SubmeshIndex: 0
    m_ManualUV: 0
    elementGroup: -1
    m_TextureGroup: -1
  - m_Indexes: c8000000c9000000ca000000c9000000cb000000ca000000
    m_SmoothingGroup: 0
    m_Uv:
      m_UseWorldSpace: 0
      m_FlipU: 0
      m_FlipV: 0
      m_SwapUV: 0
      m_Fill: 1
      m_Scale: {x: 1, y: 1}
      m_Offset: {x: 0, y: 0}
      m_Rotation: 0
      m_Anchor: 9
    m_Material: {fileID: 0}
    m_SubmeshIndex: 0
    m_ManualUV: 0
    elementGroup: -1
    m_TextureGroup: -1
  - m_Indexes: cc000000cd000000ce000000cd000000cf000000ce000000
    m_SmoothingGroup: 0
    m_Uv:
      m_UseWorldSpace: 0
      m_FlipU: 0
      m_FlipV: 0
      m_SwapUV: 0
      m_Fill: 1
      m_Scale: {x: 1, y: 1}
      m_Offset: {x: 0, y: 0}
      m_Rotation: 0
      m_Anchor: 9
    m_Material: {fileID: 0}
    m_SubmeshIndex: 0
    m_ManualUV: 0
    elementGroup: -1
    m_TextureGroup: -1
  - m_Indexes: d0000000d1000000d2000000d1000000d3000000d2000000
    m_SmoothingGroup: 0
    m_Uv:
      m_UseWorldSpace: 0
      m_FlipU: 0
      m_FlipV: 0
      m_SwapUV: 0
      m_Fill: 1
      m_Scale: {x: 1, y: 1}
      m_Offset: {x: 0, y: 0}
      m_Rotation: 0
      m_Anchor: 9
    m_Material: {fileID: 0}
    m_SubmeshIndex: 0
    m_ManualUV: 0
    elementGroup: -1
    m_TextureGroup: -1
  - m_Indexes: d4000000d5000000d6000000d5000000d7000000d6000000
    m_SmoothingGroup: 0
    m_Uv:
      m_UseWorldSpace: 0
      m_FlipU: 0
      m_FlipV: 0
      m_SwapUV: 0
      m_Fill: 1
      m_Scale: {x: 1, y: 1}
      m_Offset: {x: 0, y: 0}
      m_Rotation: 0
      m_Anchor: 9
    m_Material: {fileID: 0}
    m_SubmeshIndex: 0
    m_ManualUV: 0
    elementGroup: -1
    m_TextureGroup: -1
  - m_Indexes: d8000000d9000000da000000d9000000db000000da000000
    m_SmoothingGroup: 0
    m_Uv:
      m_UseWorldSpace: 0
      m_FlipU: 0
      m_FlipV: 0
      m_SwapUV: 0
      m_Fill: 1
      m_Scale: {x: 1, y: 1}
      m_Offset: {x: 0, y: 0}
      m_Rotation: 0
      m_Anchor: 9
    m_Material: {fileID: 0}
    m_SubmeshIndex: 0
    m_ManualUV: 0
    elementGroup: -1
    m_TextureGroup: -1
  - m_Indexes: dc000000dd000000de000000dd000000df000000de000000
    m_SmoothingGroup: 0
    m_Uv:
      m_UseWorldSpace: 0
      m_FlipU: 0
      m_FlipV: 0
      m_SwapUV: 0
      m_Fill: 1
      m_Scale: {x: 1, y: 1}
      m_Offset: {x: 0, y: 0}
      m_Rotation: 0
      m_Anchor: 9
    m_Material: {fileID: 0}
    m_SubmeshIndex: 0
    m_ManualUV: 0
    elementGroup: -1
    m_TextureGroup: -1
  - m_Indexes: e0000000e1000000e2000000e1000000e3000000e2000000
    m_SmoothingGroup: 0
    m_Uv:
      m_UseWorldSpace: 0
      m_FlipU: 0
      m_FlipV: 0
      m_SwapUV: 0
      m_Fill: 1
      m_Scale: {x: 1, y: 1}
      m_Offset: {x: 0, y: 0}
      m_Rotation: 0
      m_Anchor: 9
    m_Material: {fileID: 0}
    m_SubmeshIndex: 0
    m_ManualUV: 0
    elementGroup: -1
    m_TextureGroup: -1
  - m_Indexes: e4000000e5000000e6000000e5000000e7000000e6000000
    m_SmoothingGroup: 0
    m_Uv:
      m_UseWorldSpace: 0
      m_FlipU: 0
      m_FlipV: 0
      m_SwapUV: 0
      m_Fill: 1
      m_Scale: {x: 1, y: 1}
      m_Offset: {x: 0, y: 0}
      m_Rotation: 0
      m_Anchor: 9
    m_Material: {fileID: 0}
    m_SubmeshIndex: 0
    m_ManualUV: 0
    elementGroup: -1
    m_TextureGroup: -1
  - m_Indexes: e8000000e9000000ea000000e9000000eb000000ea000000
    m_SmoothingGroup: 0
    m_Uv:
      m_UseWorldSpace: 0
      m_FlipU: 0
      m_FlipV: 0
      m_SwapUV: 0
      m_Fill: 1
      m_Scale: {x: 1, y: 1}
      m_Offset: {x: 0, y: 0}
      m_Rotation: 0
      m_Anchor: 9
    m_Material: {fileID: 0}
    m_SubmeshIndex: 0
    m_ManualUV: 0
    elementGroup: -1
    m_TextureGroup: -1
  - m_Indexes: ec000000ed000000ee000000ed000000ef000000ee000000
    m_SmoothingGroup: 0
    m_Uv:
      m_UseWorldSpace: 0
      m_FlipU: 0
      m_FlipV: 0
      m_SwapUV: 0
      m_Fill: 1
      m_Scale: {x: 1, y: 1}
      m_Offset: {x: 0, y: 0}
      m_Rotation: 0
      m_Anchor: 9
    m_Material: {fileID: 0}
    m_SubmeshIndex: 0
    m_ManualUV: 0
    elementGroup: -1
    m_TextureGroup: -1
  - m_Indexes: f0000000f1000000f2000000f1000000f3000000f2000000
    m_SmoothingGroup: 0
    m_Uv:
      m_UseWorldSpace: 0
      m_FlipU: 0
      m_FlipV: 0
      m_SwapUV: 0
      m_Fill: 1
      m_Scale: {x: 1, y: 1}
      m_Offset: {x: 0, y: 0}
      m_Rotation: 0
      m_Anchor: 9
    m_Material: {fileID: 0}
    m_SubmeshIndex: 0
    m_ManualUV: 0
    elementGroup: -1
    m_TextureGroup: -1
  - m_Indexes: f4000000f5000000f6000000f5000000f7000000f6000000
    m_SmoothingGroup: 0
    m_Uv:
      m_UseWorldSpace: 0
      m_FlipU: 0
      m_FlipV: 0
      m_SwapUV: 0
      m_Fill: 1
      m_Scale: {x: 1, y: 1}
      m_Offset: {x: 0, y: 0}
      m_Rotation: 0
      m_Anchor: 9
    m_Material: {fileID: 0}
    m_SubmeshIndex: 0
    m_ManualUV: 0
    elementGroup: -1
    m_TextureGroup: -1
  - m_Indexes: f8000000f9000000fa000000f9000000fb000000fa000000
    m_SmoothingGroup: 0
    m_Uv:
      m_UseWorldSpace: 0
      m_FlipU: 0
      m_FlipV: 0
      m_SwapUV: 0
      m_Fill: 1
      m_Scale: {x: 1, y: 1}
      m_Offset: {x: 0, y: 0}
      m_Rotation: 0
      m_Anchor: 9
    m_Material: {fileID: 0}
    m_SubmeshIndex: 0
    m_ManualUV: 0
    elementGroup: -1
    m_TextureGroup: -1
  - m_Indexes: fc000000fd000000fe000000fd000000ff000000fe000000
    m_SmoothingGroup: 0
    m_Uv:
      m_UseWorldSpace: 0
      m_FlipU: 0
      m_FlipV: 0
      m_SwapUV: 0
      m_Fill: 1
      m_Scale: {x: 1, y: 1}
      m_Offset: {x: 0, y: 0}
      m_Rotation: 0
      m_Anchor: 9
    m_Material: {fileID: 0}
    m_SubmeshIndex: 0
    m_ManualUV: 0
    elementGroup: -1
    m_TextureGroup: -1
  - m_Indexes: 000100000101000002010000010100000301000002010000
    m_SmoothingGroup: 0
    m_Uv:
      m_UseWorldSpace: 0
      m_FlipU: 0
      m_FlipV: 0
      m_SwapUV: 0
      m_Fill: 1
      m_Scale: {x: 1, y: 1}
      m_Offset: {x: 0, y: 0}
      m_Rotation: 0
      m_Anchor: 9
    m_Material: {fileID: 0}
    m_SubmeshIndex: 0
    m_ManualUV: 0
    elementGroup: -1
    m_TextureGroup: -1
  - m_Indexes: 040100000501000006010000050100000701000006010000
    m_SmoothingGroup: 0
    m_Uv:
      m_UseWorldSpace: 0
      m_FlipU: 0
      m_FlipV: 0
      m_SwapUV: 0
      m_Fill: 1
      m_Scale: {x: 1, y: 1}
      m_Offset: {x: 0, y: 0}
      m_Rotation: 0
      m_Anchor: 9
    m_Material: {fileID: 0}
    m_SubmeshIndex: 0
    m_ManualUV: 0
    elementGroup: -1
    m_TextureGroup: -1
  - m_Indexes: 08010000090100000a010000090100000b0100000a010000
    m_SmoothingGroup: 0
    m_Uv:
      m_UseWorldSpace: 0
      m_FlipU: 0
      m_FlipV: 0
      m_SwapUV: 0
      m_Fill: 1
      m_Scale: {x: 1, y: 1}
      m_Offset: {x: 0, y: 0}
      m_Rotation: 0
      m_Anchor: 9
    m_Material: {fileID: 0}
    m_SubmeshIndex: 0
    m_ManualUV: 0
    elementGroup: -1
    m_TextureGroup: -1
  - m_Indexes: 0c0100000d0100000e0100000d0100000f0100000e010000
    m_SmoothingGroup: 0
    m_Uv:
      m_UseWorldSpace: 0
      m_FlipU: 0
      m_FlipV: 0
      m_SwapUV: 0
      m_Fill: 1
      m_Scale: {x: 1, y: 1}
      m_Offset: {x: 0, y: 0}
      m_Rotation: 0
      m_Anchor: 9
    m_Material: {fileID: 0}
    m_SubmeshIndex: 0
    m_ManualUV: 0
    elementGroup: -1
    m_TextureGroup: -1
  - m_Indexes: 100100001101000012010000110100001301000012010000
    m_SmoothingGroup: 0
    m_Uv:
      m_UseWorldSpace: 0
      m_FlipU: 0
      m_FlipV: 0
      m_SwapUV: 0
      m_Fill: 1
      m_Scale: {x: 1, y: 1}
      m_Offset: {x: 0, y: 0}
      m_Rotation: 0
      m_Anchor: 9
    m_Material: {fileID: 0}
    m_SubmeshIndex: 0
    m_ManualUV: 0
    elementGroup: -1
    m_TextureGroup: -1
  - m_Indexes: 140100001501000016010000150100001701000016010000
    m_SmoothingGroup: 0
    m_Uv:
      m_UseWorldSpace: 0
      m_FlipU: 0
      m_FlipV: 0
      m_SwapUV: 0
      m_Fill: 1
      m_Scale: {x: 1, y: 1}
      m_Offset: {x: 0, y: 0}
      m_Rotation: 0
      m_Anchor: 9
    m_Material: {fileID: 0}
    m_SubmeshIndex: 0
    m_ManualUV: 0
    elementGroup: -1
    m_TextureGroup: -1
  - m_Indexes: 18010000190100001a010000190100001b0100001a010000
    m_SmoothingGroup: 0
    m_Uv:
      m_UseWorldSpace: 0
      m_FlipU: 0
      m_FlipV: 0
      m_SwapUV: 0
      m_Fill: 1
      m_Scale: {x: 1, y: 1}
      m_Offset: {x: 0, y: 0}
      m_Rotation: 0
      m_Anchor: 9
    m_Material: {fileID: 0}
    m_SubmeshIndex: 0
    m_ManualUV: 0
    elementGroup: -1
    m_TextureGroup: -1
  - m_Indexes: 1c0100001d0100001e0100001d0100001f0100001e010000
    m_SmoothingGroup: 0
    m_Uv:
      m_UseWorldSpace: 0
      m_FlipU: 0
      m_FlipV: 0
      m_SwapUV: 0
      m_Fill: 1
      m_Scale: {x: 1, y: 1}
      m_Offset: {x: 0, y: 0}
      m_Rotation: 0
      m_Anchor: 9
    m_Material: {fileID: 0}
    m_SubmeshIndex: 0
    m_ManualUV: 0
    elementGroup: -1
    m_TextureGroup: -1
  - m_Indexes: 200100002101000022010000210100002301000022010000
    m_SmoothingGroup: 0
    m_Uv:
      m_UseWorldSpace: 0
      m_FlipU: 0
      m_FlipV: 0
      m_SwapUV: 0
      m_Fill: 1
      m_Scale: {x: 1, y: 1}
      m_Offset: {x: 0, y: 0}
      m_Rotation: 0
      m_Anchor: 9
    m_Material: {fileID: 0}
    m_SubmeshIndex: 0
    m_ManualUV: 0
    elementGroup: -1
    m_TextureGroup: -1
  - m_Indexes: 240100002501000026010000250100002701000026010000
    m_SmoothingGroup: 0
    m_Uv:
      m_UseWorldSpace: 0
      m_FlipU: 0
      m_FlipV: 0
      m_SwapUV: 0
      m_Fill: 1
      m_Scale: {x: 1, y: 1}
      m_Offset: {x: 0, y: 0}
      m_Rotation: 0
      m_Anchor: 9
    m_Material: {fileID: 0}
    m_SubmeshIndex: 0
    m_ManualUV: 0
    elementGroup: -1
    m_TextureGroup: -1
  - m_Indexes: 28010000290100002a010000290100002b0100002a010000
    m_SmoothingGroup: 0
    m_Uv:
      m_UseWorldSpace: 0
      m_FlipU: 0
      m_FlipV: 0
      m_SwapUV: 0
      m_Fill: 1
      m_Scale: {x: 1, y: 1}
      m_Offset: {x: 0, y: 0}
      m_Rotation: 0
      m_Anchor: 9
    m_Material: {fileID: 0}
    m_SubmeshIndex: 0
    m_ManualUV: 0
    elementGroup: -1
    m_TextureGroup: -1
  - m_Indexes: 2c0100002d0100002e0100002d0100002f0100002e010000
    m_SmoothingGroup: 0
    m_Uv:
      m_UseWorldSpace: 0
      m_FlipU: 0
      m_FlipV: 0
      m_SwapUV: 0
      m_Fill: 1
      m_Scale: {x: 1, y: 1}
      m_Offset: {x: 0, y: 0}
      m_Rotation: 0
      m_Anchor: 9
    m_Material: {fileID: 0}
    m_SubmeshIndex: 0
    m_ManualUV: 0
    elementGroup: -1
    m_TextureGroup: -1
  - m_Indexes: 300100003101000032010000310100003301000032010000
    m_SmoothingGroup: 0
    m_Uv:
      m_UseWorldSpace: 0
      m_FlipU: 0
      m_FlipV: 0
      m_SwapUV: 0
      m_Fill: 1
      m_Scale: {x: 1, y: 1}
      m_Offset: {x: 0, y: 0}
      m_Rotation: 0
      m_Anchor: 9
    m_Material: {fileID: 0}
    m_SubmeshIndex: 0
    m_ManualUV: 0
    elementGroup: -1
    m_TextureGroup: -1
  - m_Indexes: 340100003501000036010000350100003701000036010000
    m_SmoothingGroup: 0
    m_Uv:
      m_UseWorldSpace: 0
      m_FlipU: 0
      m_FlipV: 0
      m_SwapUV: 0
      m_Fill: 1
      m_Scale: {x: 1, y: 1}
      m_Offset: {x: 0, y: 0}
      m_Rotation: 0
      m_Anchor: 9
    m_Material: {fileID: 0}
    m_SubmeshIndex: 0
    m_ManualUV: 0
    elementGroup: -1
    m_TextureGroup: -1
  - m_Indexes: 38010000390100003a010000390100003b0100003a010000
    m_SmoothingGroup: 0
    m_Uv:
      m_UseWorldSpace: 0
      m_FlipU: 0
      m_FlipV: 0
      m_SwapUV: 0
      m_Fill: 1
      m_Scale: {x: 1, y: 1}
      m_Offset: {x: 0, y: 0}
      m_Rotation: 0
      m_Anchor: 9
    m_Material: {fileID: 0}
    m_SubmeshIndex: 0
    m_ManualUV: 0
    elementGroup: -1
    m_TextureGroup: -1
  - m_Indexes: 3c0100003d0100003e0100003d0100003f0100003e010000
    m_SmoothingGroup: 0
    m_Uv:
      m_UseWorldSpace: 0
      m_FlipU: 0
      m_FlipV: 0
      m_SwapUV: 0
      m_Fill: 1
      m_Scale: {x: 1, y: 1}
      m_Offset: {x: 0, y: 0}
      m_Rotation: 0
      m_Anchor: 9
    m_Material: {fileID: 0}
    m_SubmeshIndex: 0
    m_ManualUV: 0
    elementGroup: -1
    m_TextureGroup: -1
  - m_Indexes: 400100004101000042010000410100004301000042010000
    m_SmoothingGroup: 0
    m_Uv:
      m_UseWorldSpace: 0
      m_FlipU: 0
      m_FlipV: 0
      m_SwapUV: 0
      m_Fill: 1
      m_Scale: {x: 1, y: 1}
      m_Offset: {x: 0, y: 0}
      m_Rotation: 0
      m_Anchor: 9
    m_Material: {fileID: 0}
    m_SubmeshIndex: 0
    m_ManualUV: 0
    elementGroup: -1
    m_TextureGroup: -1
  - m_Indexes: 440100004501000046010000450100004701000046010000
    m_SmoothingGroup: 0
    m_Uv:
      m_UseWorldSpace: 0
      m_FlipU: 0
      m_FlipV: 0
      m_SwapUV: 0
      m_Fill: 1
      m_Scale: {x: 1, y: 1}
      m_Offset: {x: 0, y: 0}
      m_Rotation: 0
      m_Anchor: 9
    m_Material: {fileID: 0}
    m_SubmeshIndex: 0
    m_ManualUV: 0
    elementGroup: -1
    m_TextureGroup: -1
  m_SharedVertices:
  - m_Vertices: 000000000a000000ad000000
  - m_Vertices: 010000000c000000ac000000b5000000
  - m_Vertices: 0200000008000000a8000000
  - m_Vertices: 030000000e000000a9000000b0000000
  - m_Vertices: 0400000011000000ae000000b7000000
  - m_Vertices: 050000000b000000af000000
  - m_Vertices: 0600000013000000ab000000b2000000
  - m_Vertices: 0700000009000000aa000000
  - m_Vertices: 0d00000014000000b4000000bd000000
  - m_Vertices: 0f00000016000000b1000000b8000000
  - m_Vertices: 1000000019000000b6000000bf000000
  - m_Vertices: 120000001b000000b3000000ba000000
  - m_Vertices: 150000001c000000bc000000c5000000
  - m_Vertices: 170000001e000000b9000000c0000000
  - m_Vertices: 1800000021000000be000000c7000000
  - m_Vertices: 1a00000023000000bb000000c2000000
  - m_Vertices: 1d00000024000000c4000000cd000000
  - m_Vertices: 1f00000026000000c1000000c8000000
  - m_Vertices: 2000000029000000c6000000cf000000
  - m_Vertices: 220000002b000000c3000000ca000000
  - m_Vertices: 250000002c000000cc000000d5000000
  - m_Vertices: 270000002e000000c9000000d0000000
  - m_Vertices: 2800000031000000ce000000d7000000
  - m_Vertices: 2a00000033000000cb000000d2000000
  - m_Vertices: 2d00000034000000d4000000dd000000
  - m_Vertices: 2f00000036000000d1000000d8000000
  - m_Vertices: 3000000039000000d6000000df000000
  - m_Vertices: 320000003b000000d3000000da000000
  - m_Vertices: 350000003c000000dc000000e5000000
  - m_Vertices: 370000003e000000d9000000e0000000
  - m_Vertices: 3800000041000000de000000e7000000
  - m_Vertices: 3a00000043000000db000000e2000000
  - m_Vertices: 3d00000044000000e4000000ed000000
  - m_Vertices: 3f00000046000000e1000000e8000000
  - m_Vertices: 4000000049000000e6000000ef000000
  - m_Vertices: 420000004b000000e3000000ea000000
  - m_Vertices: 450000004c000000ec000000f5000000
  - m_Vertices: 470000004e000000e9000000f0000000
  - m_Vertices: 4800000051000000ee000000f7000000
  - m_Vertices: 4a00000053000000eb000000f2000000
  - m_Vertices: 4d00000054000000f4000000fd000000
  - m_Vertices: 4f00000056000000f1000000f8000000
  - m_Vertices: 5000000059000000f6000000ff000000
  - m_Vertices: 520000005b000000f3000000fa000000
  - m_Vertices: 550000005c000000fc00000005010000
  - m_Vertices: 570000005e000000f900000000010000
  - m_Vertices: 5800000061000000fe00000007010000
  - m_Vertices: 5a00000063000000fb00000002010000
  - m_Vertices: 5d00000064000000040100000d010000
  - m_Vertices: 5f000000660000000101000008010000
  - m_Vertices: 6000000069000000060100000f010000
  - m_Vertices: 620000006b000000030100000a010000
  - m_Vertices: 650000006c0000000c01000015010000
  - m_Vertices: 670000006e0000000901000010010000
  - m_Vertices: 68000000710000000e01000017010000
  - m_Vertices: 6a000000730000000b01000012010000
  - m_Vertices: 6d00000074000000140100001d010000
  - m_Vertices: 6f000000760000001101000018010000
  - m_Vertices: 7000000079000000160100001f010000
  - m_Vertices: 720000007b000000130100001a010000
  - m_Vertices: 750000007c0000001c01000025010000
  - m_Vertices: 770000007e0000001901000020010000
  - m_Vertices: 78000000810000001e01000027010000
  - m_Vertices: 7a000000830000001b01000022010000
  - m_Vertices: 7d00000084000000240100002d010000
  - m_Vertices: 7f000000860000002101000028010000
  - m_Vertices: 8000000089000000260100002f010000
  - m_Vertices: 820000008b000000230100002a010000
  - m_Vertices: 850000008c0000002c01000035010000
  - m_Vertices: 870000008e0000002901000030010000
  - m_Vertices: 88000000910000002e01000037010000
  - m_Vertices: 8a000000930000002b01000032010000
  - m_Vertices: 8d00000094000000340100003d010000
  - m_Vertices: 8f000000960000003101000038010000
  - m_Vertices: 9000000099000000360100003f010000
  - m_Vertices: 920000009b000000330100003a010000
  - m_Vertices: 950000009c0000003c01000045010000
  - m_Vertices: 970000009e0000003901000040010000
  - m_Vertices: 98000000a10000003e01000047010000
  - m_Vertices: 9a000000a30000003b01000042010000
  - m_Vertices: 9d000000a700000044010000
  - m_Vertices: 9f000000a500000041010000
  - m_Vertices: a0000000a600000046010000
  - m_Vertices: a2000000a400000043010000
  m_SharedTextures: []
  m_Positions:
  - {x: 0.09090099, y: -0.17677669, z: -0.05}
  - {x: 0.090515494, y: -0.15714678, z: -0.05}
  - {x: 0.09090099, y: -0.17677669, z: 0.05}
  - {x: 0.090515494, y: -0.15714678, z: 0.05}
  - {x: 0.040554047, y: -0.15910977, z: -0.05}
  - {x: 0.040900975, y: -0.17677669, z: -0.05}
  - {x: 0.040554047, y: -0.15910977, z: 0.05}
  - {x: 0.040900975, y: -0.17677669, z: 0.05}
  - {x: 0.09090099, y: -0.17677669, z: 0.05}
  - {x: 0.040900975, y: -0.17677669, z: 0.05}
  - {x: 0.09090099, y: -0.17677669, z: -0.05}
  - {x: 0.040900975, y: -0.17677669, z: -0.05}
  - {x: 0.090515494, y: -0.15714678, z: -0.05}
  - {x: 0.08935964, y: -0.13754714, z: -0.05}
  - {x: 0.090515494, y: -0.15714678, z: 0.05}
  - {x: 0.08935964, y: -0.13754714, z: 0.05}
  - {x: 0.039513767, y: -0.1414701, z: -0.05}
  - {x: 0.040554047, y: -0.15910977, z: -0.05}
  - {x: 0.039513767, y: -0.1414701, z: 0.05}
  - {x: 0.040554047, y: -0.15910977, z: 0.05}
  - {x: 0.08935964, y: -0.13754714, z: -0.05}
  - {x: 0.087435216, y: -0.118007995, z: -0.05}
  - {x: 0.08935964, y: -0.13754714, z: 0.05}
  - {x: 0.087435216, y: -0.118007995, z: 0.05}
  - {x: 0.037781775, y: -0.12388487, z: -0.05}
  - {x: 0.039513767, y: -0.1414701, z: -0.05}
  - {x: 0.037781775, y: -0.12388487, z: 0.05}
  - {x: 0.039513767, y: -0.1414701, z: 0.05}
  - {x: 0.087435216, y: -0.118007995, z: -0.05}
  - {x: 0.08474517, y: -0.098559454, z: -0.05}
  - {x: 0.087435216, y: -0.118007995, z: 0.05}
  - {x: 0.08474517, y: -0.098559454, z: 0.05}
  - {x: 0.035360754, y: -0.10638118, z: -0.05}
  - {x: 0.037781775, y: -0.12388487, z: -0.05}
  - {x: 0.035360754, y: -0.10638118, z: 0.05}
  - {x: 0.037781775, y: -0.12388487, z: 0.05}
  - {x: 0.08474517, y: -0.098559454, z: -0.05}
  - {x: 0.08129361, y: -0.07923153, z: -0.05}
  - {x: 0.08474517, y: -0.098559454, z: 0.05}
  - {x: 0.08129361, y: -0.07923153, z: 0.05}
  - {x: 0.03225434, y: -0.08898605, z: -0.05}
  - {x: 0.035360754, y: -0.10638118, z: -0.05}
  - {x: 0.03225434, y: -0.08898605, z: 0.05}
  - {x: 0.035360754, y: -0.10638118, z: 0.05}
  - {x: 0.08129361, y: -0.07923153, z: -0.05}
  - {x: 0.07708594, y: -0.06005401, z: -0.05}
  - {x: 0.08129361, y: -0.07923153, z: 0.05}
  - {x: 0.07708594, y: -0.06005401, z: 0.05}
  - {x: 0.028467447, y: -0.071726285, z: -0.05}
  - {x: 0.03225434, y: -0.08898605, z: -0.05}
  - {x: 0.028467447, y: -0.071726285, z: 0.05}
  - {x: 0.03225434, y: -0.08898605, z: 0.05}
  - {x: 0.07708594, y: -0.06005401, z: -0.05}
  - {x: 0.072128594, y: -0.04105647, z: -0.05}
  - {x: 0.07708594, y: -0.06005401, z: 0.05}
  - {x: 0.072128594, y: -0.04105647, z: 0.05}
  - {x: 0.02400583, y: -0.05462849, z: -0.05}
  - {x: 0.028467447, y: -0.071726285, z: -0.05}
  - {x: 0.02400583, y: -0.05462849, z: 0.05}
  - {x: 0.028467447, y: -0.071726285, z: 0.05}
  - {x: 0.072128594, y: -0.04105647, z: -0.05}
  - {x: 0.06642926, y: -0.022268191, z: -0.05}
  - {x: 0.072128594, y: -0.04105647, z: 0.05}
  - {x: 0.06642926, y: -0.022268191, z: 0.05}
  - {x: 0.018876433, y: -0.03771904, z: -0.05}
  - {x: 0.02400583, y: -0.05462849, z: -0.05}
  - {x: 0.018876433, y: -0.03771904, z: 0.05}
  - {x: 0.02400583, y: -0.05462849, z: 0.05}
  - {x: 0.06642926, y: -0.022268191, z: -0.05}
  - {x: 0.059996665, y: -0.0037181675, z: -0.05}
  - {x: 0.06642926, y: -0.022268191, z: 0.05}
  - {x: 0.059996665, y: -0.0037181675, z: 0.05}
  - {x: 0.013087094, y: -0.021024019, z: -0.05}
  - {x: 0.018876433, y: -0.03771904, z: -0.05}
  - {x: 0.013087094, y: -0.021024019, z: 0.05}
  - {x: 0.018876433, y: -0.03771904, z: 0.05}
  - {x: 0.059996665, y: -0.0037181675, z: -0.05}
  - {x: 0.05284074, y: 0.014565036, z: -0.05}
  - {x: 0.059996665, y: -0.0037181675, z: 0.05}
  - {x: 0.05284074, y: 0.014565036, z: 0.05}
  - {x: 0.0066467524, y: -0.004569143, z: -0.05}
  - {x: 0.013087094, y: -0.021024019, z: -0.05}
  - {x: 0.0066467524, y: -0.004569143, z: 0.05}
  - {x: 0.013087094, y: -0.021024019, z: 0.05}
  - {x: 0.05284074, y: 0.014565036, z: -0.05}
  - {x: 0.04497257, y: 0.03255318, z: -0.05}
  - {x: 0.05284074, y: 0.014565036, z: 0.05}
  - {x: 0.04497257, y: 0.03255318, z: 0.05}
  - {x: -0.00043460727, y: 0.011620194, z: -0.05}
  - {x: 0.0066467524, y: -0.004569143, z: -0.05}
  - {x: -0.00043460727, y: 0.011620194, z: 0.05}
  - {x: 0.0066467524, y: -0.004569143, z: 0.05}
  - {x: 0.04497257, y: 0.03255318, z: -0.05}
  - {x: 0.036404252, y: 0.050218552, z: -0.05}
  - {x: 0.04497257, y: 0.03255318, z: 0.05}
  - {x: 0.036404252, y: 0.050218552, z: 0.05}
  - {x: -0.008146077, y: 0.027519017, z: -0.05}
  - {x: -0.00043460727, y: 0.011620194, z: -0.05}
  - {x: -0.008146077, y: 0.027519017, z: 0.05}
  - {x: -0.00043460727, y: 0.011620194, z: 0.05}
  - {x: 0.036404252, y: 0.050218552, z: -0.05}
  - {x: 0.027148992, y: 0.06753391, z: -0.05}
  - {x: 0.036404252, y: 0.050218552, z: 0.05}
  - {x: 0.027148992, y: 0.06753391, z: 0.05}
  - {x: -0.016475827, y: 0.043102846, z: -0.05}
  - {x: -0.008146077, y: 0.027519017, z: -0.05}
  - {x: -0.016475827, y: 0.043102846, z: 0.05}
  - {x: -0.008146077, y: 0.027519017, z: 0.05}
  - {x: 0.027148992, y: 0.06753391, z: -0.05}
  - {x: 0.017221063, y: 0.08447258, z: -0.05}
  - {x: 0.027148992, y: 0.06753391, z: 0.05}
  - {x: 0.017221063, y: 0.08447258, z: 0.05}
  - {x: -0.02541095, y: 0.058347642, z: -0.05}
  - {x: -0.016475827, y: 0.043102846, z: -0.05}
  - {x: -0.02541095, y: 0.058347642, z: 0.05}
  - {x: -0.016475827, y: 0.043102846, z: 0.05}
  - {x: 0.017221063, y: 0.08447258, z: -0.05}
  - {x: 0.006635785, y: 0.10100843, z: -0.05}
  - {x: 0.017221063, y: 0.08447258, z: 0.05}
  - {x: 0.006635785, y: 0.10100843, z: 0.05}
  - {x: -0.03493771, y: 0.073229924, z: -0.05}
  - {x: -0.02541095, y: 0.058347642, z: -0.05}
  - {x: -0.03493771, y: 0.073229924, z: 0.05}
  - {x: -0.02541095, y: 0.058347642, z: 0.05}
  - {x: 0.006635785, y: 0.10100843, z: -0.05}
  - {x: -0.0045905113, y: 0.11711593, z: -0.05}
  - {x: 0.006635785, y: 0.10100843, z: 0.05}
  - {x: -0.0045905113, y: 0.11711593, z: 0.05}
  - {x: -0.045041382, y: 0.08772667, z: -0.05}
  - {x: -0.03493771, y: 0.073229924, z: -0.05}
  - {x: -0.045041382, y: 0.08772667, z: 0.05}
  - {x: -0.03493771, y: 0.073229924, z: 0.05}
  - {x: -0.0045905113, y: 0.11711593, z: -0.05}
  - {x: -0.01644054, y: 0.13277029, z: -0.05}
  - {x: -0.0045905113, y: 0.11711593, z: 0.05}
  - {x: -0.01644054, y: 0.13277029, z: 0.05}
  - {x: -0.05570641, y: 0.10181557, z: -0.05}
  - {x: -0.045041382, y: 0.08772667, z: -0.05}
  - {x: -0.05570641, y: 0.10181557, z: 0.05}
  - {x: -0.045041382, y: 0.08772667, z: 0.05}
  - {x: -0.01644054, y: 0.13277029, z: -0.05}
  - {x: -0.028896034, y: 0.14794733, z: -0.05}
  - {x: -0.01644054, y: 0.13277029, z: 0.05}
  - {x: -0.028896034, y: 0.14794733, z: 0.05}
  - {x: -0.06691635, y: 0.115474924, z: -0.05}
  - {x: -0.05570641, y: 0.10181557, z: -0.05}
  - {x: -0.06691635, y: 0.115474924, z: 0.05}
  - {x: -0.05570641, y: 0.10181557, z: 0.05}
  - {x: -0.028896034, y: 0.14794733, z: -0.05}
  - {x: -0.04193777, y: 0.16262369, z: -0.05}
  - {x: -0.028896034, y: 0.14794733, z: 0.05}
  - {x: -0.04193777, y: 0.16262369, z: 0.05}
  - {x: -0.0786539, y: 0.12868364, z: -0.05}
  - {x: -0.06691635, y: 0.115474924, z: -0.05}
  - {x: -0.0786539, y: 0.12868364, z: 0.05}
  - {x: -0.06691635, y: 0.115474924, z: 0.05}
  - {x: -0.04193777, y: 0.16262369, z: -0.05}
  - {x: -0.055545628, y: 0.17677669, z: -0.05}
  - {x: -0.04193777, y: 0.16262369, z: 0.05}
  - {x: -0.055545628, y: 0.17677669, z: 0.05}
  - {x: -0.09090099, y: 0.14142133, z: -0.05}
  - {x: -0.0786539, y: 0.12868364, z: -0.05}
  - {x: -0.09090099, y: 0.14142133, z: 0.05}
  - {x: -0.0786539, y: 0.12868364, z: 0.05}
  - {x: -0.09090099, y: 0.14142133, z: 0.05}
  - {x: -0.055545628, y: 0.17677669, z: 0.05}
  - {x: -0.09090099, y: 0.14142133, z: -0.05}
  - {x: -0.055545628, y: 0.17677669, z: -0.05}
  - {x: 0.09090099, y: -0.17677669, z: 0.05}
  - {x: 0.090515494, y: -0.15714678, z: 0.05}
  - {x: 0.040900975, y: -0.17677669, z: 0.05}
  - {x: 0.040554047, y: -0.15910977, z: 0.05}
  - {x: 0.090515494, y: -0.15714678, z: -0.05}
  - {x: 0.09090099, y: -0.17677669, z: -0.05}
  - {x: 0.040554047, y: -0.15910977, z: -0.05}
  - {x: 0.040900975, y: -0.17677669, z: -0.05}
  - {x: 0.090515494, y: -0.15714678, z: 0.05}
  - {x: 0.08935964, y: -0.13754714, z: 0.05}
  - {x: 0.040554047, y: -0.15910977, z: 0.05}
  - {x: 0.039513767, y: -0.1414701, z: 0.05}
  - {x: 0.08935964, y: -0.13754714, z: -0.05}
  - {x: 0.090515494, y: -0.15714678, z: -0.05}
  - {x: 0.039513767, y: -0.1414701, z: -0.05}
  - {x: 0.040554047, y: -0.15910977, z: -0.05}
  - {x: 0.08935964, y: -0.13754714, z: 0.05}
  - {x: 0.087435216, y: -0.118007995, z: 0.05}
  - {x: 0.039513767, y: -0.1414701, z: 0.05}
  - {x: 0.037781775, y: -0.12388487, z: 0.05}
  - {x: 0.087435216, y: -0.118007995, z: -0.05}
  - {x: 0.08935964, y: -0.13754714, z: -0.05}
  - {x: 0.037781775, y: -0.12388487, z: -0.05}
  - {x: 0.039513767, y: -0.1414701, z: -0.05}
  - {x: 0.087435216, y: -0.118007995, z: 0.05}
  - {x: 0.08474517, y: -0.098559454, z: 0.05}
  - {x: 0.037781775, y: -0.12388487, z: 0.05}
  - {x: 0.035360754, y: -0.10638118, z: 0.05}
  - {x: 0.08474517, y: -0.098559454, z: -0.05}
  - {x: 0.087435216, y: -0.118007995, z: -0.05}
  - {x: 0.035360754, y: -0.10638118, z: -0.05}
  - {x: 0.037781775, y: -0.12388487, z: -0.05}
  - {x: 0.08474517, y: -0.098559454, z: 0.05}
  - {x: 0.08129361, y: -0.07923153, z: 0.05}
  - {x: 0.035360754, y: -0.10638118, z: 0.05}
  - {x: 0.03225434, y: -0.08898605, z: 0.05}
  - {x: 0.08129361, y: -0.07923153, z: -0.05}
  - {x: 0.08474517, y: -0.098559454, z: -0.05}
  - {x: 0.03225434, y: -0.08898605, z: -0.05}
  - {x: 0.035360754, y: -0.10638118, z: -0.05}
  - {x: 0.08129361, y: -0.07923153, z: 0.05}
  - {x: 0.07708594, y: -0.06005401, z: 0.05}
  - {x: 0.03225434, y: -0.08898605, z: 0.05}
  - {x: 0.028467447, y: -0.071726285, z: 0.05}
  - {x: 0.07708594, y: -0.06005401, z: -0.05}
  - {x: 0.08129361, y: -0.07923153, z: -0.05}
  - {x: 0.028467447, y: -0.071726285, z: -0.05}
  - {x: 0.03225434, y: -0.08898605, z: -0.05}
  - {x: 0.07708594, y: -0.06005401, z: 0.05}
  - {x: 0.072128594, y: -0.04105647, z: 0.05}
  - {x: 0.028467447, y: -0.071726285, z: 0.05}
  - {x: 0.02400583, y: -0.05462849, z: 0.05}
  - {x: 0.072128594, y: -0.04105647, z: -0.05}
  - {x: 0.07708594, y: -0.06005401, z: -0.05}
  - {x: 0.02400583, y: -0.05462849, z: -0.05}
  - {x: 0.028467447, y: -0.071726285, z: -0.05}
  - {x: 0.072128594, y: -0.04105647, z: 0.05}
  - {x: 0.06642926, y: -0.022268191, z: 0.05}
  - {x: 0.02400583, y: -0.05462849, z: 0.05}
  - {x: 0.018876433, y: -0.03771904, z: 0.05}
  - {x: 0.06642926, y: -0.022268191, z: -0.05}
  - {x: 0.072128594, y: -0.04105647, z: -0.05}
  - {x: 0.018876433, y: -0.03771904, z: -0.05}
  - {x: 0.02400583, y: -0.05462849, z: -0.05}
  - {x: 0.06642926, y: -0.022268191, z: 0.05}
  - {x: 0.059996665, y: -0.0037181675, z: 0.05}
  - {x: 0.018876433, y: -0.03771904, z: 0.05}
  - {x: 0.013087094, y: -0.021024019, z: 0.05}
  - {x: 0.059996665, y: -0.0037181675, z: -0.05}
  - {x: 0.06642926, y: -0.022268191, z: -0.05}
  - {x: 0.013087094, y: -0.021024019, z: -0.05}
  - {x: 0.018876433, y: -0.03771904, z: -0.05}
  - {x: 0.059996665, y: -0.0037181675, z: 0.05}
  - {x: 0.05284074, y: 0.014565036, z: 0.05}
  - {x: 0.013087094, y: -0.021024019, z: 0.05}
  - {x: 0.0066467524, y: -0.004569143, z: 0.05}
  - {x: 0.05284074, y: 0.014565036, z: -0.05}
  - {x: 0.059996665, y: -0.0037181675, z: -0.05}
  - {x: 0.0066467524, y: -0.004569143, z: -0.05}
  - {x: 0.013087094, y: -0.021024019, z: -0.05}
  - {x: 0.05284074, y: 0.014565036, z: 0.05}
  - {x: 0.04497257, y: 0.03255318, z: 0.05}
  - {x: 0.0066467524, y: -0.004569143, z: 0.05}
  - {x: -0.00043460727, y: 0.011620194, z: 0.05}
  - {x: 0.04497257, y: 0.03255318, z: -0.05}
  - {x: 0.05284074, y: 0.014565036, z: -0.05}
  - {x: -0.00043460727, y: 0.011620194, z: -0.05}
  - {x: 0.0066467524, y: -0.004569143, z: -0.05}
  - {x: 0.04497257, y: 0.03255318, z: 0.05}
  - {x: 0.036404252, y: 0.050218552, z: 0.05}
  - {x: -0.00043460727, y: 0.011620194, z: 0.05}
  - {x: -0.008146077, y: 0.027519017, z: 0.05}
  - {x: 0.036404252, y: 0.050218552, z: -0.05}
  - {x: 0.04497257, y: 0.03255318, z: -0.05}
  - {x: -0.008146077, y: 0.027519017, z: -0.05}
  - {x: -0.00043460727, y: 0.011620194, z: -0.05}
  - {x: 0.036404252, y: 0.050218552, z: 0.05}
  - {x: 0.027148992, y: 0.06753391, z: 0.05}
  - {x: -0.008146077, y: 0.027519017, z: 0.05}
  - {x: -0.016475827, y: 0.043102846, z: 0.05}
  - {x: 0.027148992, y: 0.06753391, z: -0.05}
  - {x: 0.036404252, y: 0.050218552, z: -0.05}
  - {x: -0.016475827, y: 0.043102846, z: -0.05}
  - {x: -0.008146077, y: 0.027519017, z: -0.05}
  - {x: 0.027148992, y: 0.06753391, z: 0.05}
  - {x: 0.017221063, y: 0.08447258, z: 0.05}
  - {x: -0.016475827, y: 0.043102846, z: 0.05}
  - {x: -0.02541095, y: 0.058347642, z: 0.05}
  - {x: 0.017221063, y: 0.08447258, z: -0.05}
  - {x: 0.027148992, y: 0.06753391, z: -0.05}
  - {x: -0.02541095, y: 0.058347642, z: -0.05}
  - {x: -0.016475827, y: 0.043102846, z: -0.05}
  - {x: 0.017221063, y: 0.08447258, z: 0.05}
  - {x: 0.006635785, y: 0.10100843, z: 0.05}
  - {x: -0.02541095, y: 0.058347642, z: 0.05}
  - {x: -0.03493771, y: 0.073229924, z: 0.05}
  - {x: 0.006635785, y: 0.10100843, z: -0.05}
  - {x: 0.017221063, y: 0.08447258, z: -0.05}
  - {x: -0.03493771, y: 0.073229924, z: -0.05}
  - {x: -0.02541095, y: 0.058347642, z: -0.05}
  - {x: 0.006635785, y: 0.10100843, z: 0.05}
  - {x: -0.0045905113, y: 0.11711593, z: 0.05}
  - {x: -0.03493771, y: 0.073229924, z: 0.05}
  - {x: -0.045041382, y: 0.08772667, z: 0.05}
  - {x: -0.0045905113, y: 0.11711593, z: -0.05}
  - {x: 0.006635785, y: 0.10100843, z: -0.05}
  - {x: -0.045041382, y: 0.08772667, z: -0.05}
  - {x: -0.03493771, y: 0.073229924, z: -0.05}
  - {x: -0.0045905113, y: 0.11711593, z: 0.05}
  - {x: -0.01644054, y: 0.13277029, z: 0.05}
  - {x: -0.045041382, y: 0.08772667, z: 0.05}
  - {x: -0.05570641, y: 0.10181557, z: 0.05}
  - {x: -0.01644054, y: 0.13277029, z: -0.05}
  - {x: -0.0045905113, y: 0.11711593, z: -0.05}
  - {x: -0.05570641, y: 0.10181557, z: -0.05}
  - {x: -0.045041382, y: 0.08772667, z: -0.05}
  - {x: -0.01644054, y: 0.13277029, z: 0.05}
  - {x: -0.028896034, y: 0.14794733, z: 0.05}
  - {x: -0.05570641, y: 0.10181557, z: 0.05}
  - {x: -0.06691635, y: 0.115474924, z: 0.05}
  - {x: -0.028896034, y: 0.14794733, z: -0.05}
  - {x: -0.01644054, y: 0.13277029, z: -0.05}
  - {x: -0.06691635, y: 0.115474924, z: -0.05}
  - {x: -0.05570641, y: 0.10181557, z: -0.05}
  - {x: -0.028896034, y: 0.14794733, z: 0.05}
  - {x: -0.04193777, y: 0.16262369, z: 0.05}
  - {x: -0.06691635, y: 0.115474924, z: 0.05}
  - {x: -0.0786539, y: 0.12868364, z: 0.05}
  - {x: -0.04193777, y: 0.16262369, z: -0.05}
  - {x: -0.028896034, y: 0.14794733, z: -0.05}
  - {x: -0.0786539, y: 0.12868364, z: -0.05}
  - {x: -0.06691635, y: 0.115474924, z: -0.05}
  - {x: -0.04193777, y: 0.16262369, z: 0.05}
  - {x: -0.055545628, y: 0.17677669, z: 0.05}
  - {x: -0.0786539, y: 0.12868364, z: 0.05}
  - {x: -0.09090099, y: 0.14142133, z: 0.05}
  - {x: -0.055545628, y: 0.17677669, z: -0.05}
  - {x: -0.04193777, y: 0.16262369, z: -0.05}
  - {x: -0.09090099, y: 0.14142133, z: -0.05}
  - {x: -0.0786539, y: 0.12868364, z: -0.05}
  m_Textures0:
  - {x: -0.05, y: -0.17852738}
  - {x: -0.05, y: -0.15889369}
  - {x: 0.05, y: -0.17852738}
  - {x: 0.05, y: -0.15889369}
  - {x: 0.05, y: -0.15987532}
  - {x: 0.05, y: -0.17754564}
  - {x: -0.05, y: -0.15987532}
  - {x: -0.05, y: -0.17754564}
  - {x: -0.09090099, y: 0.05}
  - {x: -0.040900975, y: 0.05}
  - {x: -0.09090099, y: -0.05}
  - {x: -0.040900975, y: -0.05}
  - {x: -0.05, y: -0.16220295}
  - {x: -0.05, y: -0.14256926}
  - {x: 0.05, y: -0.16220295}
  - {x: 0.05, y: -0.14256926}
  - {x: 0.05, y: -0.14355098}
  - {x: 0.05, y: -0.16122128}
  - {x: -0.05, y: -0.14355098}
  - {x: -0.05, y: -0.16122128}
  - {x: -0.05, y: -0.14564353}
  - {x: -0.05, y: -0.12600985}
  - {x: 0.05, y: -0.14564353}
  - {x: 0.05, y: -0.12600985}
  - {x: 0.05, y: -0.12699158}
  - {x: 0.05, y: -0.1446619}
  - {x: -0.05, y: -0.12699158}
  - {x: -0.05, y: -0.1446619}
  - {x: -0.05, y: -0.12887476}
  - {x: -0.05, y: -0.10924106}
  - {x: 0.05, y: -0.12887476}
  - {x: 0.05, y: -0.10924106}
  - {x: 0.05, y: -0.11022276}
  - {x: 0.05, y: -0.12789309}
  - {x: -0.05, y: -0.11022276}
  - {x: -0.05, y: -0.12789309}
  - {x: -0.05, y: -0.11192252}
  - {x: -0.05, y: -0.09228883}
  - {x: 0.05, y: -0.11192252}
  - {x: 0.05, y: -0.09228883}
  - {x: 0.05, y: -0.09327046}
  - {x: 0.05, y: -0.110940784}
  - {x: -0.05, y: -0.09327046}
  - {x: -0.05, y: -0.110940784}
  - {x: -0.05, y: -0.09481259}
  - {x: -0.05, y: -0.0751789}
  - {x: 0.05, y: -0.09481259}
  - {x: 0.05, y: -0.0751789}
  - {x: 0.05, y: -0.0761606}
  - {x: 0.05, y: -0.09383091}
  - {x: -0.05, y: -0.0761606}
  - {x: -0.05, y: -0.09383091}
  - {x: -0.05, y: -0.07757178}
  - {x: -0.05, y: -0.057938084}
  - {x: 0.05, y: -0.07757178}
  - {x: 0.05, y: -0.057938084}
  - {x: 0.05, y: -0.05891975}
  - {x: 0.05, y: -0.07659008}
  - {x: -0.05, y: -0.05891975}
  - {x: -0.05, y: -0.07659008}
  - {x: -0.05, y: -0.060226344}
  - {x: -0.05, y: -0.040592656}
  - {x: 0.05, y: -0.060226344}
  - {x: 0.05, y: -0.040592656}
  - {x: 0.05, y: -0.0415744}
  - {x: 0.05, y: -0.059244722}
  - {x: -0.05, y: -0.0415744}
  - {x: -0.05, y: -0.059244722}
  - {x: -0.05, y: -0.042803366}
  - {x: -0.05, y: -0.02316968}
  - {x: 0.05, y: -0.042803366}
  - {x: 0.05, y: -0.02316968}
  - {x: 0.05, y: -0.02415135}
  - {x: 0.05, y: -0.04182167}
  - {x: -0.05, y: -0.02415135}
  - {x: -0.05, y: -0.04182167}
  - {x: -0.05, y: -0.025329474}
  - {x: -0.05, y: -0.005695758}
  - {x: 0.05, y: -0.025329474}
  - {x: 0.05, y: -0.005695758}
  - {x: 0.05, y: -0.006677406}
  - {x: 0.05, y: -0.024347745}
  - {x: -0.05, y: -0.006677406}
  - {x: -0.05, y: -0.024347745}
  - {x: -0.05, y: -0.007831542}
  - {x: -0.05, y: 0.01180214}
  - {x: 0.05, y: -0.007831542}
  - {x: 0.05, y: 0.01180214}
  - {x: 0.05, y: 0.01082045}
  - {x: 0.05, y: -0.006849872}
  - {x: -0.05, y: 0.01082045}
  - {x: -0.05, y: -0.006849872}
  - {x: -0.05, y: 0.0096632335}
  - {x: -0.05, y: 0.029296912}
  - {x: 0.05, y: 0.0096632335}
  - {x: 0.05, y: 0.029296912}
  - {x: 0.05, y: 0.028315214}
  - {x: 0.05, y: 0.010644919}
  - {x: -0.05, y: 0.028315214}
  - {x: -0.05, y: 0.010644919}
  - {x: -0.05, y: 0.027127944}
  - {x: -0.05, y: 0.046761625}
  - {x: 0.05, y: 0.027127944}
  - {x: 0.05, y: 0.046761625}
  - {x: 0.05, y: 0.045779962}
  - {x: 0.05, y: 0.028109636}
  - {x: -0.05, y: 0.045779962}
  - {x: -0.05, y: 0.028109636}
  - {x: -0.05, y: 0.044535734}
  - {x: -0.05, y: 0.06416944}
  - {x: 0.05, y: 0.044535734}
  - {x: 0.05, y: 0.06416944}
  - {x: 0.05, y: 0.063187756}
  - {x: 0.05, y: 0.045517433}
  - {x: -0.05, y: 0.063187756}
  - {x: -0.05, y: 0.045517433}
  - {x: -0.05, y: 0.061859746}
  - {x: -0.05, y: 0.08149345}
  - {x: 0.05, y: 0.061859746}
  - {x: 0.05, y: 0.08149345}
  - {x: 0.05, y: 0.08051177}
  - {x: 0.05, y: 0.062841415}
  - {x: -0.05, y: 0.08051177}
  - {x: -0.05, y: 0.062841415}
  - {x: -0.05, y: 0.07907321}
  - {x: -0.05, y: 0.098706886}
  - {x: 0.05, y: 0.07907321}
  - {x: 0.05, y: 0.098706886}
  - {x: 0.05, y: 0.0977252}
  - {x: 0.05, y: 0.080054894}
  - {x: -0.05, y: 0.0977252}
  - {x: -0.05, y: 0.080054894}
  - {x: -0.05, y: 0.0961496}
  - {x: -0.05, y: 0.1157833}
  - {x: 0.05, y: 0.0961496}
  - {x: 0.05, y: 0.1157833}
  - {x: 0.05, y: 0.11480158}
  - {x: 0.05, y: 0.09713127}
  - {x: -0.05, y: 0.11480158}
  - {x: -0.05, y: 0.09713127}
  - {x: -0.05, y: 0.11306254}
  - {x: -0.05, y: 0.13269623}
  - {x: 0.05, y: 0.11306254}
  - {x: 0.05, y: 0.13269623}
  - {x: 0.05, y: 0.13171461}
  - {x: 0.05, y: 0.11404428}
  - {x: -0.05, y: 0.13171461}
  - {x: -0.05, y: 0.11404428}
  - {x: -0.05, y: 0.12978613}
  - {x: -0.05, y: 0.14941984}
  - {x: 0.05, y: 0.12978613}
  - {x: 0.05, y: 0.14941984}
  - {x: 0.05, y: 0.14843814}
  - {x: 0.05, y: 0.1307678}
  - {x: -0.05, y: 0.14843814}
  - {x: -0.05, y: 0.1307678}
  - {x: -0.05, y: 0.14629439}
  - {x: -0.05, y: 0.16592807}
  - {x: 0.05, y: 0.14629439}
  - {x: 0.05, y: 0.16592807}
  - {x: 0.05, y: 0.16494636}
  - {x: 0.05, y: 0.14727606}
  - {x: -0.05, y: 0.16494636}
  - {x: -0.05, y: 0.14727606}
  - {x: 0.03572328, y: 0.05}
  - {x: 0.0857233, y: 0.05}
  - {x: 0.03572328, y: -0.05}
  - {x: 0.0857233, y: -0.05}
  - {x: -0.09090099, y: -0.17677669}
  - {x: -0.090515494, y: -0.15714678}
  - {x: -0.040900975, y: -0.17677669}
  - {x: -0.040554047, y: -0.15910977}
  - {x: 0.090515494, y: -0.15714678}
  - {x: 0.09090099, y: -0.17677669}
  - {x: 0.040554047, y: -0.15910977}
  - {x: 0.040900975, y: -0.17677669}
  - {x: -0.090515494, y: -0.15714678}
  - {x: -0.08935964, y: -0.13754714}
  - {x: -0.040554047, y: -0.15910977}
  - {x: -0.039513767, y: -0.1414701}
  - {x: 0.08935964, y: -0.13754714}
  - {x: 0.090515494, y: -0.15714678}
  - {x: 0.039513767, y: -0.1414701}
  - {x: 0.040554047, y: -0.15910977}
  - {x: -0.08935964, y: -0.13754714}
  - {x: -0.087435216, y: -0.118007995}
  - {x: -0.039513767, y: -0.1414701}
  - {x: -0.037781775, y: -0.12388487}
  - {x: 0.087435216, y: -0.118007995}
  - {x: 0.08935964, y: -0.13754714}
  - {x: 0.037781775, y: -0.12388487}
  - {x: 0.039513767, y: -0.1414701}
  - {x: -0.087435216, y: -0.118007995}
  - {x: -0.08474517, y: -0.098559454}
  - {x: -0.037781775, y: -0.12388487}
  - {x: -0.035360754, y: -0.10638118}
  - {x: 0.08474517, y: -0.098559454}
  - {x: 0.087435216, y: -0.118007995}
  - {x: 0.035360754, y: -0.10638118}
  - {x: 0.037781775, y: -0.12388487}
  - {x: -0.08474517, y: -0.098559454}
  - {x: -0.08129361, y: -0.07923153}
  - {x: -0.035360754, y: -0.10638118}
  - {x: -0.03225434, y: -0.08898605}
  - {x: 0.08129361, y: -0.07923153}
  - {x: 0.08474517, y: -0.098559454}
  - {x: 0.03225434, y: -0.08898605}
  - {x: 0.035360754, y: -0.10638118}
  - {x: -0.08129361, y: -0.07923153}
  - {x: -0.07708594, y: -0.06005401}
  - {x: -0.03225434, y: -0.08898605}
  - {x: -0.028467447, y: -0.071726285}
  - {x: 0.07708594, y: -0.06005401}
  - {x: 0.08129361, y: -0.07923153}
  - {x: 0.028467447, y: -0.071726285}
  - {x: 0.03225434, y: -0.08898605}
  - {x: -0.07708594, y: -0.06005401}
  - {x: -0.072128594, y: -0.04105647}
  - {x: -0.028467447, y: -0.071726285}
  - {x: -0.02400583, y: -0.05462849}
  - {x: 0.072128594, y: -0.04105647}
  - {x: 0.07708594, y: -0.06005401}
  - {x: 0.02400583, y: -0.05462849}
  - {x: 0.028467447, y: -0.071726285}
  - {x: -0.072128594, y: -0.04105647}
  - {x: -0.06642926, y: -0.022268191}
  - {x: -0.02400583, y: -0.05462849}
  - {x: -0.018876433, y: -0.03771904}
  - {x: 0.06642926, y: -0.022268191}
  - {x: 0.072128594, y: -0.04105647}
  - {x: 0.018876433, y: -0.03771904}
  - {x: 0.02400583, y: -0.05462849}
  - {x: -0.06642926, y: -0.022268191}
  - {x: -0.059996665, y: -0.0037181675}
  - {x: -0.018876433, y: -0.03771904}
  - {x: -0.013087094, y: -0.021024019}
  - {x: 0.059996665, y: -0.0037181675}
  - {x: 0.06642926, y: -0.022268191}
  - {x: 0.013087094, y: -0.021024019}
  - {x: 0.018876433, y: -0.03771904}
  - {x: -0.059996665, y: -0.0037181675}
  - {x: -0.05284074, y: 0.014565036}
  - {x: -0.013087094, y: -0.021024019}
  - {x: -0.0066467524, y: -0.004569143}
  - {x: 0.05284074, y: 0.014565036}
  - {x: 0.059996665, y: -0.0037181675}
  - {x: 0.0066467524, y: -0.004569143}
  - {x: 0.013087094, y: -0.021024019}
  - {x: -0.05284074, y: 0.014565036}
  - {x: -0.04497257, y: 0.03255318}
  - {x: -0.0066467524, y: -0.004569143}
  - {x: 0.00043460727, y: 0.011620194}
  - {x: 0.04497257, y: 0.03255318}
  - {x: 0.05284074, y: 0.014565036}
  - {x: -0.00043460727, y: 0.011620194}
  - {x: 0.0066467524, y: -0.004569143}
  - {x: -0.04497257, y: 0.03255318}
  - {x: -0.036404252, y: 0.050218552}
  - {x: 0.00043460727, y: 0.011620194}
  - {x: 0.008146077, y: 0.027519017}
  - {x: 0.036404252, y: 0.050218552}
  - {x: 0.04497257, y: 0.03255318}
  - {x: -0.008146077, y: 0.027519017}
  - {x: -0.00043460727, y: 0.011620194}
  - {x: -0.036404252, y: 0.050218552}
  - {x: -0.027148992, y: 0.06753391}
  - {x: 0.008146077, y: 0.027519017}
  - {x: 0.016475827, y: 0.043102846}
  - {x: 0.027148992, y: 0.06753391}
  - {x: 0.036404252, y: 0.050218552}
  - {x: -0.016475827, y: 0.043102846}
  - {x: -0.008146077, y: 0.027519017}
  - {x: -0.027148992, y: 0.06753391}
  - {x: -0.017221063, y: 0.08447258}
  - {x: 0.016475827, y: 0.043102846}
  - {x: 0.02541095, y: 0.058347642}
  - {x: 0.017221063, y: 0.08447258}
  - {x: 0.027148992, y: 0.06753391}
  - {x: -0.02541095, y: 0.058347642}
  - {x: -0.016475827, y: 0.043102846}
  - {x: -0.017221063, y: 0.08447258}
  - {x: -0.006635785, y: 0.10100843}
  - {x: 0.02541095, y: 0.058347642}
  - {x: 0.03493771, y: 0.073229924}
  - {x: 0.006635785, y: 0.10100843}
  - {x: 0.017221063, y: 0.08447258}
  - {x: -0.03493771, y: 0.073229924}
  - {x: -0.02541095, y: 0.058347642}
  - {x: -0.006635785, y: 0.10100843}
  - {x: 0.0045905113, y: 0.11711593}
  - {x: 0.03493771, y: 0.073229924}
  - {x: 0.045041382, y: 0.08772667}
  - {x: -0.0045905113, y: 0.11711593}
  - {x: 0.006635785, y: 0.10100843}
  - {x: -0.045041382, y: 0.08772667}
  - {x: -0.03493771, y: 0.073229924}
  - {x: 0.0045905113, y: 0.11711593}
  - {x: 0.01644054, y: 0.13277029}
  - {x: 0.045041382, y: 0.08772667}
  - {x: 0.05570641, y: 0.10181557}
  - {x: -0.01644054, y: 0.13277029}
  - {x: -0.0045905113, y: 0.11711593}
  - {x: -0.05570641, y: 0.10181557}
  - {x: -0.045041382, y: 0.08772667}
  - {x: 0.01644054, y: 0.13277029}
  - {x: 0.028896034, y: 0.14794733}
  - {x: 0.05570641, y: 0.10181557}
  - {x: 0.06691635, y: 0.115474924}
  - {x: -0.028896034, y: 0.14794733}
  - {x: -0.01644054, y: 0.13277029}
  - {x: -0.06691635, y: 0.115474924}
  - {x: -0.05570641, y: 0.10181557}
  - {x: 0.028896034, y: 0.14794733}
  - {x: 0.04193777, y: 0.16262369}
  - {x: 0.06691635, y: 0.115474924}
  - {x: 0.0786539, y: 0.12868364}
  - {x: -0.04193777, y: 0.16262369}
  - {x: -0.028896034, y: 0.14794733}
  - {x: -0.0786539, y: 0.12868364}
  - {x: -0.06691635, y: 0.115474924}
  - {x: 0.04193777, y: 0.16262369}
  - {x: 0.055545628, y: 0.17677669}
  - {x: 0.0786539, y: 0.12868364}
  - {x: 0.09090099, y: 0.14142133}
  - {x: -0.055545628, y: 0.17677669}
  - {x: -0.04193777, y: 0.16262369}
  - {x: -0.09090099, y: 0.14142133}
  - {x: -0.0786539, y: 0.12868364}
  m_Textures2: []
  m_Textures3: []
  m_Tangents:
  - {x: 0, y: 0, z: 1, w: -1}
  - {x: 0, y: 0, z: 1, w: -1}
  - {x: 0, y: 0, z: 1, w: -1}
  - {x: 0, y: 0, z: 1, w: -1}
  - {x: 0, y: 0, z: -1, w: -1}
  - {x: 0, y: 0, z: -1, w: -1}
  - {x: 0, y: 0, z: -1, w: -1}
  - {x: 0, y: 0, z: -1, w: -1}
  - {x: -1, y: 0, z: 0, w: -1}
  - {x: -1, y: 0, z: 0, w: -1}
  - {x: -1, y: 0, z: 0, w: -1}
  - {x: -1, y: 0, z: 0, w: -1}
  - {x: 0, y: 0, z: 1, w: -1}
  - {x: 0, y: 0, z: 1, w: -1}
  - {x: 0, y: 0, z: 1, w: -1}
  - {x: 0, y: 0, z: 1, w: -1}
  - {x: 0, y: 0, z: -1, w: -1}
  - {x: 0, y: 0, z: -1, w: -1}
  - {x: 0, y: 0, z: -1, w: -1}
  - {x: 0, y: 0, z: -1, w: -1}
  - {x: 0, y: 0, z: 1, w: -1}
  - {x: 0, y: 0, z: 1, w: -1}
  - {x: 0, y: 0, z: 1, w: -1}
  - {x: 0, y: 0, z: 1, w: -1}
  - {x: 0, y: 0, z: -1, w: -1}
  - {x: 0, y: 0, z: -1, w: -1}
  - {x: 0, y: 0, z: -1, w: -1}
  - {x: 0, y: 0, z: -1, w: -1}
  - {x: 0, y: 0, z: 1, w: -1}
  - {x: 0, y: 0, z: 1, w: -1}
  - {x: 0, y: 0, z: 1, w: -1}
  - {x: 0, y: 0, z: 1, w: -1}
  - {x: 0, y: 0, z: -1, w: -1}
  - {x: 0, y: 0, z: -1, w: -1}
  - {x: 0, y: 0, z: -1, w: -1}
  - {x: 0, y: 0, z: -1, w: -1}
  - {x: 0, y: 0, z: 1, w: -1}
  - {x: 0, y: 0, z: 1, w: -1}
  - {x: 0, y: 0, z: 1, w: -1}
  - {x: 0, y: 0, z: 1, w: -1}
  - {x: 0, y: 0, z: -1, w: -1}
  - {x: 0, y: 0, z: -1, w: -1}
  - {x: 0, y: 0, z: -1, w: -1}
  - {x: 0, y: 0, z: -1, w: -1}
  - {x: 0, y: 0, z: 1, w: -1}
  - {x: 0, y: 0, z: 1, w: -1}
  - {x: 0, y: 0, z: 1, w: -1}
  - {x: 0, y: 0, z: 1, w: -1}
  - {x: 0, y: 0, z: -1, w: -1}
  - {x: 0, y: 0, z: -1, w: -1}
  - {x: 0, y: 0, z: -1, w: -1}
  - {x: 0, y: 0, z: -1, w: -1}
  - {x: 0, y: 0, z: 1, w: -1}
  - {x: 0, y: 0, z: 1, w: -1}
  - {x: 0, y: 0, z: 1, w: -1}
  - {x: 0, y: 0, z: 1, w: -1}
  - {x: 0, y: 0, z: -1, w: -1}
  - {x: 0, y: 0, z: -1, w: -1}
  - {x: 0, y: 0, z: -1, w: -1}
  - {x: 0, y: 0, z: -1, w: -1}
  - {x: 0, y: 0, z: 1, w: -1}
  - {x: 0, y: 0, z: 1, w: -1}
  - {x: 0, y: 0, z: 1, w: -1}
  - {x: 0, y: 0, z: 1, w: -1}
  - {x: 0, y: 0, z: -1, w: -1}
  - {x: 0, y: 0, z: -1, w: -1}
  - {x: 0, y: 0, z: -1, w: -1}
  - {x: 0, y: 0, z: -1, w: -1}
  - {x: 0, y: 0, z: 1, w: -1}
  - {x: 0, y: 0, z: 1, w: -1}
  - {x: 0, y: 0, z: 1, w: -1}
  - {x: 0, y: 0, z: 1, w: -1}
  - {x: 0, y: 0, z: -1, w: -1}
  - {x: 0, y: 0, z: -1, w: -1}
  - {x: 0, y: 0, z: -1, w: -1}
  - {x: 0, y: 0, z: -1, w: -1}
  - {x: 0, y: 0, z: 1, w: -1}
  - {x: 0, y: 0, z: 1, w: -1}
  - {x: 0, y: 0, z: 1, w: -1}
  - {x: 0, y: 0, z: 1, w: -1}
  - {x: 0, y: 0, z: -1, w: -1}
  - {x: 0, y: 0, z: -1, w: -1}
  - {x: 0, y: 0, z: -1, w: -1}
  - {x: 0, y: 0, z: -1, w: -1}
  - {x: 0, y: 0, z: 1, w: -1}
  - {x: 0, y: 0, z: 1, w: -1}
  - {x: 0, y: 0, z: 1, w: -1}
  - {x: 0, y: 0, z: 1, w: -1}
  - {x: 0, y: 0, z: -1, w: -1}
  - {x: 0, y: 0, z: -1, w: -1}
  - {x: 0, y: 0, z: -1, w: -1}
  - {x: 0, y: 0, z: -1, w: -1}
  - {x: 0, y: 0, z: 1, w: -1}
  - {x: 0, y: 0, z: 1, w: -1}
  - {x: 0, y: 0, z: 1, w: -1}
  - {x: 0, y: 0, z: 1, w: -1}
  - {x: 0, y: 0, z: -1, w: -1}
  - {x: 0, y: 0, z: -1, w: -1}
  - {x: 0, y: 0, z: -1, w: -1}
  - {x: 0, y: 0, z: -1, w: -1}
  - {x: 0, y: 0, z: 1, w: -1}
  - {x: 0, y: 0, z: 1, w: -1}
  - {x: 0, y: 0, z: 1, w: -1}
  - {x: 0, y: 0, z: 1, w: -1}
  - {x: 0, y: 0, z: -1, w: -1}
  - {x: 0, y: 0, z: -1, w: -1}
  - {x: 0, y: 0, z: -1, w: -1}
  - {x: 0, y: 0, z: -1, w: -1}
  - {x: 0, y: 0, z: 1, w: -1}
  - {x: 0, y: 0, z: 1, w: -1}
  - {x: 0, y: 0, z: 1, w: -1}
  - {x: 0, y: 0, z: 1, w: -1}
  - {x: 0, y: 0, z: -1, w: -1}
  - {x: 0, y: 0, z: -1, w: -1}
  - {x: 0, y: 0, z: -1, w: -1}
  - {x: 0, y: 0, z: -1, w: -1}
  - {x: 0, y: 0, z: 1, w: -1}
  - {x: 0, y: 0, z: 1, w: -1}
  - {x: 0, y: 0, z: 1, w: -1}
  - {x: 0, y: 0, z: 1, w: -1}
  - {x: 0, y: 0, z: -1, w: -1}
  - {x: 0, y: 0, z: -1, w: -1}
  - {x: 0, y: 0, z: -1, w: -1}
  - {x: 0, y: 0, z: -1, w: -1}
  - {x: 0, y: 0, z: 1, w: -1}
  - {x: 0, y: 0, z: 1, w: -1}
  - {x: 0, y: 0, z: 1, w: -1}
  - {x: 0, y: 0, z: 1, w: -1}
  - {x: 0, y: 0, z: -1, w: -1}
  - {x: 0, y: 0, z: -1, w: -1}
  - {x: 0, y: 0, z: -1, w: -1}
  - {x: 0, y: 0, z: -1, w: -1}
  - {x: 0, y: 0, z: 1, w: -1}
  - {x: 0, y: 0, z: 1, w: -1}
  - {x: 0, y: 0, z: 1, w: -1}
  - {x: 0, y: 0, z: 1, w: -1}
  - {x: 0, y: 0, z: -1, w: -1}
  - {x: 0, y: 0, z: -1, w: -1}
  - {x: 0, y: 0, z: -1, w: -1}
  - {x: 0, y: 0, z: -1, w: -1}
  - {x: 0, y: 0, z: 1, w: -1}
  - {x: 0, y: 0, z: 1, w: -1}
  - {x: 0, y: 0, z: 1, w: -1}
  - {x: 0, y: 0, z: 1, w: -1}
  - {x: 0, y: 0, z: -1, w: -1}
  - {x: 0, y: 0, z: -1, w: -1}
  - {x: 0, y: 0, z: -1, w: -1}
  - {x: 0, y: 0, z: -1, w: -1}
  - {x: 0, y: 0, z: 1, w: -1}
  - {x: 0, y: 0, z: 1, w: -1}
  - {x: 0, y: 0, z: 1, w: -1}
  - {x: 0, y: 0, z: 1, w: -1}
  - {x: 0, y: 0, z: -1, w: -1}
  - {x: 0, y: 0, z: -1, w: -1}
  - {x: 0, y: 0, z: -1, w: -1}
  - {x: 0, y: 0, z: -1, w: -1}
  - {x: 0, y: 0, z: 1, w: -1}
  - {x: 0, y: 0, z: 1, w: -1}
  - {x: 0, y: 0, z: 1, w: -1}
  - {x: 0, y: 0, z: 1, w: -1}
  - {x: 0, y: 0, z: -1, w: -1}
  - {x: 0, y: 0, z: -1, w: -1}
  - {x: 0, y: 0, z: -1, w: -1}
  - {x: 0, y: 0, z: -1, w: -1}
  - {x: 0.7071068, y: 0.7071068, z: 0, w: -1}
  - {x: 0.7071068, y: 0.7071068, z: 0, w: -1}
  - {x: 0.7071068, y: 0.7071068, z: 0, w: -1}
  - {x: 0.7071068, y: 0.7071068, z: 0, w: -1}
  - {x: -1, y: 0, z: 0, w: -1}
  - {x: -1, y: 0, z: 0, w: -1}
  - {x: -1, y: 0, z: 0, w: -1}
  - {x: -1, y: 0, z: 0, w: -1}
  - {x: 1, y: 0, z: 0, w: -1}
  - {x: 1, y: 0, z: 0, w: -1}
  - {x: 1, y: 0, z: 0, w: -1}
  - {x: 1, y: 0, z: 0, w: -1}
  - {x: -1, y: 0, z: 0, w: -1}
  - {x: -1, y: 0, z: 0, w: -1}
  - {x: -1, y: 0, z: 0, w: -1}
  - {x: -1, y: 0, z: 0, w: -1}
  - {x: 1, y: 0, z: 0, w: -1}
  - {x: 1, y: 0, z: 0, w: -1}
  - {x: 1, y: 0, z: 0, w: -1}
  - {x: 1, y: 0, z: 0, w: -1}
  - {x: -1, y: 0, z: 0, w: -1}
  - {x: -1, y: 0, z: 0, w: -1}
  - {x: -1, y: 0, z: 0, w: -1}
  - {x: -1, y: 0, z: 0, w: -1}
  - {x: 1, y: 0, z: 0, w: -1}
  - {x: 1, y: 0, z: 0, w: -1}
  - {x: 1, y: 0, z: 0, w: -1}
  - {x: 1, y: 0, z: 0, w: -1}
  - {x: -1, y: 0, z: 0, w: -1}
  - {x: -1, y: 0, z: 0, w: -1}
  - {x: -1, y: 0, z: 0, w: -1}
  - {x: -1, y: 0, z: 0, w: -1}
  - {x: 1, y: 0, z: 0, w: -1}
  - {x: 1, y: 0, z: 0, w: -1}
  - {x: 1, y: 0, z: 0, w: -1}
  - {x: 1, y: 0, z: 0, w: -1}
  - {x: -1, y: 0, z: 0, w: -1}
  - {x: -1, y: 0, z: 0, w: -1}
  - {x: -1, y: 0, z: 0, w: -1}
  - {x: -1, y: 0, z: 0, w: -1}
  - {x: 1, y: 0, z: 0, w: -1}
  - {x: 1, y: 0, z: 0, w: -1}
  - {x: 1, y: 0, z: 0, w: -1}
  - {x: 1, y: 0, z: 0, w: -1}
  - {x: -1, y: 0, z: 0, w: -1}
  - {x: -1, y: 0, z: 0, w: -1}
  - {x: -1, y: 0, z: 0, w: -1}
  - {x: -1, y: 0, z: 0, w: -1}
  - {x: 1, y: 0, z: 0, w: -1}
  - {x: 1, y: 0, z: 0, w: -1}
  - {x: 1, y: 0, z: 0, w: -1}
  - {x: 1, y: 0, z: 0, w: -1}
  - {x: -1, y: 0, z: 0, w: -1}
  - {x: -1, y: 0, z: 0, w: -1}
  - {x: -1, y: 0, z: 0, w: -1}
  - {x: -1, y: 0, z: 0, w: -1}
  - {x: 1, y: 0, z: 0, w: -1}
  - {x: 1, y: 0, z: 0, w: -1}
  - {x: 1, y: 0, z: 0, w: -1}
  - {x: 1, y: 0, z: 0, w: -1}
  - {x: -1, y: 0, z: 0, w: -1}
  - {x: -1, y: 0, z: 0, w: -1}
  - {x: -1, y: 0, z: 0, w: -1}
  - {x: -1, y: 0, z: 0, w: -1}
  - {x: 1, y: 0, z: 0, w: -1}
  - {x: 1, y: 0, z: 0, w: -1}
  - {x: 1, y: 0, z: 0, w: -1}
  - {x: 1, y: 0, z: 0, w: -1}
  - {x: -1, y: 0, z: 0, w: -1}
  - {x: -1, y: 0, z: 0, w: -1}
  - {x: -1, y: 0, z: 0, w: -1}
  - {x: -1, y: 0, z: 0, w: -1}
  - {x: 1, y: 0, z: 0, w: -1}
  - {x: 1, y: 0, z: 0, w: -1}
  - {x: 1, y: 0, z: 0, w: -1}
  - {x: 1, y: 0, z: 0, w: -1}
  - {x: -1, y: 0, z: 0, w: -1}
  - {x: -1, y: 0, z: 0, w: -1}
  - {x: -1, y: 0, z: 0, w: -1}
  - {x: -1, y: 0, z: 0, w: -1}
  - {x: 1, y: 0, z: 0, w: -1}
  - {x: 1, y: 0, z: 0, w: -1}
  - {x: 1, y: 0, z: 0, w: -1}
  - {x: 1, y: 0, z: 0, w: -1}
  - {x: -1, y: 0, z: 0, w: -1}
  - {x: -1, y: 0, z: 0, w: -1}
  - {x: -1, y: 0, z: 0, w: -1}
  - {x: -1, y: 0, z: 0, w: -1}
  - {x: 1, y: 0, z: 0, w: -1}
  - {x: 1, y: 0, z: 0, w: -1}
  - {x: 1, y: 0, z: 0, w: -1}
  - {x: 1, y: 0, z: 0, w: -1}
  - {x: -1, y: 0, z: 0, w: -1}
  - {x: -1, y: 0, z: 0, w: -1}
  - {x: -1, y: 0, z: 0, w: -1}
  - {x: -1, y: 0, z: 0, w: -1}
  - {x: 1, y: 0, z: 0, w: -1}
  - {x: 1, y: 0, z: 0, w: -1}
  - {x: 1, y: 0, z: 0, w: -1}
  - {x: 1, y: 0, z: 0, w: -1}
  - {x: -1, y: 0, z: 0, w: -1}
  - {x: -1, y: 0, z: 0, w: -1}
  - {x: -1, y: 0, z: 0, w: -1}
  - {x: -1, y: 0, z: 0, w: -1}
  - {x: 1, y: 0, z: 0, w: -1}
  - {x: 1, y: 0, z: 0, w: -1}
  - {x: 1, y: 0, z: 0, w: -1}
  - {x: 1, y: 0, z: 0, w: -1}
  - {x: -1, y: 0, z: 0, w: -1}
  - {x: -1, y: 0, z: 0, w: -1}
  - {x: -1, y: 0, z: 0, w: -1}
  - {x: -1, y: 0, z: 0, w: -1}
  - {x: 1, y: 0, z: 0, w: -1}
  - {x: 1, y: 0, z: 0, w: -1}
  - {x: 1, y: 0, z: 0, w: -1}
  - {x: 1, y: 0, z: 0, w: -1}
  - {x: -1, y: 0, z: 0, w: -1}
  - {x: -1, y: 0, z: 0, w: -1}
  - {x: -1, y: 0, z: 0, w: -1}
  - {x: -1, y: 0, z: 0, w: -1}
  - {x: 1, y: 0, z: 0, w: -1}
  - {x: 1, y: 0, z: 0, w: -1}
  - {x: 1, y: 0, z: 0, w: -1}
  - {x: 1, y: 0, z: 0, w: -1}
  - {x: -1, y: 0, z: 0, w: -1}
  - {x: -1, y: 0, z: 0, w: -1}
  - {x: -1, y: 0, z: 0, w: -1}
  - {x: -1, y: 0, z: 0, w: -1}
  - {x: 1, y: 0, z: 0, w: -1}
  - {x: 1, y: 0, z: 0, w: -1}
  - {x: 1, y: 0, z: 0, w: -1}
  - {x: 1, y: 0, z: 0, w: -1}
  - {x: -1, y: 0, z: 0, w: -1}
  - {x: -1, y: 0, z: 0, w: -1}
  - {x: -1, y: 0, z: 0, w: -1}
  - {x: -1, y: 0, z: 0, w: -1}
  - {x: 1, y: 0, z: 0, w: -1}
  - {x: 1, y: 0, z: 0, w: -1}
  - {x: 1, y: 0, z: 0, w: -1}
  - {x: 1, y: 0, z: 0, w: -1}
  - {x: -1, y: 0, z: 0, w: -1}
  - {x: -1, y: 0, z: 0, w: -1}
  - {x: -1, y: 0, z: 0, w: -1}
  - {x: -1, y: 0, z: 0, w: -1}
  - {x: 1, y: 0, z: 0, w: -1}
  - {x: 1, y: 0, z: 0, w: -1}
  - {x: 1, y: 0, z: 0, w: -1}
  - {x: 1, y: 0, z: 0, w: -1}
  - {x: -1, y: 0, z: 0, w: -1}
  - {x: -1, y: 0, z: 0, w: -1}
  - {x: -1, y: 0, z: 0, w: -1}
  - {x: -1, y: 0, z: 0, w: -1}
  - {x: 1, y: 0, z: 0, w: -1}
  - {x: 1, y: 0, z: 0, w: -1}
  - {x: 1, y: 0, z: 0, w: -1}
  - {x: 1, y: 0, z: 0, w: -1}
  - {x: -1, y: 0, z: 0, w: -1}
  - {x: -1, y: 0, z: 0, w: -1}
  - {x: -1, y: 0, z: 0, w: -1}
  - {x: -1, y: 0, z: 0, w: -1}
  - {x: 1, y: 0, z: 0, w: -1}
  - {x: 1, y: 0, z: 0, w: -1}
  - {x: 1, y: 0, z: 0, w: -1}
  - {x: 1, y: 0, z: 0, w: -1}
  m_Colors: []
  m_UnwrapParameters:
    m_HardAngle: 88
    m_PackMargin: 20
    m_AngleError: 8
    m_AreaError: 15
  m_PreserveMeshAssetOnDestroy: 0
  assetGuid: 
  m_Mesh: {fileID: 0}
  m_IsSelectable: 1
  m_SelectedFaces: 
  m_SelectedEdges: []
  m_SelectedVertices: 
--- !u!23 &5738326744931682374
MeshRenderer:
  m_ObjectHideFlags: 0
  m_CorrespondingSourceObject: {fileID: 0}
  m_PrefabInstance: {fileID: 0}
  m_PrefabAsset: {fileID: 0}
  m_GameObject: {fileID: 5738326744931682371}
  m_Enabled: 1
  m_CastShadows: 1
  m_ReceiveShadows: 1
  m_DynamicOccludee: 1
  m_MotionVectors: 1
  m_LightProbeUsage: 1
  m_ReflectionProbeUsage: 1
  m_RayTracingMode: 2
  m_RenderingLayerMask: 1
  m_RendererPriority: 0
  m_Materials:
  - {fileID: 2100000, guid: 5e9b50dd7ad378f48aefe31b321fb578, type: 2}
  m_StaticBatchInfo:
    firstSubMesh: 0
    subMeshCount: 0
  m_StaticBatchRoot: {fileID: 0}
  m_ProbeAnchor: {fileID: 0}
  m_LightProbeVolumeOverride: {fileID: 0}
  m_ScaleInLightmap: 1
  m_ReceiveGI: 1
  m_PreserveUVs: 0
  m_IgnoreNormalsForChartDetection: 0
  m_ImportantGI: 0
  m_StitchLightmapSeams: 1
  m_SelectedEditorRenderState: 2
  m_MinimumChartSize: 4
  m_AutoUVMaxDistance: 0.5
  m_AutoUVMaxAngle: 89
  m_LightmapParameters: {fileID: 0}
  m_SortingLayerID: 0
  m_SortingLayer: 0
  m_SortingOrder: 0
--- !u!33 &5738326744931682373
MeshFilter:
  m_ObjectHideFlags: 0
  m_CorrespondingSourceObject: {fileID: 0}
  m_PrefabInstance: {fileID: 0}
  m_PrefabAsset: {fileID: 0}
  m_GameObject: {fileID: 5738326744931682371}
  m_Mesh: {fileID: 0}
--- !u!64 &5738326744931682372
MeshCollider:
  m_ObjectHideFlags: 0
  m_CorrespondingSourceObject: {fileID: 0}
  m_PrefabInstance: {fileID: 0}
  m_PrefabAsset: {fileID: 0}
  m_GameObject: {fileID: 5738326744931682371}
  m_Material: {fileID: 0}
  m_IsTrigger: 1
  m_Enabled: 1
  serializedVersion: 4
  m_Convex: 1
  m_CookingOptions: 30
  m_Mesh: {fileID: 0}
--- !u!114 &-3819280539939819802
MonoBehaviour:
  m_ObjectHideFlags: 0
  m_CorrespondingSourceObject: {fileID: 0}
  m_PrefabInstance: {fileID: 0}
  m_PrefabAsset: {fileID: 0}
  m_GameObject: {fileID: 5738326744931682371}
  m_Enabled: 1
  m_EditorHideFlags: 0
  m_Script: {fileID: 11500000, guid: b57d119e57eb9ea4d916b9861ec699e5, type: 3}
  m_Name: 
  m_EditorClassIdentifier: 
