com\invoice\InvoiceController.class
com\invoice\dtos\CDR.class
com\invoice\dtos\Invoice.class
com\invoice\InvoiceApplication$1.class
com\invoice\dtos\ChargingProcess.class
com\invoice\dtos\impl\CalculateInvoiceServiceImpl.class
com\invoice\dtos\Rate.class
com\invoice\service\ICalculateInvoiceService.class
com\invoice\InvoiceApplication.class
