%YAML 1.1
%TAG !u! tag:unity3d.com,2011:
--- !u!181963792 &2655988077585873504
Preset:
  m_ObjectHideFlags: 0
  m_PrefabParentObject: {fileID: 0}
  m_PrefabInternal: {fileID: 0}
  m_Name: PlayerCollider
  m_TargetType:
    m_NativeTypeID: 60
    m_ManagedTypePPtr: {fileID: 0}
    m_ManagedTypeFallback: 
  m_Properties:
  - target: {fileID: 0}
    propertyPath: m_Enabled
    value: 1
    objectReference: {fileID: 0}
  - target: {fileID: 0}
    propertyPath: m_Density
    value: 1
    objectReference: {fileID: 0}
  - target: {fileID: 0}
    propertyPath: m_Material
    value: 
    objectReference: {fileID: 0}
  - target: {fileID: 0}
    propertyPath: m_IsTrigger
    value: 0
    objectReference: {fileID: 0}
  - target: {fileID: 0}
    propertyPath: m_UsedByEffector
    value: 0
    objectReference: {fileID: 0}
  - target: {fileID: 0}
    propertyPath: m_UsedByComposite
    value: 0
    objectReference: {fileID: 0}
  - target: {fileID: 0}
    propertyPath: m_Offset.x
    value: 0
    objectReference: {fileID: 0}
  - target: {fileID: 0}
    propertyPath: m_Offset.y
    value: 0
    objectReference: {fileID: 0}
  - target: {fileID: 0}
    propertyPath: m_SpriteTilingProperty.border.x
    value: 0
    objectReference: {fileID: 0}
  - target: {fileID: 0}
    propertyPath: m_SpriteTilingProperty.border.y
    value: 0
    objectReference: {fileID: 0}
  - target: {fileID: 0}
    propertyPath: m_SpriteTilingProperty.border.z
    value: 0
    objectReference: {fileID: 0}
  - target: {fileID: 0}
    propertyPath: m_SpriteTilingProperty.border.w
    value: 0
    objectReference: {fileID: 0}
  - target: {fileID: 0}
    propertyPath: m_SpriteTilingProperty.pivot.x
    value: 0.5
    objectReference: {fileID: 0}
  - target: {fileID: 0}
    propertyPath: m_SpriteTilingProperty.pivot.y
    value: 0.5
    objectReference: {fileID: 0}
  - target: {fileID: 0}
    propertyPath: m_SpriteTilingProperty.oldSize.x
    value: 5.12
    objectReference: {fileID: 0}
  - target: {fileID: 0}
    propertyPath: m_SpriteTilingProperty.oldSize.y
    value: 5.12
    objectReference: {fileID: 0}
  - target: {fileID: 0}
    propertyPath: m_SpriteTilingProperty.newSize.x
    value: 5.12
    objectReference: {fileID: 0}
  - target: {fileID: 0}
    propertyPath: m_SpriteTilingProperty.newSize.y
    value: 5.12
    objectReference: {fileID: 0}
  - target: {fileID: 0}
    propertyPath: m_SpriteTilingProperty.adaptiveTilingThreshold
    value: 0.5
    objectReference: {fileID: 0}
  - target: {fileID: 0}
    propertyPath: m_SpriteTilingProperty.drawMode
    value: 0
    objectReference: {fileID: 0}
  - target: {fileID: 0}
    propertyPath: m_SpriteTilingProperty.adaptiveTiling
    value: 0
    objectReference: {fileID: 0}
  - target: {fileID: 0}
    propertyPath: m_AutoTiling
    value: 0
    objectReference: {fileID: 0}
  - target: {fileID: 0}
    propertyPath: m_Points.m_Paths.Array.size
    value: 1
    objectReference: {fileID: 0}
  - target: {fileID: 0}
    propertyPath: m_Points.m_Paths.Array.data[0].Array.size
    value: 58
    objectReference: {fileID: 0}
  - target: {fileID: 0}
    propertyPath: m_Points.m_Paths.Array.data[0].Array.data[0].x
    value: 0.72999996
    objectReference: {fileID: 0}
  - target: {fileID: 0}
    propertyPath: m_Points.m_Paths.Array.data[0].Array.data[0].y
    value: -1.56
    objectReference: {fileID: 0}
  - target: {fileID: 0}
    propertyPath: m_Points.m_Paths.Array.data[0].Array.data[1].x
    value: 0.96999997
    objectReference: {fileID: 0}
  - target: {fileID: 0}
    propertyPath: m_Points.m_Paths.Array.data[0].Array.data[1].y
    value: -1.4699999
    objectReference: {fileID: 0}
  - target: {fileID: 0}
    propertyPath: m_Points.m_Paths.Array.data[0].Array.data[2].x
    value: 1.25
    objectReference: {fileID: 0}
  - target: {fileID: 0}
    propertyPath: m_Points.m_Paths.Array.data[0].Array.data[2].y
    value: -1.3299999
    objectReference: {fileID: 0}
  - target: {fileID: 0}
    propertyPath: m_Points.m_Paths.Array.data[0].Array.data[3].x
    value: 1.39
    objectReference: {fileID: 0}
  - target: {fileID: 0}
    propertyPath: m_Points.m_Paths.Array.data[0].Array.data[3].y
    value: -1.24
    objectReference: {fileID: 0}
  - target: {fileID: 0}
    propertyPath: m_Points.m_Paths.Array.data[0].Array.data[4].x
    value: 1.4699999
    objectReference: {fileID: 0}
  - target: {fileID: 0}
    propertyPath: m_Points.m_Paths.Array.data[0].Array.data[4].y
    value: -1.18
    objectReference: {fileID: 0}
  - target: {fileID: 0}
    propertyPath: m_Points.m_Paths.Array.data[0].Array.data[5].x
    value: 1.64
    objectReference: {fileID: 0}
  - target: {fileID: 0}
    propertyPath: m_Points.m_Paths.Array.data[0].Array.data[5].y
    value: -1.03
    objectReference: {fileID: 0}
  - target: {fileID: 0}
    propertyPath: m_Points.m_Paths.Array.data[0].Array.data[6].x
    value: 1.78
    objectReference: {fileID: 0}
  - target: {fileID: 0}
    propertyPath: m_Points.m_Paths.Array.data[0].Array.data[6].y
    value: -0.89
    objectReference: {fileID: 0}
  - target: {fileID: 0}
    propertyPath: m_Points.m_Paths.Array.data[0].Array.data[7].x
    value: 1.9399999
    objectReference: {fileID: 0}
  - target: {fileID: 0}
    propertyPath: m_Points.m_Paths.Array.data[0].Array.data[7].y
    value: -0.71
    objectReference: {fileID: 0}
  - target: {fileID: 0}
    propertyPath: m_Points.m_Paths.Array.data[0].Array.data[8].x
    value: 1.99
    objectReference: {fileID: 0}
  - target: {fileID: 0}
    propertyPath: m_Points.m_Paths.Array.data[0].Array.data[8].y
    value: -0.63
    objectReference: {fileID: 0}
  - target: {fileID: 0}
    propertyPath: m_Points.m_Paths.Array.data[0].Array.data[9].x
    value: 2.08
    objectReference: {fileID: 0}
  - target: {fileID: 0}
    propertyPath: m_Points.m_Paths.Array.data[0].Array.data[9].y
    value: -0.5
    objectReference: {fileID: 0}
  - target: {fileID: 0}
    propertyPath: m_Points.m_Paths.Array.data[0].Array.data[10].x
    value: 2.19
    objectReference: {fileID: 0}
  - target: {fileID: 0}
    propertyPath: m_Points.m_Paths.Array.data[0].Array.data[10].y
    value: -0.29
    objectReference: {fileID: 0}
  - target: {fileID: 0}
    propertyPath: m_Points.m_Paths.Array.data[0].Array.data[11].x
    value: 2.32
    objectReference: {fileID: 0}
  - target: {fileID: 0}
    propertyPath: m_Points.m_Paths.Array.data[0].Array.data[11].y
    value: 0.01
    objectReference: {fileID: 0}
  - target: {fileID: 0}
    propertyPath: m_Points.m_Paths.Array.data[0].Array.data[12].x
    value: 2.3799999
    objectReference: {fileID: 0}
  - target: {fileID: 0}
    propertyPath: m_Points.m_Paths.Array.data[0].Array.data[12].y
    value: 0.28
    objectReference: {fileID: 0}
  - target: {fileID: 0}
    propertyPath: m_Points.m_Paths.Array.data[0].Array.data[13].x
    value: 2.3999999
    objectReference: {fileID: 0}
  - target: {fileID: 0}
    propertyPath: m_Points.m_Paths.Array.data[0].Array.data[13].y
    value: 0.39999998
    objectReference: {fileID: 0}
  - target: {fileID: 0}
    propertyPath: m_Points.m_Paths.Array.data[0].Array.data[14].x
    value: 2.4199998
    objectReference: {fileID: 0}
  - target: {fileID: 0}
    propertyPath: m_Points.m_Paths.Array.data[0].Array.data[14].y
    value: 0.59
    objectReference: {fileID: 0}
  - target: {fileID: 0}
    propertyPath: m_Points.m_Paths.Array.data[0].Array.data[15].x
    value: 2.4199998
    objectReference: {fileID: 0}
  - target: {fileID: 0}
    propertyPath: m_Points.m_Paths.Array.data[0].Array.data[15].y
    value: 0.93
    objectReference: {fileID: 0}
  - target: {fileID: 0}
    propertyPath: m_Points.m_Paths.Array.data[0].Array.data[16].x
    value: 2.4099998
    objectReference: {fileID: 0}
  - target: {fileID: 0}
    propertyPath: m_Points.m_Paths.Array.data[0].Array.data[16].y
    value: 1.04
    objectReference: {fileID: 0}
  - target: {fileID: 0}
    propertyPath: m_Points.m_Paths.Array.data[0].Array.data[17].x
    value: 2.3899999
    objectReference: {fileID: 0}
  - target: {fileID: 0}
    propertyPath: m_Points.m_Paths.Array.data[0].Array.data[17].y
    value: 1.17
    objectReference: {fileID: 0}
  - target: {fileID: 0}
    propertyPath: m_Points.m_Paths.Array.data[0].Array.data[18].x
    value: 2.37
    objectReference: {fileID: 0}
  - target: {fileID: 0}
    propertyPath: m_Points.m_Paths.Array.data[0].Array.data[18].y
    value: 1.1899999
    objectReference: {fileID: 0}
  - target: {fileID: 0}
    propertyPath: m_Points.m_Paths.Array.data[0].Array.data[19].x
    value: 2.23
    objectReference: {fileID: 0}
  - target: {fileID: 0}
    propertyPath: m_Points.m_Paths.Array.data[0].Array.data[19].y
    value: 1.1899999
    objectReference: {fileID: 0}
  - target: {fileID: 0}
    propertyPath: m_Points.m_Paths.Array.data[0].Array.data[20].x
    value: 2.21
    objectReference: {fileID: 0}
  - target: {fileID: 0}
    propertyPath: m_Points.m_Paths.Array.data[0].Array.data[20].y
    value: 1.15
    objectReference: {fileID: 0}
  - target: {fileID: 0}
    propertyPath: m_Points.m_Paths.Array.data[0].Array.data[21].x
    value: 2.21
    objectReference: {fileID: 0}
  - target: {fileID: 0}
    propertyPath: m_Points.m_Paths.Array.data[0].Array.data[21].y
    value: 1.0799999
    objectReference: {fileID: 0}
  - target: {fileID: 0}
    propertyPath: m_Points.m_Paths.Array.data[0].Array.data[22].x
    value: 2.0913393
    objectReference: {fileID: 0}
  - target: {fileID: 0}
    propertyPath: m_Points.m_Paths.Array.data[0].Array.data[22].y
    value: 0.23973686
    objectReference: {fileID: 0}
  - target: {fileID: 0}
    propertyPath: m_Points.m_Paths.Array.data[0].Array.data[23].x
    value: 1.7033985
    objectReference: {fileID: 0}
  - target: {fileID: 0}
    propertyPath: m_Points.m_Paths.Array.data[0].Array.data[23].y
    value: -0.17718896
    objectReference: {fileID: 0}
  - target: {fileID: 0}
    propertyPath: m_Points.m_Paths.Array.data[0].Array.data[24].x
    value: 0.8338807
    objectReference: {fileID: 0}
  - target: {fileID: 0}
    propertyPath: m_Points.m_Paths.Array.data[0].Array.data[24].y
    value: -0.85634845
    objectReference: {fileID: 0}
  - target: {fileID: 0}
    propertyPath: m_Points.m_Paths.Array.data[0].Array.data[25].x
    value: -0.060061395
    objectReference: {fileID: 0}
  - target: {fileID: 0}
    propertyPath: m_Points.m_Paths.Array.data[0].Array.data[25].y
    value: -1.030617
    objectReference: {fileID: 0}
  - target: {fileID: 0}
    propertyPath: m_Points.m_Paths.Array.data[0].Array.data[26].x
    value: -1.0745757
    objectReference: {fileID: 0}
  - target: {fileID: 0}
    propertyPath: m_Points.m_Paths.Array.data[0].Array.data[26].y
    value: -0.8235264
    objectReference: {fileID: 0}
  - target: {fileID: 0}
    propertyPath: m_Points.m_Paths.Array.data[0].Array.data[27].x
    value: -1.5844392
    objectReference: {fileID: 0}
  - target: {fileID: 0}
    propertyPath: m_Points.m_Paths.Array.data[0].Array.data[27].y
    value: -0.48236483
    objectReference: {fileID: 0}
  - target: {fileID: 0}
    propertyPath: m_Points.m_Paths.Array.data[0].Array.data[28].x
    value: -1.8691902
    objectReference: {fileID: 0}
  - target: {fileID: 0}
    propertyPath: m_Points.m_Paths.Array.data[0].Array.data[28].y
    value: -0.03223674
    objectReference: {fileID: 0}
  - target: {fileID: 0}
    propertyPath: m_Points.m_Paths.Array.data[0].Array.data[29].x
    value: -2.1499503
    objectReference: {fileID: 0}
  - target: {fileID: 0}
    propertyPath: m_Points.m_Paths.Array.data[0].Array.data[29].y
    value: 0.35071924
    objectReference: {fileID: 0}
  - target: {fileID: 0}
    propertyPath: m_Points.m_Paths.Array.data[0].Array.data[30].x
    value: -2.25
    objectReference: {fileID: 0}
  - target: {fileID: 0}
    propertyPath: m_Points.m_Paths.Array.data[0].Array.data[30].y
    value: 1.1899999
    objectReference: {fileID: 0}
  - target: {fileID: 0}
    propertyPath: m_Points.m_Paths.Array.data[0].Array.data[31].x
    value: -2.3799999
    objectReference: {fileID: 0}
  - target: {fileID: 0}
    propertyPath: m_Points.m_Paths.Array.data[0].Array.data[31].y
    value: 1.1899999
    objectReference: {fileID: 0}
  - target: {fileID: 0}
    propertyPath: m_Points.m_Paths.Array.data[0].Array.data[32].x
    value: -2.3999999
    objectReference: {fileID: 0}
  - target: {fileID: 0}
    propertyPath: m_Points.m_Paths.Array.data[0].Array.data[32].y
    value: 1.17
    objectReference: {fileID: 0}
  - target: {fileID: 0}
    propertyPath: m_Points.m_Paths.Array.data[0].Array.data[33].x
    value: -2.4199998
    objectReference: {fileID: 0}
  - target: {fileID: 0}
    propertyPath: m_Points.m_Paths.Array.data[0].Array.data[33].y
    value: 1.11
    objectReference: {fileID: 0}
  - target: {fileID: 0}
    propertyPath: m_Points.m_Paths.Array.data[0].Array.data[34].x
    value: -2.411158
    objectReference: {fileID: 0}
  - target: {fileID: 0}
    propertyPath: m_Points.m_Paths.Array.data[0].Array.data[34].y
    value: 0.9699999
    objectReference: {fileID: 0}
  - target: {fileID: 0}
    propertyPath: m_Points.m_Paths.Array.data[0].Array.data[35].x
    value: -2.4299998
    objectReference: {fileID: 0}
  - target: {fileID: 0}
    propertyPath: m_Points.m_Paths.Array.data[0].Array.data[35].y
    value: 0.59999996
    objectReference: {fileID: 0}
  - target: {fileID: 0}
    propertyPath: m_Points.m_Paths.Array.data[0].Array.data[36].x
    value: -2.4199998
    objectReference: {fileID: 0}
  - target: {fileID: 0}
    propertyPath: m_Points.m_Paths.Array.data[0].Array.data[36].y
    value: 0.48999998
    objectReference: {fileID: 0}
  - target: {fileID: 0}
    propertyPath: m_Points.m_Paths.Array.data[0].Array.data[37].x
    value: -2.3999999
    objectReference: {fileID: 0}
  - target: {fileID: 0}
    propertyPath: m_Points.m_Paths.Array.data[0].Array.data[37].y
    value: 0.34
    objectReference: {fileID: 0}
  - target: {fileID: 0}
    propertyPath: m_Points.m_Paths.Array.data[0].Array.data[38].x
    value: -2.37
    objectReference: {fileID: 0}
  - target: {fileID: 0}
    propertyPath: m_Points.m_Paths.Array.data[0].Array.data[38].y
    value: 0.19999999
    objectReference: {fileID: 0}
  - target: {fileID: 0}
    propertyPath: m_Points.m_Paths.Array.data[0].Array.data[39].x
    value: -2.33
    objectReference: {fileID: 0}
  - target: {fileID: 0}
    propertyPath: m_Points.m_Paths.Array.data[0].Array.data[39].y
    value: 0.04
    objectReference: {fileID: 0}
  - target: {fileID: 0}
    propertyPath: m_Points.m_Paths.Array.data[0].Array.data[40].x
    value: -2.28
    objectReference: {fileID: 0}
  - target: {fileID: 0}
    propertyPath: m_Points.m_Paths.Array.data[0].Array.data[40].y
    value: -0.099999994
    objectReference: {fileID: 0}
  - target: {fileID: 0}
    propertyPath: m_Points.m_Paths.Array.data[0].Array.data[41].x
    value: -2.24
    objectReference: {fileID: 0}
  - target: {fileID: 0}
    propertyPath: m_Points.m_Paths.Array.data[0].Array.data[41].y
    value: -0.19999999
    objectReference: {fileID: 0}
  - target: {fileID: 0}
    propertyPath: m_Points.m_Paths.Array.data[0].Array.data[42].x
    value: -2.12
    objectReference: {fileID: 0}
  - target: {fileID: 0}
    propertyPath: m_Points.m_Paths.Array.data[0].Array.data[42].y
    value: -0.45
    objectReference: {fileID: 0}
  - target: {fileID: 0}
    propertyPath: m_Points.m_Paths.Array.data[0].Array.data[43].x
    value: -2.06
    objectReference: {fileID: 0}
  - target: {fileID: 0}
    propertyPath: m_Points.m_Paths.Array.data[0].Array.data[43].y
    value: -0.55
    objectReference: {fileID: 0}
  - target: {fileID: 0}
    propertyPath: m_Points.m_Paths.Array.data[0].Array.data[44].x
    value: -1.91
    objectReference: {fileID: 0}
  - target: {fileID: 0}
    propertyPath: m_Points.m_Paths.Array.data[0].Array.data[44].y
    value: -0.76
    objectReference: {fileID: 0}
  - target: {fileID: 0}
    propertyPath: m_Points.m_Paths.Array.data[0].Array.data[45].x
    value: -1.78
    objectReference: {fileID: 0}
  - target: {fileID: 0}
    propertyPath: m_Points.m_Paths.Array.data[0].Array.data[45].y
    value: -0.90999997
    objectReference: {fileID: 0}
  - target: {fileID: 0}
    propertyPath: m_Points.m_Paths.Array.data[0].Array.data[46].x
    value: -1.5799999
    objectReference: {fileID: 0}
  - target: {fileID: 0}
    propertyPath: m_Points.m_Paths.Array.data[0].Array.data[46].y
    value: -1.1
    objectReference: {fileID: 0}
  - target: {fileID: 0}
    propertyPath: m_Points.m_Paths.Array.data[0].Array.data[47].x
    value: -1.3399999
    objectReference: {fileID: 0}
  - target: {fileID: 0}
    propertyPath: m_Points.m_Paths.Array.data[0].Array.data[47].y
    value: -1.28
    objectReference: {fileID: 0}
  - target: {fileID: 0}
    propertyPath: m_Points.m_Paths.Array.data[0].Array.data[48].x
    value: -1.1899999
    objectReference: {fileID: 0}
  - target: {fileID: 0}
    propertyPath: m_Points.m_Paths.Array.data[0].Array.data[48].y
    value: -1.37
    objectReference: {fileID: 0}
  - target: {fileID: 0}
    propertyPath: m_Points.m_Paths.Array.data[0].Array.data[49].x
    value: -0.84
    objectReference: {fileID: 0}
  - target: {fileID: 0}
    propertyPath: m_Points.m_Paths.Array.data[0].Array.data[49].y
    value: -1.54
    objectReference: {fileID: 0}
  - target: {fileID: 0}
    propertyPath: m_Points.m_Paths.Array.data[0].Array.data[50].x
    value: -0.56
    objectReference: {fileID: 0}
  - target: {fileID: 0}
    propertyPath: m_Points.m_Paths.Array.data[0].Array.data[50].y
    value: -1.61
    objectReference: {fileID: 0}
  - target: {fileID: 0}
    propertyPath: m_Points.m_Paths.Array.data[0].Array.data[51].x
    value: -0.45999998
    objectReference: {fileID: 0}
  - target: {fileID: 0}
    propertyPath: m_Points.m_Paths.Array.data[0].Array.data[51].y
    value: -1.63
    objectReference: {fileID: 0}
  - target: {fileID: 0}
    propertyPath: m_Points.m_Paths.Array.data[0].Array.data[52].x
    value: -0.26
    objectReference: {fileID: 0}
  - target: {fileID: 0}
    propertyPath: m_Points.m_Paths.Array.data[0].Array.data[52].y
    value: -1.66
    objectReference: {fileID: 0}
  - target: {fileID: 0}
    propertyPath: m_Points.m_Paths.Array.data[0].Array.data[53].x
    value: -0.12
    objectReference: {fileID: 0}
  - target: {fileID: 0}
    propertyPath: m_Points.m_Paths.Array.data[0].Array.data[53].y
    value: -1.67
    objectReference: {fileID: 0}
  - target: {fileID: 0}
    propertyPath: m_Points.m_Paths.Array.data[0].Array.data[54].x
    value: 0.11
    objectReference: {fileID: 0}
  - target: {fileID: 0}
    propertyPath: m_Points.m_Paths.Array.data[0].Array.data[54].y
    value: -1.67
    objectReference: {fileID: 0}
  - target: {fileID: 0}
    propertyPath: m_Points.m_Paths.Array.data[0].Array.data[55].x
    value: 0.25
    objectReference: {fileID: 0}
  - target: {fileID: 0}
    propertyPath: m_Points.m_Paths.Array.data[0].Array.data[55].y
    value: -1.66
    objectReference: {fileID: 0}
  - target: {fileID: 0}
    propertyPath: m_Points.m_Paths.Array.data[0].Array.data[56].x
    value: 0.45999998
    objectReference: {fileID: 0}
  - target: {fileID: 0}
    propertyPath: m_Points.m_Paths.Array.data[0].Array.data[56].y
    value: -1.63
    objectReference: {fileID: 0}
  - target: {fileID: 0}
    propertyPath: m_Points.m_Paths.Array.data[0].Array.data[57].x
    value: 0.56
    objectReference: {fileID: 0}
  - target: {fileID: 0}
    propertyPath: m_Points.m_Paths.Array.data[0].Array.data[57].y
    value: -1.62
    objectReference: {fileID: 0}
