@startuml
left to right direction
set separator none

actor "Administrateur de l'hôtel" as ad
actor "Agence de Réservation ou Client" as ag
actor "Personnel de l'hôtel" as p

rectangle "Gestion hôtel" {
    usecase "Login" as L
    usecase "Maintenance des hôtels" as M1
    usecase "Gestion d'un hôtel" as M2
    usecase "Gestion des chambres" as M3
    usecase "Consultation des réservations" as C1
    usecase "Consultation des disponibilités" as C2
    usecase "Enregistrement des réservations" as E1
    usecase "Enregistrement des arrhes" as E2
    usecase "Enregistrement des arrivées" as E3
    usecase "Gestion des consommations" as G1
    usecase "Etablissement des factures" as F1
    usecase "Edition de la liste des arrivées" as E4
    usecase "Etat d'occupation des chambres" as O1
}

ad --> L
ad --> M1
ad --> M2
ad --> M3
ad --> C1
ad --> C2
ad --> E1
ad --> E2
ad --> E3
ad --> G1
ad --> F1
ad --> E4
ad --> O1

ag --> C2
ag --> E1
ag --> E2

p --> E3
p --> G1
p --> F1
p --> E4
p --> O1
@enduml
