{
	"info": {
		"_postman_id": "0060dd4a-0a7c-4433-b062-9129235f9e7e",
		"name": "Inventario",
		"schema": "https://schema.getpostman.com/json/collection/v2.1.0/collection.json"
	},
	"item": [
		{
			"name": "ConsultarBienes",
			"request": {
				"method": "GET",
				"header": [],
				"url": {
					"raw": "https://localhost:5001/api/bienes",
					"protocol": "https",
					"host": [
						"localhost"
					],
					"port": "5001",
					"path": [
						"api",
						"bienes"
					]
				}
			},
			"response": []
		},
		{
			"name": "ConsultarBienById",
			"request": {
				"method": "GET",
				"header": [],
				"url": {
					"raw": "https://localhost:5001/api/bienes",
					"protocol": "https",
					"host": [
						"localhost"
					],
					"port": "5001",
					"path": [
						"api",
						"bienes"
					]
				}
			},
			"response": []
		},
		{
			"name": "CrearBien",
			"request": {
				"method": "GET",
				"header": [],
				"url": {
					"raw": "https://localhost:5001/api/bienes",
					"protocol": "https",
					"host": [
						"localhost"
					],
					"port": "5001",
					"path": [
						"api",
						"bienes"
					]
				}
			},
			"response": []
		},
		{
			"name": "ActualizarBien",
			"request": {
				"method": "GET",
				"header": [],
				"url": {
					"raw": "https://localhost:5001/api/bienes",
					"protocol": "https",
					"host": [
						"localhost"
					],
					"port": "5001",
					"path": [
						"api",
						"bienes"
					]
				}
			},
			"response": []
		},
		{
			"name": "EliminarBien",
			"request": {
				"method": "GET",
				"header": [],
				"url": {
					"raw": "https://localhost:5001/api/bienes",
					"protocol": "https",
					"host": [
						"localhost"
					],
					"port": "5001",
					"path": [
						"api",
						"bienes"
					]
				}
			},
			"response": []
		},
		{
			"name": "ConsultarCompras",
			"request": {
				"method": "GET",
				"header": [],
				"url": {
					"raw": "https://localhost:5001/api/bienes",
					"protocol": "https",
					"host": [
						"localhost"
					],
					"port": "5001",
					"path": [
						"api",
						"bienes"
					]
				}
			},
			"response": []
		},
		{
			"name": "ConsultarCompraById",
			"request": {
				"method": "GET",
				"header": [],
				"url": {
					"raw": "https://localhost:5001/api/bienes",
					"protocol": "https",
					"host": [
						"localhost"
					],
					"port": "5001",
					"path": [
						"api",
						"bienes"
					]
				}
			},
			"response": []
		},
		{
			"name": "CrearCompra",
			"request": {
				"method": "GET",
				"header": [],
				"url": {
					"raw": "https://localhost:5001/api/bienes",
					"protocol": "https",
					"host": [
						"localhost"
					],
					"port": "5001",
					"path": [
						"api",
						"bienes"
					]
				}
			},
			"response": []
		},
		{
			"name": "ActualizarCompra",
			"request": {
				"method": "GET",
				"header": [],
				"url": {
					"raw": "https://localhost:5001/api/bienes",
					"protocol": "https",
					"host": [
						"localhost"
					],
					"port": "5001",
					"path": [
						"api",
						"bienes"
					]
				}
			},
			"response": []
		},
		{
			"name": "EliminarCompra",
			"request": {
				"method": "GET",
				"header": [],
				"url": {
					"raw": "https://localhost:5001/api/bienes",
					"protocol": "https",
					"host": [
						"localhost"
					],
					"port": "5001",
					"path": [
						"api",
						"bienes"
					]
				}
			},
			"response": []
		}
	],
	"protocolProfileBehavior": {}
}