<?xml version="1.0" encoding="utf-8"?>
<!-- Generator: Adobe Illustrator 22.0.1, SVG Export Plug-In . SVG Version: 6.00 Build 0)  -->
<svg version="1.1" id="Laag_1" xmlns="http://www.w3.org/2000/svg" xmlns:xlink="http://www.w3.org/1999/xlink" x="0px" y="0px"
	 viewBox="0 0 36 36" enable-background="new 0 0 36 36" xml:space="preserve">
<line fill="none" stroke="#6F6F6F" stroke-width="4" stroke-linecap="round" stroke-miterlimit="10" x1="2.5" y1="2.5" x2="33.5" y2="33.5"/>
<line fill="none" stroke="#6F6F6F" stroke-width="4" stroke-linecap="round" stroke-miterlimit="10" x1="33.5" y1="2.5" x2="2.5" y2="33.5"/>
<g>
</g>
<g>
</g>
<g>
</g>
<g>
</g>
<g>
</g>
<g>
</g>
<g>
</g>
<g>
</g>
<g>
</g>
<g>
</g>
<g>
</g>
<g>
</g>
<g>
</g>
<g>
</g>
<g>
</g>
</svg>
