EESchema Schematic File Version 4
EELAYER 30 0
EELAYER END
$Descr A3 16535 11693
encoding utf-8
Sheet 7 8
Title ""
Date ""
Rev ""
Comp ""
Comment1 ""
Comment2 ""
Comment3 ""
Comment4 ""
$EndDescr
$Comp
L Device:R R55
U 1 1 5EA66ACC
P 2750 9800
F 0 "R55" H 2820 9846 50  0000 L CNN
F 1 "40.2k" H 2820 9755 50  0000 L CNN
F 2 "10005011 Power Management:R0603_1" V 2680 9800 50  0001 C CNN
F 3 "~" H 2750 9800 50  0001 C CNN
	1    2750 9800
	1    0    0    -1  
$EndComp
$Comp
L Device:C C24
U 1 1 5EA66AD2
P 2300 9800
F 0 "C24" H 2415 9754 50  0000 L CNN
F 1 "4.7nF" H 2415 9845 50  0000 L CNN
F 2 "10005011 Power Management:C0603_1" H 2338 9650 50  0001 C CNN
F 3 "~" H 2300 9800 50  0001 C CNN
	1    2300 9800
	1    0    0    1   
$EndComp
$Comp
L 10005011_Power_Management:2N7002 T17
U 1 1 5EA66AD8
P 4400 9800
F 0 "T17" H 4600 9875 50  0000 L CNN
F 1 "2N7002" H 4600 9800 50  0000 L CNN
F 2 "10005011 Power Management:SOT23-GSD_1" H 4600 9725 50  0001 L CIN
F 3 "https://www.fairchildsemi.com/datasheets/2N/2N7002.pdf" H 4400 9800 50  0001 L CNN
	1    4400 9800
	1    0    0    -1  
$EndComp
$Comp
L Device:C C99
U 1 1 5EA66AE4
P 1250 10300
F 0 "C99" H 1365 10346 50  0000 L CNN
F 1 "10nF" H 1365 10255 50  0000 L CNN
F 2 "10005011 Power Management:C0603_1" H 1288 10150 50  0001 C CNN
F 3 "~" H 1250 10300 50  0001 C CNN
	1    1250 10300
	1    0    0    -1  
$EndComp
Wire Wire Line
	1700 10050 1700 9850
Wire Wire Line
	1250 10050 1250 10150
Wire Wire Line
	1250 10450 1250 10550
Wire Wire Line
	1800 10550 1800 10450
$Comp
L power:GND #PWR0218
U 1 1 5EA66AF0
P 1400 10650
F 0 "#PWR0218" H 1400 10400 50  0001 C CNN
F 1 "GND" H 1400 10500 50  0000 C CNN
F 2 "" H 1400 10650 50  0001 C CNN
F 3 "" H 1400 10650 50  0001 C CNN
	1    1400 10650
	1    0    0    -1  
$EndComp
Wire Wire Line
	1600 9850 1600 10550
Connection ~ 1600 10550
Wire Wire Line
	1600 10550 1800 10550
Wire Wire Line
	1400 10550 1400 10650
Connection ~ 1400 10550
Wire Wire Line
	1400 10550 1600 10550
Wire Wire Line
	2300 9950 2300 10050
Wire Wire Line
	2300 10050 2750 10050
Wire Wire Line
	2750 10050 2750 9950
$Comp
L power:GND #PWR0219
U 1 1 5EA66AFF
P 2750 10150
F 0 "#PWR0219" H 2750 9900 50  0001 C CNN
F 1 "GND" H 2750 10000 50  0000 C CNN
F 2 "" H 2750 10150 50  0001 C CNN
F 3 "" H 2750 10150 50  0001 C CNN
	1    2750 10150
	1    0    0    -1  
$EndComp
Wire Wire Line
	2750 10150 2750 10050
Connection ~ 2750 10050
Text Label 1800 10050 0    50   ~ 0
ROS
Wire Wire Line
	2000 9550 2300 9550
Wire Wire Line
	2300 9550 2300 9650
Connection ~ 2300 9550
Wire Wire Line
	2300 9550 2750 9550
Wire Wire Line
	2750 9550 2750 9650
Connection ~ 2750 9550
Wire Wire Line
	2750 9550 2900 9550
$Comp
L power:GND #PWR0220
U 1 1 5EA66B10
P 4500 10400
F 0 "#PWR0220" H 4500 10150 50  0001 C CNN
F 1 "GND" H 4500 10250 50  0000 C CNN
F 2 "" H 4500 10400 50  0001 C CNN
F 3 "" H 4500 10400 50  0001 C CNN
	1    4500 10400
	1    0    0    -1  
$EndComp
$Comp
L Device:R R54
U 1 1 5EA66B16
P 4100 10050
F 0 "R54" H 4170 10096 50  0000 L CNN
F 1 "100k" H 4170 10005 50  0000 L CNN
F 2 "10005011 Power Management:R0603_1" V 4030 10050 50  0001 C CNN
F 3 "~" H 4100 10050 50  0001 C CNN
	1    4100 10050
	1    0    0    -1  
$EndComp
$Comp
L Device:R R51
U 1 1 5EA66B1E
P 3750 8750
F 0 "R51" H 3680 8704 50  0000 R CNN
F 1 "10k" H 3680 8795 50  0000 R CNN
F 2 "10005011 Power Management:R0603_1" V 3680 8750 50  0001 C CNN
F 3 "~" H 3750 8750 50  0001 C CNN
	1    3750 8750
	-1   0    0    1   
$EndComp
$Comp
L Device:R R46
U 1 1 5EA66B24
P 3750 8150
F 0 "R46" H 3680 8104 50  0000 R CNN
F 1 "10k" H 3680 8195 50  0000 R CNN
F 2 "10005011 Power Management:R0603_1" V 3680 8150 50  0001 C CNN
F 3 "~" H 3750 8150 50  0001 C CNN
	1    3750 8150
	-1   0    0    1   
$EndComp
Wire Wire Line
	3750 8300 3750 8400
Wire Wire Line
	4500 10000 4500 10300
Wire Wire Line
	4100 9800 4100 9900
Wire Wire Line
	4050 9800 4100 9800
Wire Wire Line
	4100 10200 4100 10300
Wire Wire Line
	4500 10400 4500 10300
Connection ~ 4500 10300
$Comp
L Device:R R44
U 1 1 5EA66B37
P 2200 7900
F 0 "R44" V 2300 7900 50  0000 C CNN
F 1 "100k" V 2375 7900 50  0000 C CNN
F 2 "10005011 Power Management:R0603_1" V 2130 7900 50  0001 C CNN
F 3 "~" H 2200 7900 50  0001 C CNN
	1    2200 7900
	0    1    1    0   
$EndComp
$Comp
L Device:R R45
U 1 1 5EA66B3D
P 3150 7900
F 0 "R45" V 2943 7900 50  0000 C CNN
F 1 "0.015 " V 3034 7900 50  0000 C CNN
F 2 "10005011 Power Management:R2010_1" V 3080 7900 50  0001 C CNN
F 3 "~" H 3150 7900 50  0001 C CNN
F 4 "1%" V 3150 7900 50  0001 C CNN "Tolerance"
F 5 "10022710" V 3150 7900 50  0001 C CNN "Item Number"
F 6 "RESISTOR, 0.015 OHM, 1W,+/-1%,2010" V 3150 7900 50  0001 C CNN "Description"
	1    3150 7900
	0    -1   1    0   
$EndComp
$Comp
L Device:R R47
U 1 1 5EA66B44
P 1900 8250
F 0 "R47" H 1970 8204 50  0000 L CNN
F 1 "10k" H 1970 8295 50  0000 L CNN
F 2 "10005011 Power Management:R0603_1" V 1830 8250 50  0001 C CNN
F 3 "~" H 1900 8250 50  0001 C CNN
	1    1900 8250
	1    0    0    1   
$EndComp
$Comp
L Device:C C22
U 1 1 5EA66B4A
P 1500 8250
F 0 "C22" H 1385 8204 50  0000 R CNN
F 1 "10nF" H 1385 8295 50  0000 R CNN
F 2 "10005011 Power Management:C0603_1" H 1538 8100 50  0001 C CNN
F 3 "~" H 1500 8250 50  0001 C CNN
	1    1500 8250
	-1   0    0    1   
$EndComp
Wire Wire Line
	1500 8400 1500 8500
Wire Wire Line
	1500 8500 1900 8500
Wire Wire Line
	1900 8500 1900 8400
Wire Wire Line
	1900 8550 1900 8500
Connection ~ 1900 8500
Wire Wire Line
	1200 7900 1500 7900
Wire Wire Line
	2350 7900 2500 7900
Wire Wire Line
	2500 7800 2500 7900
Connection ~ 2500 7900
Wire Wire Line
	2500 7900 3000 7900
Wire Wire Line
	1900 7900 1900 8100
Connection ~ 1900 7900
Wire Wire Line
	1900 7900 2050 7900
Wire Wire Line
	1500 7900 1500 8100
Connection ~ 1500 7900
Wire Wire Line
	1500 7900 1900 7900
Wire Wire Line
	3000 7900 2900 8000
Connection ~ 3000 7900
Wire Wire Line
	3300 7900 3750 7900
Wire Wire Line
	3300 7900 3400 8000
Connection ~ 3300 7900
Connection ~ 4100 9800
Wire Wire Line
	4100 9800 4200 9800
Wire Wire Line
	4100 10300 4500 10300
Wire Wire Line
	4300 9400 4500 9400
Wire Wire Line
	1400 9450 1300 9450
Wire Wire Line
	1300 9450 1300 9150
Wire Wire Line
	1300 9150 3400 9150
Wire Wire Line
	3400 9150 3400 8000
Wire Wire Line
	1400 9650 1200 9650
Wire Wire Line
	1200 9650 1200 9050
Wire Wire Line
	1200 9050 1600 9050
Wire Wire Line
	2900 9050 2900 8000
Wire Wire Line
	1600 9050 1600 9250
Connection ~ 1600 9050
Wire Wire Line
	1600 9050 2900 9050
$Comp
L Device:C C23
U 1 1 5EA66B74
P 800 9250
F 0 "C23" H 915 9296 50  0000 L CNN
F 1 "100nF" H 915 9205 50  0000 L CNN
F 2 "10005011 Power Management:C0805_1" H 838 9100 50  0001 C CNN
F 3 "~" H 800 9250 50  0001 C CNN
F 4 "CAPACITOR CERAMIC, 100NF, +/-10%, 50V, X7R,0805" H 800 9250 50  0001 C CNN "Description"
F 5 "10022135" H 800 9250 50  0001 C CNN "Item Number"
	1    800  9250
	1    0    0    -1  
$EndComp
$Comp
L power:GND #PWR0221
U 1 1 5EA66B7A
P 800 9450
F 0 "#PWR0221" H 800 9200 50  0001 C CNN
F 1 "GND" H 800 9300 50  0000 C CNN
F 2 "" H 800 9450 50  0001 C CNN
F 3 "" H 800 9450 50  0001 C CNN
	1    800  9450
	1    0    0    -1  
$EndComp
Wire Wire Line
	800  9400 800  9450
Wire Wire Line
	1250 10050 1700 10050
Wire Wire Line
	1250 10550 1400 10550
Wire Wire Line
	800  9050 1200 9050
Connection ~ 1200 9050
$Comp
L 10005011_Power_Management:SUD50P06-15L-E3 T15
U 1 1 5EA66B86
P 5900 8000
F 0 "T15" V 6242 8000 50  0000 C CNN
F 1 "SUD50P06-15L" V 6151 8000 50  0000 C CNN
F 2 "10005011 Power Management:DPAK-GDS_1" H 6095 7925 50  0001 L CIN
F 3 "https://www.vishay.com/docs/68940/sud50p06.pdf" H 5900 8000 50  0001 C CNN
	1    5900 8000
	0    1    -1   0   
$EndComp
$Comp
L 10005011_Power_Management:IRLML5103TRPBF T16
U 1 1 5EA66B92
P 4200 8400
F 0 "T16" H 4404 8354 50  0000 L CNN
F 1 "IRLML5103" H 4404 8445 50  0000 L CNN
F 2 "10005011 Power Management:SOT23-GSD_1" H 4400 8325 50  0001 L CIN
F 3 "https://www.infineon.com/dgdl/irlml5103pbf.pdf?fileId=5546d462533600a401535668505d2617" H 4200 8400 50  0001 L CNN
F 4 "MOSFET P-CH 30V 760MA SOT-23" H 5075 8325 50  0001 C CNN "Description"
F 5 "10022933" H 4200 8400 50  0001 C CNN "Item Number"
F 6 "Infineon Technologies" H 4825 8325 50  0001 C CNN "Mfgr"
F 7 "IRLML5103TRPBF" H 4725 8325 50  0001 C CNN "Mfgr_PN"
F 8 "Digi-Key" H 4575 8325 50  0001 C CNN "Source"
F 9 "IRLML5103PBFCT-ND" H 4800 8325 50  0001 C CNN "Source_PN"
	1    4200 8400
	1    0    0    1   
$EndComp
Wire Wire Line
	3750 8900 3750 9000
Wire Wire Line
	3750 9000 4500 9000
Wire Wire Line
	4500 9000 4500 9400
Connection ~ 4500 9400
Wire Wire Line
	4500 9400 4500 9600
Wire Wire Line
	3750 8000 3750 7900
Connection ~ 3750 7900
$Comp
L Device:R R48
U 1 1 5EA66B9F
P 4850 8250
F 0 "R48" H 4920 8296 50  0000 L CNN
F 1 "39k" H 4920 8205 50  0000 L CNN
F 2 "10005011 Power Management:R0603_1" V 4780 8250 50  0001 C CNN
F 3 "~" H 4850 8250 50  0001 C CNN
	1    4850 8250
	1    0    0    -1  
$EndComp
Wire Wire Line
	3750 7900 4100 7900
Wire Wire Line
	4300 7900 4300 8200
Connection ~ 4300 7900
Wire Wire Line
	4300 7900 4850 7900
$Comp
L Device:R R52
U 1 1 5EA66BA9
P 5200 8950
F 0 "R52" H 5270 8996 50  0000 L CNN
F 1 "33k" H 5270 8905 50  0000 L CNN
F 2 "10005011 Power Management:R0603_1" V 5130 8950 50  0001 C CNN
F 3 "~" H 5200 8950 50  0001 C CNN
	1    5200 8950
	1    0    0    -1  
$EndComp
$Comp
L power:GND #PWR0222
U 1 1 5EA66BAF
P 5200 9200
F 0 "#PWR0222" H 5200 8950 50  0001 C CNN
F 1 "GND" H 5200 9050 50  0000 C CNN
F 2 "" H 5200 9200 50  0001 C CNN
F 3 "" H 5200 9200 50  0001 C CNN
	1    5200 9200
	1    0    0    -1  
$EndComp
Wire Wire Line
	5200 9200 5200 9100
Wire Wire Line
	4300 8600 4300 8700
Wire Wire Line
	4300 8700 4850 8700
Wire Wire Line
	5200 8700 5200 8200
Wire Wire Line
	3750 8400 4000 8400
Connection ~ 3750 8400
Wire Wire Line
	3750 8400 3750 8600
Wire Wire Line
	4850 7900 4850 8100
Connection ~ 4850 7900
Wire Wire Line
	4850 7900 5000 7900
Wire Wire Line
	4850 8400 4850 8700
Connection ~ 4850 8700
Wire Wire Line
	4850 8700 5200 8700
Wire Wire Line
	5200 8700 5200 8800
Wire Wire Line
	4100 7700 4100 7900
Connection ~ 4100 7900
Wire Wire Line
	4100 7900 4300 7900
Wire Wire Line
	5400 7900 5700 7900
$Comp
L Device:R R49
U 1 1 5EA66BCA
P 6500 8150
F 0 "R49" H 6430 8104 50  0000 R CNN
F 1 "10k" H 6430 8195 50  0000 R CNN
F 2 "10005011 Power Management:R0603_1" V 6430 8150 50  0001 C CNN
F 3 "~" H 6500 8150 50  0001 C CNN
	1    6500 8150
	-1   0    0    1   
$EndComp
$Comp
L Device:R R50
U 1 1 5EA66BD0
P 5900 8650
F 0 "R50" H 5830 8604 50  0000 R CNN
F 1 "10k" H 5830 8695 50  0000 R CNN
F 2 "10005011 Power Management:R0603_1" V 5830 8650 50  0001 C CNN
F 3 "~" H 5900 8650 50  0001 C CNN
	1    5900 8650
	-1   0    0    1   
$EndComp
Wire Wire Line
	6100 7900 6500 7900
Wire Wire Line
	6500 7900 6500 8000
Wire Wire Line
	5900 8200 5900 8400
Wire Wire Line
	6500 8300 6500 8400
Wire Wire Line
	6500 8400 5900 8400
Connection ~ 5900 8400
Wire Wire Line
	5900 8400 5900 8500
Connection ~ 5200 8700
$Comp
L 10005011_Power_Management:2N7002 T18
U 1 1 5EA66BDF
P 5800 9650
F 0 "T18" H 6000 9725 50  0000 L CNN
F 1 "2N7002" H 6000 9650 50  0000 L CNN
F 2 "10005011 Power Management:SOT23-GSD_1" H 6000 9575 50  0001 L CIN
F 3 "https://www.diodes.com/assets/Datasheets/2N7002AQ.pdf" H 6025 9525 50  0001 L CNN
F 4 "MOSFET N-CH 60V 350MA SOT23" H 6675 9525 50  0001 C CNN "Description"
F 5 "10022882" H 5800 9650 50  0001 C CNN "Item Number"
F 6 "Diodes Incorporated" H 6375 9525 50  0001 C CNN "Mfgr"
F 7 "2N7002AQ-7" H 6300 9550 50  0001 C CNN "Mfgr_PN"
F 8 "Digi-Key" H 6600 10325 50  0001 C CNN "Source"
F 9 "2N7002AQ-7DICT-ND" H 6700 10425 50  0001 C CNN "Source_PN"
	1    5800 9650
	1    0    0    -1  
$EndComp
$Comp
L power:GND #PWR0223
U 1 1 5EA66BE5
P 5900 10250
F 0 "#PWR0223" H 5900 10000 50  0001 C CNN
F 1 "GND" H 5900 10100 50  0000 C CNN
F 2 "" H 5900 10250 50  0001 C CNN
F 3 "" H 5900 10250 50  0001 C CNN
	1    5900 10250
	1    0    0    -1  
$EndComp
$Comp
L Device:R R53
U 1 1 5EA66BEB
P 5500 9900
F 0 "R53" H 5430 9854 50  0000 R CNN
F 1 "100k" H 5430 9945 50  0000 R CNN
F 2 "10005011 Power Management:R0603_1" V 5430 9900 50  0001 C CNN
F 3 "~" H 5500 9900 50  0001 C CNN
	1    5500 9900
	-1   0    0    1   
$EndComp
Wire Wire Line
	5900 9850 5900 10150
Wire Wire Line
	5500 9650 5500 9750
Wire Wire Line
	5500 10050 5500 10150
Wire Wire Line
	5900 10250 5900 10150
Connection ~ 5900 10150
Connection ~ 5500 9650
Wire Wire Line
	5500 9650 5600 9650
Wire Wire Line
	5500 10150 5900 10150
Wire Wire Line
	5900 8800 5900 9450
Wire Wire Line
	5200 9750 5200 9650
Wire Wire Line
	5200 9650 5500 9650
Connection ~ 6500 7900
$Comp
L 10005011_Power_Management:INA170 IC7
U 1 1 5EADCC7F
P 1700 9550
F 0 "IC7" H 1800 9700 50  0000 L CNN
F 1 "INA170" H 1850 9450 50  0000 L CNN
F 2 "10005011 Power Management:uSO08_1" H 1700 8900 50  0001 C CNN
F 3 "https://www.ti.com/lit/ds/symlink/ina170.pdf" H 1850 9700 50  0001 C CNN
F 4 "IC,CURRENT SHUNT MONITOR,MSOP" H 1700 9550 50  0001 C CNN "Description"
F 5 "10022891" H 1700 9550 50  0001 C CNN "Item Number"
F 6 "TEXAS INSTRUMENTS" H 1700 9550 50  0001 C CNN "Manufacturer"
F 7 "INA170EA" H 1700 9550 50  0001 C CNN "Manufacturer_No"
	1    1700 9550
	1    0    0    -1  
$EndComp
Connection ~ 1250 10050
$Comp
L 10005011_Power_Management:VBAT #PWR0232
U 1 1 5EAF5345
P 2500 7800
F 0 "#PWR0232" H 2500 7650 50  0001 C CNN
F 1 "VBAT" H 2515 7999 50  0000 C CNN
F 2 "" H 2500 7800 50  0001 C CNN
F 3 "" H 2500 7800 50  0001 C CNN
	1    2500 7800
	1    0    0    -1  
$EndComp
$Comp
L 10005011_Power_Management:0VANA #PWR0239
U 1 1 5EB5E66A
P 1900 8550
F 0 "#PWR0239" H 1900 8300 50  0001 C CNN
F 1 "0VANA" H 1905 8377 50  0000 C CNN
F 2 "" H 1900 8550 50  0001 C CNN
F 3 "" H 1900 8550 50  0001 C CNN
	1    1900 8550
	1    0    0    -1  
$EndComp
$Comp
L Connector:Conn_01x10_Male J5
U 1 1 5E9AD81A
P 11300 5300
F 0 "J5" H 11408 5881 50  0000 C CNN
F 1 "EXT DC" H 11408 5790 50  0000 C CNN
F 2 "10005011 Power Management:EPG-1B-306-HLN_1" H 11300 5300 50  0001 C CNN
F 3 "~" H 11300 5300 50  0001 C CNN
	1    11300 5300
	1    0    0    -1  
$EndComp
Text Notes 13000 4500 2    50   ~ 0
Someone said the original connector is no longer available.\nThis generic symbol can be replaced with whatever we find later.
Wire Wire Line
	11500 4900 11600 4900
Wire Wire Line
	11600 4900 11600 5000
Wire Wire Line
	11600 5100 11500 5100
Wire Wire Line
	11500 5200 11600 5200
Wire Wire Line
	11600 5400 11500 5400
Wire Wire Line
	11500 5300 11600 5300
Connection ~ 11600 5300
Wire Wire Line
	11600 5300 11600 5400
Wire Wire Line
	11500 5000 11600 5000
Connection ~ 11600 5000
$Comp
L Device:C C106
U 1 1 5E9BAE39
P 12500 5150
F 0 "C106" H 12615 5059 50  0000 L CNN
F 1 "100nF" H 12615 5150 50  0000 L CNN
F 2 "10005011 Power Management:C0805_1" H 12538 5000 50  0001 C CNN
F 3 "https://www.yageo.com/upload/media/product/productsearch/datasheet/mlcc/UPY-GPHC_X7R_6.3V-to-50V_18.pdf" H 12500 5150 50  0001 C CNN
F 4 "Yageo" H 12500 5150 50  0001 C CNN "Mfgr"
F 5 "CC0805KRX7R9BB104" H 12500 5150 50  0001 C CNN "Mfgr_PN"
F 6 "Digi-Key" H 12500 5150 50  0001 C CNN "Source"
F 7 "311-1140-1-ND" H 12500 5150 50  0001 C CNN "Source_PN"
F 8 "" H 12615 5241 50  0001 L CNN "Bom_Footprint"
F 9 "CAPACITOR CERAMIC, 100NF, +/-10%, 50V, X7R,0805" H 12500 5150 50  0001 C CNN "Description"
F 10 "X7R" H 12500 5150 50  0001 C CNN "Dielectric"
F 11 "50V" H 12500 5150 50  0001 C CNN "Voltage"
F 12 "10022135" H 12500 5150 50  0001 C CNN "Item Number"
	1    12500 5150
	1    0    0    1   
$EndComp
Wire Wire Line
	11600 5000 11600 5100
Wire Wire Line
	11600 5200 11600 5300
Wire Wire Line
	11600 4900 12050 4900
Wire Wire Line
	12500 4900 12500 5000
Connection ~ 11600 4900
Wire Wire Line
	11600 5400 12500 5400
Wire Wire Line
	12500 5400 12500 5300
Connection ~ 11600 5400
Wire Wire Line
	12500 4900 13100 4900
Connection ~ 12500 4900
Wire Wire Line
	13100 5400 12500 5400
Connection ~ 12500 5400
$Comp
L Device:Fuse F1
U 1 1 5E9BFF71
P 14550 5000
F 0 "F1" V 14353 5000 50  0000 C CNN
F 1 "10A" V 14444 5000 50  0000 C CNN
F 2 "10005011 Power Management:FU-0031.8221_1" V 14480 5000 50  0001 C CNN
F 3 "http://www.schurterinc.com/bundles/snceschurter/epim/_ProdPool_/newDS/en/typ_OGN-SMD.pdf" H 14550 5000 50  0001 C CNN
	1    14550 5000
	0    -1   1    0   
$EndComp
$Comp
L 10005011_Power_Management:PGND #PWR0241
U 1 1 5E9C1205
P 14250 5600
F 0 "#PWR0241" H 14250 5350 50  0001 C CNN
F 1 "PGND" H 14255 5427 50  0000 C CNN
F 2 "" H 14250 5600 50  0001 C CNN
F 3 "" H 14250 5600 50  0001 C CNN
	1    14250 5600
	1    0    0    -1  
$EndComp
$Comp
L Device:D_TVS D13
U 1 1 5E9C7BFC
P 14900 5250
F 0 "D13" V 14854 5329 50  0000 L CNN
F 1 "SMCJ33C" V 14945 5329 50  0000 L CNN
F 2 "10005011 Power Management:SMC-NP_1" H 14900 5250 50  0001 C CNN
F 3 "https://www.diodes.com/assets/Datasheets/ds40741.pdf" H 14900 5250 50  0001 C CNN
F 4 "Diodes Incorporated" H 14900 5250 50  0001 C CNN "Mfgr"
F 5 "SMCJ33CAQ-13-F" H 14900 5250 50  0001 C CNN "Mfgr_PN"
F 6 "Digi-Key" H 14900 5250 50  0001 C CNN "Source"
F 7 "SMCJ33CAQ-13-FDICT-ND" H 14900 5250 50  0001 C CNN "Source_PN"
F 8 "DIODE, 33V, VCL 53.3V, 1500W" H 14900 5250 50  0001 C CNN "Description"
F 9 "10022658" V 14900 5250 50  0001 C CNN "Item Number"
	1    14900 5250
	0    1    -1   0   
$EndComp
$Comp
L 10005011_Power_Management:PGND #PWR0242
U 1 1 5E9CA45E
P 14900 5500
F 0 "#PWR0242" H 14900 5250 50  0001 C CNN
F 1 "PGND" H 14905 5327 50  0000 C CNN
F 2 "" H 14900 5500 50  0001 C CNN
F 3 "" H 14900 5500 50  0001 C CNN
	1    14900 5500
	1    0    0    -1  
$EndComp
Wire Wire Line
	14900 5400 14900 5500
$Comp
L 10005011_Power_Management:VDCEXT #PWR0243
U 1 1 5E9CA8C8
P 14900 4900
F 0 "#PWR0243" H 14900 4750 50  0001 C CNN
F 1 "VDCEXT" H 14915 5099 50  0000 C CNN
F 2 "" H 14900 4900 50  0001 C CNN
F 3 "" H 14900 4900 50  0001 C CNN
	1    14900 4900
	1    0    0    -1  
$EndComp
Wire Wire Line
	14900 4900 14900 5000
Wire Wire Line
	14700 5000 14900 5000
Connection ~ 14900 5000
Wire Wire Line
	14900 5000 14900 5100
$Comp
L 10005011_Power_Management:ECM100US33>2413 #ALIM1
U 1 1 5E985667
P 13950 2150
F 0 "#ALIM1" H 13950 2815 50  0000 C CNN
F 1 "ECM100US33>2413" H 13950 2724 50  0000 C CNN
F 2 "" H 13950 1800 100 0001 C CNN
F 3 "" H 13950 1700 100 0001 C CNN
F 4 "POWER SUPPLY, 220VAC, 33VDC, 100W" H 13950 2150 50  0001 C CNN "Description"
F 5 "10022932" H 13950 2150 50  0001 C CNN "Item Number"
F 6 "XP POWER PLC" H 13950 2150 50  0001 C CNN "Manufacturer"
F 7 "ECM100US33>2413" H 13950 2150 50  0001 C CNN "Manufacturer_No"
	1    13950 2150
	1    0    0    -1  
$EndComp
$Comp
L 10005011_Power_Management:CMF2 SW1
U 1 1 5E986E8B
P 11350 2400
F 0 "SW1" H 11433 3265 50  0000 C CNN
F 1 "CMF2" H 11433 3174 50  0000 C CNN
F 2 "10005011 Power Management:CMF1_1" H 11200 2450 100 0001 C CNN
F 3 "https://www.schurter.com/en/datasheet/typ_CMF2__CMF5.pdf" H 11200 2450 100 0001 C CNN
F 4 "SWITCH SOCKET 2 POLES" H 11350 2400 50  0001 C CNN "Description"
F 5 "10022930" H 11350 2400 50  0001 C CNN "Item Number"
F 6 "SCHURTER" H 11350 2400 50  0001 C CNN "Manufacturer"
F 7 "CMF2.1011.12" H 11350 2400 50  0001 C CNN "Manufacturer_No"
	1    11350 2400
	1    0    0    -1  
$EndComp
$Comp
L Connector:Conn_01x03_Female J4
U 1 1 5E98CEDB
P 13400 2000
F 0 "J4" H 13200 2250 50  0000 L CNN
F 1 "AC" H 13200 1800 50  0000 L CNN
F 2 "10005011 Power Management:MOL41815-03_1" H 13400 2000 50  0001 C CNN
F 3 "~" H 13400 2000 50  0001 C CNN
	1    13400 2000
	1    0    0    -1  
$EndComp
$Comp
L Connector:Conn_01x12_Female J3
U 1 1 5E99332E
P 14500 2300
F 0 "J3" H 14392 2985 50  0000 C CNN
F 1 "DC" H 14392 2894 50  0000 C CNN
F 2 "10005011 Power Management:MOL41815-12_1" H 14500 2300 50  0001 C CNN
F 3 "~" H 14500 2300 50  0001 C CNN
	1    14500 2300
	-1   0    0    -1  
$EndComp
$Comp
L Connector:TestPoint_Alt PST9
U 1 1 5E9959DE
P 12600 1800
F 0 "PST9" V 12554 1988 50  0000 L CNN
F 1 "PST9" V 12645 1988 50  0001 L CNN
F 2 "10005011 Power Management:PT-1.3MM_FOURCHE_1" H 12800 1800 50  0001 C CNN
F 3 "~" H 12800 1800 50  0001 C CNN
	1    12600 1800
	0    1    1    0   
$EndComp
Wire Wire Line
	13200 1900 12500 1900
Wire Wire Line
	12500 1800 11850 1800
Wire Wire Line
	13200 2100 12500 2100
Wire Wire Line
	12500 2100 12500 2200
Wire Wire Line
	12500 2200 11850 2200
Wire Wire Line
	12500 1900 12500 1800
$Comp
L Connector:TestPoint_Alt PST14
U 1 1 5E99C560
P 12600 2200
F 0 "PST14" V 12554 2388 50  0000 L CNN
F 1 "PST14" V 12645 2388 50  0001 L CNN
F 2 "10005011 Power Management:PT-1.3MM_FOURCHE_1" H 12800 2200 50  0001 C CNN
F 3 "~" H 12800 2200 50  0001 C CNN
	1    12600 2200
	0    1    1    0   
$EndComp
Text Label 12000 1800 0    50   ~ 0
AC-N
Text Label 12000 2200 0    50   ~ 0
AC-L
Wire Wire Line
	12600 1800 12500 1800
Connection ~ 12500 1800
Wire Wire Line
	12500 2200 12600 2200
Connection ~ 12500 2200
Wire Wire Line
	11850 2600 12200 2600
$Comp
L power:GND #PWR0244
U 1 1 5E9A2653
P 12000 3100
F 0 "#PWR0244" H 12000 2850 50  0001 C CNN
F 1 "GND" H 12005 2927 50  0000 C CNN
F 2 "" H 12000 3100 50  0001 C CNN
F 3 "" H 12000 3100 50  0001 C CNN
	1    12000 3100
	1    0    0    -1  
$EndComp
Wire Wire Line
	11850 2900 12000 2900
Wire Wire Line
	12000 2900 12000 3100
Wire Wire Line
	14700 2200 14800 2200
Wire Wire Line
	14800 2200 14800 2300
Wire Wire Line
	14800 2500 14700 2500
Wire Wire Line
	14700 2400 14800 2400
Connection ~ 14800 2400
Wire Wire Line
	14800 2400 14800 2500
Wire Wire Line
	14700 2300 14800 2300
Connection ~ 14800 2300
Wire Wire Line
	14800 2300 14800 2400
$Comp
L 10005011_Power_Management:PGND #PWR0245
U 1 1 5E9A4340
P 14900 2300
F 0 "#PWR0245" H 14900 2050 50  0001 C CNN
F 1 "PGND" H 14905 2127 50  0000 C CNN
F 2 "" H 14900 2300 50  0001 C CNN
F 3 "" H 14900 2300 50  0001 C CNN
	1    14900 2300
	1    0    0    -1  
$EndComp
Wire Wire Line
	14800 2200 14900 2200
Wire Wire Line
	14900 2200 14900 2300
Connection ~ 14800 2200
Wire Wire Line
	15100 2100 15100 2600
Wire Wire Line
	15100 2600 14800 2600
Wire Wire Line
	14800 2600 14800 2700
Wire Wire Line
	14800 2900 14700 2900
Connection ~ 14800 2600
Wire Wire Line
	14800 2600 14700 2600
Wire Wire Line
	14700 2700 14800 2700
Connection ~ 14800 2700
Wire Wire Line
	14800 2700 14800 2800
Wire Wire Line
	14700 2800 14800 2800
Connection ~ 14800 2800
Wire Wire Line
	14800 2800 14800 2900
Wire Wire Line
	14700 2100 15100 2100
Wire Wire Line
	14700 2000 15100 2000
Wire Wire Line
	15100 2000 15100 2100
Connection ~ 15100 2100
NoConn ~ 14700 1800
NoConn ~ 14700 1900
NoConn ~ 13200 2000
$Comp
L 10005011_Power_Management:VACDC #PWR0246
U 1 1 5E9AA0EB
P 15100 1800
F 0 "#PWR0246" H 15100 1650 50  0001 C CNN
F 1 "VACDC" H 15115 1999 50  0000 C CNN
F 2 "" H 15100 1800 50  0001 C CNN
F 3 "" H 15100 1800 50  0001 C CNN
	1    15100 1800
	1    0    0    -1  
$EndComp
Wire Wire Line
	15100 1800 15100 2000
Connection ~ 15100 2000
$Comp
L Device:R R120
U 1 1 5FC2725B
P 7750 8600
F 0 "R120" H 7820 8554 50  0000 L CNN
F 1 "40.2k" H 7820 8645 50  0000 L CNN
F 2 "10005011 Power Management:R0603_1" V 7680 8600 50  0001 C CNN
F 3 "~" H 7750 8600 50  0001 C CNN
	1    7750 8600
	1    0    0    1   
$EndComp
$Comp
L Device:R R121
U 1 1 5FC27261
P 7750 8000
F 0 "R121" H 7680 7954 50  0000 R CNN
F 1 "39k" H 7680 8045 50  0000 R CNN
F 2 "10005011 Power Management:R0603_1" V 7680 8000 50  0001 C CNN
F 3 "~" H 7750 8000 50  0001 C CNN
	1    7750 8000
	-1   0    0    1   
$EndComp
Wire Wire Line
	7750 8150 7750 8250
Wire Wire Line
	7750 8250 8700 8250
Connection ~ 7750 8250
Wire Wire Line
	7750 8250 7750 8350
$Comp
L Device:C C107
U 1 1 5FC9B154
P 7350 8600
F 0 "C107" H 7235 8554 50  0000 R CNN
F 1 "22uF" H 7235 8645 50  0000 R CNN
F 2 "10005011 Power Management:C2220_1" H 7388 8450 50  0001 C CNN
F 3 "~" H 7350 8600 50  0001 C CNN
	1    7350 8600
	-1   0    0    1   
$EndComp
$Comp
L power:GND #PWR0247
U 1 1 5FD13775
P 7750 8950
F 0 "#PWR0247" H 7750 8700 50  0001 C CNN
F 1 "GND" H 7750 8800 50  0000 C CNN
F 2 "" H 7750 8950 50  0001 C CNN
F 3 "" H 7750 8950 50  0001 C CNN
	1    7750 8950
	1    0    0    -1  
$EndComp
Wire Wire Line
	7750 8950 7750 8850
Wire Wire Line
	7350 8750 7350 8850
Wire Wire Line
	7350 8850 7750 8850
Wire Wire Line
	7750 8850 7750 8750
Connection ~ 7750 8850
Wire Wire Line
	7350 8450 7350 8350
Wire Wire Line
	7350 8350 7750 8350
Connection ~ 7750 8350
Wire Wire Line
	7750 8350 7750 8450
$Comp
L 10005011_Power_Management:BAT54 D18
U 1 1 5FEEEA48
P 10300 8250
F 0 "D18" H 10250 8069 50  0000 C CNN
F 1 "BAT54" H 10250 8160 50  0000 C CNN
F 2 "10005011 Power Management:SOT23-1G_1" H 10070 8088 50  0001 L CNN
F 3 "http://www.onsemi.com/pub/Collateral/BAT54LT1-D.PDF" H 10220 8350 50  0001 C CNN
F 4 "DIODE SCHOTTKY 30V 200MA SOT23-3" H 10625 8075 60  0001 C CNN "Description"
F 5 "10022652" H 10300 8200 50  0001 C CNN "Item Number"
F 6 "ON Semiconductor" H 10625 8075 60  0001 C CNN "Mfgr"
F 7 "BAT54LT1G" H 10625 8075 60  0001 C CNN "Mfgr_PN"
F 8 "Digi-Key" H 10475 8075 60  0001 C CNN "Source"
F 9 "BAT54LT1GOSTR-ND" H 10450 8075 60  0001 C CNN "Source_PN"
	1    10300 8250
	-1   0    0    1   
$EndComp
$Comp
L Device:R R119
U 1 1 5FEF3103
P 8250 8000
F 0 "R119" H 8320 7954 50  0000 L CNN
F 1 "22k" H 8320 8045 50  0000 L CNN
F 2 "10005011 Power Management:R0603_1" V 8180 8000 50  0001 C CNN
F 3 "~" H 8250 8000 50  0001 C CNN
	1    8250 8000
	1    0    0    1   
$EndComp
$Comp
L Device:C C8
U 1 1 5FEF3937
P 8250 8700
F 0 "C8" H 8135 8654 50  0000 R CNN
F 1 "100nF" H 8135 8745 50  0000 R CNN
F 2 "10005011 Power Management:C0402_1" H 8288 8550 50  0001 C CNN
F 3 "~" H 8250 8700 50  0001 C CNN
F 4 "CAPACITOR,100NF,16V,+/-10%,X7R,0402" H 8250 8700 50  0001 C CNN "Description"
F 5 "10022607" H 8250 8700 50  0001 C CNN "Item Number"
F 6 "MURATA" H 8250 8700 50  0001 C CNN "Manufacturer"
F 7 "GRM155R71C104JA88J" H 8250 8700 50  0001 C CNN "Manufacturer_No"
	1    8250 8700
	-1   0    0    1   
$EndComp
$Comp
L Device:R R99
U 1 1 5FEF6229
P 8850 7650
F 0 "R99" V 8643 7650 50  0000 C CNN
F 1 "1k" V 8734 7650 50  0000 C CNN
F 2 "10005011 Power Management:RC1206_1" V 8780 7650 50  0001 C CNN
F 3 "~" H 8850 7650 50  0001 C CNN
	1    8850 7650
	0    -1   1    0   
$EndComp
$Comp
L 10005011_Power_Management:LM4040DIM3-5.0 IC23
U 1 1 5FEF7CEE
P 8700 8700
F 0 "IC23" V 8746 8613 50  0000 R CNN
F 1 "LM4040DIM3-5.0" V 8655 8613 50  0000 R CNN
F 2 "10005011 Power Management:SOT23-1G_1" H 8700 8500 50  0001 C CIN
F 3 "http://www.ti.com/lit/ds/symlink/lm4040-n.pdf" H 8700 8700 50  0001 C CIN
F 4 "IC,VOLTAGE REFERENCE,SHUNT, 5V,SOT23" H 8700 8400 50  0001 C CNN "Description"
F 5 "10022903" H 8750 8100 50  0001 C CNN "Item Number"
F 6 "NATIONAL SEMICONDUCTOR" H 8700 8300 50  0001 C CNN "Manufacturer"
F 7 "LM4040DIM3-5.0" H 8750 8200 50  0001 C CNN "Manufacturer_No"
	1    8700 8700
	0    -1   -1   0   
$EndComp
$Comp
L 10005011_Power_Management:LT1716IS5 IC21
U 1 1 5FF785A2
P 9600 8350
F 0 "IC21" H 9550 8600 50  0000 L CNN
F 1 "LT1716IS5" H 9550 8500 50  0000 L CNN
F 2 "10005011 Power Management:SOT23-5_1" H 9500 8150 50  0001 L CNN
F 3 "https://www.analog.com/media/en/technical-documentation/data-sheets/LT1716.pdf" H 9600 8550 50  0001 C CNN
F 4 "IC,RAIL TO RAIL COMPARATOR, 44V, SOT23" H 9600 8350 50  0001 C CNN "Description"
F 5 "10022902" H 9600 8350 50  0001 C CNN "Item Number"
F 6 "LINEAR TECHNOLOGY" H 9600 8350 50  0001 C CNN "Manufacturer"
F 7 "LT1716IS5#TRPBF" H 9600 8350 50  0001 C CNN "Manufacturer_No"
	1    9600 8350
	1    0    0    -1  
$EndComp
$Comp
L Device:R R118
U 1 1 6006BC80
P 8950 7950
F 0 "R118" V 9050 7950 50  0000 C CNN
F 1 "470k" V 9125 7950 50  0000 C CNN
F 2 "10005011 Power Management:R0603_1" V 8880 7950 50  0001 C CNN
F 3 "~" H 8950 7950 50  0001 C CNN
	1    8950 7950
	0    -1   -1   0   
$EndComp
$Comp
L power:GND #PWR0248
U 1 1 600E6533
P 8250 9050
F 0 "#PWR0248" H 8250 8800 50  0001 C CNN
F 1 "GND" H 8250 8900 50  0000 C CNN
F 2 "" H 8250 9050 50  0001 C CNN
F 3 "" H 8250 9050 50  0001 C CNN
	1    8250 9050
	1    0    0    -1  
$EndComp
$Comp
L power:GND #PWR0249
U 1 1 600E6DF9
P 9500 8850
F 0 "#PWR0249" H 9500 8600 50  0001 C CNN
F 1 "GND" H 9500 8700 50  0000 C CNN
F 2 "" H 9500 8850 50  0001 C CNN
F 3 "" H 9500 8850 50  0001 C CNN
	1    9500 8850
	1    0    0    -1  
$EndComp
Wire Wire Line
	8250 8850 8250 8950
Wire Wire Line
	8250 8150 8250 8450
Wire Wire Line
	9300 8450 8700 8450
Connection ~ 8250 8450
Wire Wire Line
	8250 8450 8250 8550
Wire Wire Line
	8700 8450 8700 8550
Connection ~ 8700 8450
Wire Wire Line
	8700 8450 8250 8450
Wire Wire Line
	8700 8850 8700 8950
Wire Wire Line
	8700 8950 8250 8950
Connection ~ 8250 8950
Wire Wire Line
	8250 8950 8250 9050
Wire Wire Line
	9500 8650 9500 8850
Wire Wire Line
	8700 8250 8700 7950
Wire Wire Line
	8700 7950 8800 7950
Connection ~ 8700 8250
Wire Wire Line
	8700 8250 9300 8250
Wire Wire Line
	9100 7950 10000 7950
Wire Wire Line
	10000 7950 10000 8350
Wire Wire Line
	10000 8350 9900 8350
Wire Wire Line
	10000 8350 10100 8350
$Comp
L Device:C C141
U 1 1 605504F3
P 9750 7650
F 0 "C141" V 9498 7650 50  0000 C CNN
F 1 "100nF" V 9589 7650 50  0000 C CNN
F 2 "10005011 Power Management:C0805_1" H 9788 7500 50  0001 C CNN
F 3 "~" H 9750 7650 50  0001 C CNN
F 4 "CAPACITOR CERAMIC, 100NF, +/-10%, 50V, X7R,0805" H 9750 7650 50  0001 C CNN "Description"
F 5 "10022135" H 9750 7650 50  0001 C CNN "Item Number"
	1    9750 7650
	0    -1   1    0   
$EndComp
Wire Wire Line
	9000 7650 9500 7650
Wire Wire Line
	9500 8050 9500 7650
Connection ~ 9500 7650
Wire Wire Line
	9500 7650 9600 7650
Connection ~ 10000 8350
$Comp
L power:GND #PWR0250
U 1 1 6075B044
P 10200 7750
F 0 "#PWR0250" H 10200 7500 50  0001 C CNN
F 1 "GND" H 10200 7600 50  0000 C CNN
F 2 "" H 10200 7750 50  0001 C CNN
F 3 "" H 10200 7750 50  0001 C CNN
	1    10200 7750
	1    0    0    -1  
$EndComp
Wire Wire Line
	10200 7650 10200 7750
Wire Wire Line
	9900 7650 10200 7650
Wire Wire Line
	8700 7650 8250 7650
Wire Wire Line
	7750 7650 7750 7850
Wire Wire Line
	8250 7850 8250 7650
Connection ~ 8250 7650
Wire Wire Line
	8250 7650 7750 7650
Wire Wire Line
	10700 8350 10600 8350
$Comp
L Device:R R124
U 1 1 60B1875B
P 12200 8700
F 0 "R124" H 12270 8654 50  0000 L CNN
F 1 "27k" H 12270 8745 50  0000 L CNN
F 2 "10005011 Power Management:R0603_1" V 12130 8700 50  0001 C CNN
F 3 "~" H 12200 8700 50  0001 C CNN
	1    12200 8700
	1    0    0    1   
$EndComp
$Comp
L Device:R R125
U 1 1 60B18761
P 12200 8100
F 0 "R125" H 12130 8054 50  0000 R CNN
F 1 "100k" H 12130 8145 50  0000 R CNN
F 2 "10005011 Power Management:R0603_1" V 12130 8100 50  0001 C CNN
F 3 "~" H 12200 8100 50  0001 C CNN
	1    12200 8100
	-1   0    0    1   
$EndComp
Wire Wire Line
	12200 8250 12200 8350
Wire Wire Line
	12200 8350 13150 8350
Connection ~ 12200 8350
Wire Wire Line
	12200 8350 12200 8450
$Comp
L Device:C C65
U 1 1 60B1876B
P 11800 8700
F 0 "C65" H 11685 8654 50  0000 R CNN
F 1 "22uF" H 11685 8745 50  0000 R CNN
F 2 "10005011 Power Management:C1210_1" H 11838 8550 50  0001 C CNN
F 3 "~" H 11800 8700 50  0001 C CNN
	1    11800 8700
	-1   0    0    1   
$EndComp
$Comp
L power:GND #PWR0251
U 1 1 60B18771
P 12200 9050
F 0 "#PWR0251" H 12200 8800 50  0001 C CNN
F 1 "GND" H 12200 8900 50  0000 C CNN
F 2 "" H 12200 9050 50  0001 C CNN
F 3 "" H 12200 9050 50  0001 C CNN
	1    12200 9050
	1    0    0    -1  
$EndComp
Wire Wire Line
	12200 9050 12200 8950
Wire Wire Line
	11800 8850 11800 8950
Wire Wire Line
	11800 8950 12200 8950
Wire Wire Line
	12200 8950 12200 8850
Connection ~ 12200 8950
Wire Wire Line
	11800 8550 11800 8450
Wire Wire Line
	11800 8450 12200 8450
Connection ~ 12200 8450
Wire Wire Line
	12200 8450 12200 8550
$Comp
L Device:R R123
U 1 1 60B18786
P 12700 8100
F 0 "R123" H 12770 8054 50  0000 L CNN
F 1 "100k" H 12770 8145 50  0000 L CNN
F 2 "10005011 Power Management:R0603_1" V 12630 8100 50  0001 C CNN
F 3 "~" H 12700 8100 50  0001 C CNN
	1    12700 8100
	1    0    0    1   
$EndComp
$Comp
L Device:C C108
U 1 1 60B1878C
P 12700 8800
F 0 "C108" H 12815 8754 50  0000 L CNN
F 1 "100nF" H 12815 8845 50  0000 L CNN
F 2 "10005011 Power Management:C0402_1" H 12738 8650 50  0001 C CNN
F 3 "~" H 12700 8800 50  0001 C CNN
F 4 "CAPACITOR,100NF,16V,+/-10%,X7R,0402" H 12700 8800 50  0001 C CNN "Description"
F 5 "10022607" H 12700 8800 50  0001 C CNN "Item Number"
F 6 "MURATA" H 12700 8800 50  0001 C CNN "Manufacturer"
F 7 "GRM155R71C104JA88J" H 12700 8800 50  0001 C CNN "Manufacturer_No"
	1    12700 8800
	1    0    0    1   
$EndComp
$Comp
L Device:R R69
U 1 1 60B18792
P 13200 7750
F 0 "R69" V 12993 7750 50  0000 C CNN
F 1 "1k" V 13084 7750 50  0000 C CNN
F 2 "10005011 Power Management:RC1206_1" V 13130 7750 50  0001 C CNN
F 3 "~" H 13200 7750 50  0001 C CNN
	1    13200 7750
	0    -1   1    0   
$EndComp
$Comp
L 10005011_Power_Management:LM4040DIM3-5.0 IC24
U 1 1 60B18798
P 13150 8800
F 0 "IC24" V 13196 8713 50  0000 R CNN
F 1 "LM4040DIM3-5.0" V 13105 8713 50  0000 R CNN
F 2 "10005011 Power Management:SOT23-1G_1" H 13150 8600 50  0001 C CIN
F 3 "http://www.ti.com/lit/ds/symlink/lm4040-n.pdf" H 13150 8800 50  0001 C CIN
F 4 "IC,VOLTAGE REFERENCE,SHUNT, 5V,SOT23" H 13150 8500 50  0001 C CNN "Description"
F 5 "10022903" H 13200 8200 50  0001 C CNN "Item Number"
F 6 "NATIONAL SEMICONDUCTOR" H 13150 8400 50  0001 C CNN "Manufacturer"
F 7 "LM4040DIM3-5.0" H 13200 8300 50  0001 C CNN "Manufacturer_No"
	1    13150 8800
	0    -1   -1   0   
$EndComp
$Comp
L 10005011_Power_Management:LT1716IS5 IC22
U 1 1 60B1879E
P 14050 8450
F 0 "IC22" H 14000 8700 50  0000 L CNN
F 1 "LT1716IS5" H 14000 8600 50  0000 L CNN
F 2 "10005011 Power Management:SOT23-5_1" H 13950 8250 50  0001 L CNN
F 3 "https://www.analog.com/media/en/technical-documentation/data-sheets/LT1716.pdf" H 14050 8650 50  0001 C CNN
F 4 "IC,RAIL TO RAIL COMPARATOR, 44V, SOT23" H 14050 8450 50  0001 C CNN "Description"
F 5 "10022902" H 14050 8450 50  0001 C CNN "Item Number"
F 6 "LINEAR TECHNOLOGY" H 14050 8450 50  0001 C CNN "Manufacturer"
F 7 "LT1716IS5#TRPBF" H 14050 8450 50  0001 C CNN "Manufacturer_No"
	1    14050 8450
	1    0    0    -1  
$EndComp
$Comp
L Device:R R122
U 1 1 60B187A4
P 13450 8050
F 0 "R122" V 13550 8050 50  0000 C CNN
F 1 "470k" V 13625 8050 50  0000 C CNN
F 2 "10005011 Power Management:R0603_1" V 13380 8050 50  0001 C CNN
F 3 "~" H 13450 8050 50  0001 C CNN
	1    13450 8050
	0    -1   -1   0   
$EndComp
$Comp
L power:GND #PWR0252
U 1 1 60B187AA
P 12700 9150
F 0 "#PWR0252" H 12700 8900 50  0001 C CNN
F 1 "GND" H 12700 9000 50  0000 C CNN
F 2 "" H 12700 9150 50  0001 C CNN
F 3 "" H 12700 9150 50  0001 C CNN
	1    12700 9150
	1    0    0    -1  
$EndComp
$Comp
L power:GND #PWR0253
U 1 1 60B187B0
P 13950 8950
F 0 "#PWR0253" H 13950 8700 50  0001 C CNN
F 1 "GND" H 13950 8800 50  0000 C CNN
F 2 "" H 13950 8950 50  0001 C CNN
F 3 "" H 13950 8950 50  0001 C CNN
	1    13950 8950
	1    0    0    -1  
$EndComp
Wire Wire Line
	12700 8950 12700 9050
Wire Wire Line
	12700 8250 12700 8550
Wire Wire Line
	13750 8550 13150 8550
Connection ~ 12700 8550
Wire Wire Line
	12700 8550 12700 8650
Wire Wire Line
	13150 8550 13150 8650
Connection ~ 13150 8550
Wire Wire Line
	13150 8550 12700 8550
Wire Wire Line
	13150 8950 13150 9050
Wire Wire Line
	13150 9050 12700 9050
Connection ~ 12700 9050
Wire Wire Line
	12700 9050 12700 9150
Wire Wire Line
	13950 8750 13950 8950
Wire Wire Line
	13150 8350 13150 8050
Wire Wire Line
	13150 8050 13300 8050
Connection ~ 13150 8350
Wire Wire Line
	13150 8350 13750 8350
Wire Wire Line
	13600 8050 14450 8050
Wire Wire Line
	14450 8050 14450 8450
Wire Wire Line
	14450 8450 14350 8450
Wire Wire Line
	14450 8450 14550 8450
$Comp
L Device:C C140
U 1 1 60B187CB
P 14200 7750
F 0 "C140" V 13948 7750 50  0000 C CNN
F 1 "100nF" V 14039 7750 50  0000 C CNN
F 2 "10005011 Power Management:C0805_1" H 14238 7600 50  0001 C CNN
F 3 "~" H 14200 7750 50  0001 C CNN
F 4 "CAPACITOR CERAMIC, 100NF, +/-10%, 50V, X7R,0805" H 14200 7750 50  0001 C CNN "Description"
F 5 "10022135" H 14200 7750 50  0001 C CNN "Item Number"
	1    14200 7750
	0    1    1    0   
$EndComp
Wire Wire Line
	13350 7750 13950 7750
Wire Wire Line
	13950 8150 13950 7750
Connection ~ 13950 7750
Wire Wire Line
	13950 7750 14050 7750
Connection ~ 14450 8450
$Comp
L power:GND #PWR0254
U 1 1 60B187D6
P 14650 7850
F 0 "#PWR0254" H 14650 7600 50  0001 C CNN
F 1 "GND" H 14650 7700 50  0000 C CNN
F 2 "" H 14650 7850 50  0001 C CNN
F 3 "" H 14650 7850 50  0001 C CNN
	1    14650 7850
	1    0    0    -1  
$EndComp
Wire Wire Line
	14650 7750 14650 7850
Wire Wire Line
	14350 7750 14650 7750
Wire Wire Line
	13050 7750 12700 7750
Wire Wire Line
	12200 7750 12200 7950
Wire Wire Line
	12700 7950 12700 7750
Connection ~ 12700 7750
Wire Wire Line
	12700 7750 12200 7750
Wire Wire Line
	15150 8450 15050 8450
$Comp
L 10005011_Power_Management:VBAT #PWR0255
U 1 1 5E953938
P 12200 7550
F 0 "#PWR0255" H 12200 7400 50  0001 C CNN
F 1 "VBAT" H 12215 7749 50  0000 C CNN
F 2 "" H 12200 7550 50  0001 C CNN
F 3 "" H 12200 7550 50  0001 C CNN
	1    12200 7550
	1    0    0    -1  
$EndComp
Wire Wire Line
	12200 7550 12200 7750
Connection ~ 12200 7750
$Comp
L 10005011_Power_Management:VDCEXT #PWR0256
U 1 1 5E95B64B
P 7750 7450
F 0 "#PWR0256" H 7750 7300 50  0001 C CNN
F 1 "VDCEXT" H 7765 7649 50  0000 C CNN
F 2 "" H 7750 7450 50  0001 C CNN
F 3 "" H 7750 7450 50  0001 C CNN
	1    7750 7450
	1    0    0    -1  
$EndComp
Wire Wire Line
	7750 7450 7750 7650
Connection ~ 7750 7650
Text GLabel 15150 8450 2    50   Output ~ 0
BAT-LIMIT-SWITCH
Text GLabel 10700 8350 2    50   Output ~ 0
DC-LIMIT-SWITCH
Text GLabel 4050 9800 0    50   Input ~ 0
~BAT-SWITCH
Text GLabel 2900 9550 2    50   Output ~ 0
I-BAT
Text GLabel 4300 9400 0    50   Input ~ 0
BAT-LIMIT-SWITCH
Text GLabel 1200 7900 0    50   Output ~ 0
MES-VBAT
Text GLabel 4100 7700 1    50   Input ~ 0
I-CHARGE
Text GLabel 5200 9750 3    50   Input ~ 0
SHUNT-DIODE-BAT
Text GLabel 12200 2600 2    50   Output ~ 0
ON-OFF
$Comp
L Device:R R107
U 1 1 5F290125
P 1800 10300
F 0 "R107" H 1870 10346 50  0000 L CNN
F 1 "66.5k" H 1870 10255 50  0000 L CNN
F 2 "10005011 Power Management:R0603_1" V 1730 10300 50  0001 C CNN
F 3 "https://www.yageo.com/upload/media/product/productsearch/datasheet/rchip/PYu-RT_1-to-0.01_RoHS_L_11.pdf" H 1800 10300 50  0001 C CNN
F 4 "Yageo" H 1800 10300 50  0001 C CNN "Mfgr"
F 5 "RT0603BRD0766K5L" H 1800 10300 50  0001 C CNN "Mfgr_PN"
F 6 "Digi-Key" H 1800 10300 50  0001 C CNN "Source"
F 7 "YAG1712CT-ND" H 1800 10300 50  0001 C CNN "Source_PN"
F 8 "0603" H 1870 10255 50  0001 L CNN "Bom_Footprint"
F 9 "RES SMD 66.5KOHM 0.1% 1/10W 0603" H 1800 10300 50  0001 C CNN "Description"
F 10 "0.1%" H 1870 10164 50  0001 L CNN "Tolerance"
F 11 "1/10W" H 1800 10300 50  0001 C CNN "Wattage"
	1    1800 10300
	1    0    0    -1  
$EndComp
Wire Wire Line
	13100 4900 13100 5000
Wire Wire Line
	13100 5000 13200 5000
Wire Wire Line
	13100 5400 13100 5250
Wire Wire Line
	13100 5250 13200 5250
Wire Wire Line
	14050 5150 14250 5150
Wire Wire Line
	14250 5150 14250 5250
Wire Wire Line
	14050 5350 14250 5350
Connection ~ 14250 5350
Wire Wire Line
	14250 5350 14250 5600
Wire Wire Line
	14050 5250 14250 5250
Connection ~ 14250 5250
Wire Wire Line
	14250 5250 14250 5350
Wire Wire Line
	14050 5000 14400 5000
$Comp
L 10005011_Power_Management:BNX002-11 FLTR?
U 1 1 5F74A76D
P 13650 5100
AR Path="/5E92767C/5F74A76D" Ref="FLTR?"  Part="1" 
AR Path="/5FEC5422/5F74A76D" Ref="FLTR2"  Part="1" 
F 0 "FLTR2" H 13625 5473 50  0000 C CNN
F 1 "BNX002-1" H 13625 5382 50  0000 C CNN
F 2 "10005011 Power Management:BNX002_1" H 13540 5120 50  0001 C CNN
F 3 "https://www.murata.com/en-us/api/pdfdownloadapi?cate=luNoiseSupprFilteBlockType&partno=BNX002-11" H 13540 5120 50  0001 C CNN
F 4 "10022532" H 13540 5120 50  0001 C CNN "Item Number"
F 5 "Murata" H 13540 5120 50  0001 C CNN "Manufacturer"
F 6 "BNX002-11" H 13650 5100 50  0001 C CNN "MPN"
F 7 "BNX002-11" H 13650 5100 50  0001 C CNN "Manufacturer_No"
F 8 "FILTER CC, 1MHZ-1GHZ, 10A, 50V" H 13650 5100 50  0001 C CNN "Description"
	1    13650 5100
	1    0    0    -1  
$EndComp
$Comp
L power:GND #PWR0280
U 1 1 5E9F8A42
P 11600 5900
F 0 "#PWR0280" H 11600 5650 50  0001 C CNN
F 1 "GND" H 11605 5727 50  0000 C CNN
F 2 "" H 11600 5900 50  0001 C CNN
F 3 "" H 11600 5900 50  0001 C CNN
	1    11600 5900
	1    0    0    -1  
$EndComp
Wire Wire Line
	11600 5900 11600 5800
Wire Wire Line
	11600 5500 11500 5500
Wire Wire Line
	11500 5600 11600 5600
Connection ~ 11600 5600
Wire Wire Line
	11600 5600 11600 5500
Wire Wire Line
	11500 5700 11600 5700
Connection ~ 11600 5700
Wire Wire Line
	11600 5700 11600 5600
Wire Wire Line
	11500 5800 11600 5800
Connection ~ 11600 5800
Wire Wire Line
	11600 5800 11600 5700
$Comp
L power:GND #PWR0281
U 1 1 5EB5AE56
P 12050 5900
F 0 "#PWR0281" H 12050 5650 50  0001 C CNN
F 1 "GND" H 12055 5727 50  0000 C CNN
F 2 "" H 12050 5900 50  0001 C CNN
F 3 "" H 12050 5900 50  0001 C CNN
	1    12050 5900
	1    0    0    -1  
$EndComp
Wire Wire Line
	12050 5900 12050 5800
Wire Wire Line
	12050 5500 12050 4900
Connection ~ 12050 4900
Wire Wire Line
	12050 4900 12500 4900
$Comp
L Device:Varistor ML4
U 1 1 5EBA3FA8
P 12050 5650
F 0 "ML4" H 11930 5650 50  0000 R CNN
F 1 "Varistor" H 12153 5605 50  0001 L CNN
F 2 "10005011 Power Management:RC1206_1" V 11980 5650 50  0001 C CNN
F 3 "~" H 12050 5650 50  0001 C CNN
F 4 "VARISTOR, CMS PROTECTION, 30VRMS, 38 VDC, 1206," H 12050 5650 50  0001 C CNN "Description"
F 5 "10022927" H 12050 5650 50  0001 C CNN "Item Number"
F 6 "EPCOS" H 12050 5650 50  0001 C CNN "Manufacturer"
F 7 "B72520T0300K062" H 12050 5650 50  0001 C CNN "Manufacturer_No"
	1    12050 5650
	1    0    0    1   
$EndComp
Wire Wire Line
	800  9050 800  9100
$Comp
L 10005011_Power_Management:SUD50P06-15L-E3 T14
U 1 1 5EA66B8C
P 5200 8000
F 0 "T14" V 5542 8000 50  0000 C CNN
F 1 "SUD50P06-15L" V 5451 8000 50  0000 C CNN
F 2 "10005011 Power Management:DPAK-GDS_1" H 5495 7925 50  0001 L CIN
F 3 "http://www.vishay.com/docs/72250/sud50p06.pdf" H 5200 8000 50  0001 C CNN
F 4 "DPAK" V 5542 8000 50  0001 C CNN "BOM_Footprint"
F 5 "MOSFET P-CH 60V 50A TO252" H 6075 7925 50  0001 C CNN "Description"
F 6 "10022560" V 5451 8000 50  0001 C CNN "Item Number"
F 7 "Vishay Siliconix" H 5800 7925 50  0001 C CNN "Mfgr"
F 8 "SUD50P06-15L-E3" H 5875 7925 50  0001 C CNN "Mfgr_PN"
F 9 "Digi-Key" H 5650 7925 50  0001 C CNN "Source"
F 10 "SUD50P06-15L-E3CT-ND" H 5975 7925 50  0001 C CNN "Source_PN"
	1    5200 8000
	0    -1   -1   0   
$EndComp
Wire Wire Line
	7450 700  7450 1400
Connection ~ 7250 1200
Wire Wire Line
	7250 1400 7250 1200
Wire Wire Line
	7350 1950 7350 1900
$Comp
L 10005011_Power_Management:BAT54C D2
U 1 1 5F1F8D7E
P 7350 1700
F 0 "D2" V 7209 1888 50  0000 L CNN
F 1 "BAT54C" V 7300 1888 50  0000 L CNN
F 2 "10005011 Power Management:SOT23-1G_1" H 7075 1225 50  0001 L CNN
F 3 "https://media.digikey.com/pdf/Data%20Sheets/ON%20Semiconductor%20PDFs/BAT54(A,C,S).pdf" H 7270 1800 50  0001 C CNN
F 4 "DIODE ARRAY SCHOTTKY 30V SOT23-3" H 7675 1525 60  0001 C CNN "Description"
F 5 "ON Semiconductor" H 7675 1525 60  0001 C CNN "Mfgr"
F 6 "BAT54C" H 7675 1525 60  0001 C CNN "Mfgr_PN"
F 7 "Digi-Key" H 7525 1525 60  0001 C CNN "Source"
F 8 "BAT54CFSCT-ND" H 7500 1525 60  0001 C CNN "Source_PN"
F 9 "10022653" H 7350 1700 50  0001 C CNN "Item Number"
	1    7350 1700
	0    1    1    0   
$EndComp
$Comp
L 10005011_Power_Management:1N5819 D19
U 1 1 5F1F1611
P 5800 4150
F 0 "D19" H 5800 4274 50  0000 C CNN
F 1 "1N5819" H 5800 4365 50  0000 C CNN
F 2 "10005011 Power Management:SOD123-AK_1" H 5750 3850 50  0001 C CNN
F 3 "https://www.diodes.com/assets/Datasheets/ds30217.pdf" H 5800 4150 50  0001 C CNN
F 4 "Diodes Incorporated" H 5800 3450 50  0001 C CNN "Mfgr"
F 5 "1N5819HW-7-F" H 5850 3650 50  0001 C CNN "Mfgr_PN"
F 6 "Digi-Key" H 5800 3550 50  0001 C CNN "Source"
F 7 "1N5819HW-FDICT-ND" H 5750 3750 50  0001 C CNN "Source_PN"
F 8 "DIODE SCHOTTKY 40V 1A SOD123" H 5750 3950 50  0001 C CNN "Description"
F 9 "10022650" H 5800 4150 50  0001 C CNN "Item Number"
	1    5800 4150
	-1   0    0    1   
$EndComp
Text GLabel 1150 1200 0    50   Output ~ 0
MES-VACDC
Text GLabel 7550 2450 2    50   Output ~ 0
START-5V
Text GLabel 6300 2400 0    50   Input ~ 0
ON-OFF
Text GLabel 1350 2700 0    50   Input ~ 0
~AC-SWITCH
Text GLabel 3250 3100 0    50   Input ~ 0
SHUNT-DIODE-AC
Text GLabel 1000 4600 0    50   Output ~ 0
MES-VDC
Text GLabel 7450 4150 2    50   Output ~ 0
LED-DC-PRESENCE
Text GLabel 3550 6300 0    50   Input ~ 0
SHUNT-DIODE-DC
Text GLabel 1400 5800 0    50   Input ~ 0
DC-LIMIT-SWITCH
Text GLabel 1200 6200 0    50   Input ~ 0
~DC-SWITCH
$Comp
L 10005011_Power_Management:SZ1SMB D3
U 1 1 5EBABD18
P 5450 1650
F 0 "D3" V 5404 1729 50  0000 L CNN
F 1 "1SMB36" V 5495 1729 50  0000 L CNN
F 2 "10005011 Power Management:SMB-AIROX_1" H 5450 1650 50  0001 C CNN
F 3 "https://www.littelfuse.com/~/media/electronics/datasheets/tvs_diodes/littelfuse_tvs_diode_sz1smb_datasheet.pdf.pdf" H 5450 1650 50  0001 C CNN
F 4 "Littelfuse Inc." H 5450 1650 50  0001 C CNN "Mfgr"
F 5 "SZ1SMB36AT3G" H 5450 1650 50  0001 C CNN "Mfgr_PN"
F 6 "Digi-Key" H 5450 1650 50  0001 C CNN "Source"
F 7 "F11561CT-ND" H 5450 1650 50  0001 C CNN "Source_PN"
F 8 "TVS DIODE 36V 58.1V SMB" H 5450 1650 50  0001 C CNN "Description"
F 9 "10022654" H 5450 1650 50  0001 C CNN "Item Number"
	1    5450 1650
	0    1    1    0   
$EndComp
$Comp
L 10005011_Power_Management:PGND #PWR0240
U 1 1 5EB8626D
P 6750 4750
F 0 "#PWR0240" H 6750 4500 50  0001 C CNN
F 1 "PGND" H 6755 4577 50  0000 C CNN
F 2 "" H 6750 4750 50  0001 C CNN
F 3 "" H 6750 4750 50  0001 C CNN
	1    6750 4750
	1    0    0    -1  
$EndComp
$Comp
L 10005011_Power_Management:0VANA #PWR0238
U 1 1 5EB48EBE
P 1400 5300
F 0 "#PWR0238" H 1400 5050 50  0001 C CNN
F 1 "0VANA" H 1405 5127 50  0000 C CNN
F 2 "" H 1400 5300 50  0001 C CNN
F 3 "" H 1400 5300 50  0001 C CNN
	1    1400 5300
	1    0    0    -1  
$EndComp
$Comp
L 10005011_Power_Management:0VANA #PWR0237
U 1 1 5EB33539
P 1550 1900
F 0 "#PWR0237" H 1550 1650 50  0001 C CNN
F 1 "0VANA" H 1555 1727 50  0000 C CNN
F 2 "" H 1550 1900 50  0001 C CNN
F 3 "" H 1550 1900 50  0001 C CNN
	1    1550 1900
	1    0    0    -1  
$EndComp
$Comp
L 10005011_Power_Management:VALIM #PWR0236
U 1 1 5EB2F991
P 7250 1100
F 0 "#PWR0236" H 7250 950 50  0001 C CNN
F 1 "VALIM" H 7265 1299 50  0000 C CNN
F 2 "" H 7250 1100 50  0001 C CNN
F 3 "" H 7250 1100 50  0001 C CNN
	1    7250 1100
	1    0    0    -1  
$EndComp
$Comp
L 10005011_Power_Management:VALIM_PERM #PWR0235
U 1 1 5EB2EEAF
P 5900 1100
F 0 "#PWR0235" H 5900 950 50  0001 C CNN
F 1 "VALIM_PERM" H 5915 1299 50  0000 C CNN
F 2 "" H 5900 1100 50  0001 C CNN
F 3 "" H 5900 1100 50  0001 C CNN
	1    5900 1100
	1    0    0    -1  
$EndComp
$Comp
L 10005011_Power_Management:VACDC #PWR0234
U 1 1 5EB2D362
P 2350 1100
F 0 "#PWR0234" H 2350 950 50  0001 C CNN
F 1 "VACDC" H 2365 1299 50  0000 C CNN
F 2 "" H 2350 1100 50  0001 C CNN
F 3 "" H 2350 1100 50  0001 C CNN
	1    2350 1100
	1    0    0    -1  
$EndComp
$Comp
L 10005011_Power_Management:VDCEXT #PWR0233
U 1 1 5EB267B8
P 2200 4500
F 0 "#PWR0233" H 2200 4350 50  0001 C CNN
F 1 "VDCEXT" H 2215 4699 50  0000 C CNN
F 2 "" H 2200 4500 50  0001 C CNN
F 3 "" H 2200 4500 50  0001 C CNN
	1    2200 4500
	1    0    0    -1  
$EndComp
Connection ~ 6350 4150
Wire Wire Line
	6350 4150 5950 4150
Connection ~ 7350 4150
Wire Wire Line
	7450 4150 7350 4150
Connection ~ 5150 4600
Wire Wire Line
	5150 6150 5150 4600
Wire Wire Line
	6500 6150 5150 6150
Connection ~ 2000 6700
Wire Wire Line
	7350 2450 7350 2550
Connection ~ 7350 2450
Wire Wire Line
	7550 2450 7350 2450
Wire Wire Line
	7350 2950 7350 2850
$Comp
L power:GND #PWR0231
U 1 1 5EA66E29
P 7350 2950
F 0 "#PWR0231" H 7350 2700 50  0001 C CNN
F 1 "GND" H 7350 2800 50  0000 C CNN
F 2 "" H 7350 2950 50  0001 C CNN
F 3 "" H 7350 2950 50  0001 C CNN
	1    7350 2950
	1    0    0    -1  
$EndComp
Wire Wire Line
	7350 2250 7350 2450
$Comp
L Device:R R26
U 1 1 5EA66E1E
P 7350 2700
F 0 "R26" H 7280 2654 50  0000 R CNN
F 1 "4.7k" H 7280 2745 50  0000 R CNN
F 2 "10005011 Power Management:R0603_1" V 7280 2700 50  0001 C CNN
F 3 "~" H 7350 2700 50  0001 C CNN
	1    7350 2700
	-1   0    0    1   
$EndComp
$Comp
L Device:R R18
U 1 1 5EA66E18
P 7350 2100
F 0 "R18" H 7280 2054 50  0000 R CNN
F 1 "27k" H 7280 2145 50  0000 R CNN
F 2 "10005011 Power Management:R0603_1" V 7280 2100 50  0001 C CNN
F 3 "~" H 7350 2100 50  0001 C CNN
	1    7350 2100
	-1   0    0    1   
$EndComp
Wire Wire Line
	3100 1200 3200 1200
Connection ~ 3100 1200
Wire Wire Line
	3100 700  3100 1200
Wire Wire Line
	7450 700  3100 700 
Wire Wire Line
	7250 1200 7250 1100
Wire Wire Line
	6950 1200 7250 1200
Wire Wire Line
	6750 2400 6750 2300
Wire Wire Line
	6300 2400 6750 2400
Wire Wire Line
	5900 1200 6100 1200
Connection ~ 5900 1200
Wire Wire Line
	5900 1100 5900 1200
Connection ~ 6750 1900
Wire Wire Line
	6750 1900 6750 1500
Wire Wire Line
	6750 1900 6750 2000
Wire Wire Line
	6100 1900 6750 1900
Wire Wire Line
	6100 1600 6100 1900
Wire Wire Line
	6100 1200 6550 1200
Connection ~ 6100 1200
Wire Wire Line
	6100 1200 6100 1300
Connection ~ 5450 1200
Wire Wire Line
	5450 1200 5900 1200
$Comp
L 10005011_Power_Management:SUD50P06-15L-E3 T5
U 1 1 5EA66DF0
P 6750 1300
F 0 "T5" V 7092 1300 50  0000 C CNN
F 1 "SUD50P06-15L" V 7001 1300 50  0000 C CNN
F 2 "10005011 Power Management:DPAK-GDS_1" H 6945 1225 50  0001 L CIN
F 3 "https://www.vishay.com/docs/68940/sud50p06.pdf" H 6750 1300 50  0001 C CNN
	1    6750 1300
	0    -1   -1   0   
$EndComp
$Comp
L Device:R R29
U 1 1 5EA66DEA
P 6750 2150
F 0 "R29" H 6680 2104 50  0000 R CNN
F 1 "10k" H 6680 2195 50  0000 R CNN
F 2 "10005011 Power Management:R0603_1" V 6680 2150 50  0001 C CNN
F 3 "~" H 6750 2150 50  0001 C CNN
	1    6750 2150
	-1   0    0    1   
$EndComp
$Comp
L Device:R R23
U 1 1 5EA66DE4
P 6100 1450
F 0 "R23" H 6030 1404 50  0000 R CNN
F 1 "10k" H 6030 1495 50  0000 R CNN
F 2 "10005011 Power Management:R0603_1" V 6030 1450 50  0001 C CNN
F 3 "~" H 6100 1450 50  0001 C CNN
	1    6100 1450
	-1   0    0    1   
$EndComp
Wire Wire Line
	5450 1900 5450 1800
$Comp
L power:GND #PWR0230
U 1 1 5EA66DDD
P 5450 1900
F 0 "#PWR0230" H 5450 1650 50  0001 C CNN
F 1 "GND" H 5450 1750 50  0000 C CNN
F 2 "" H 5450 1900 50  0001 C CNN
F 3 "" H 5450 1900 50  0001 C CNN
	1    5450 1900
	1    0    0    -1  
$EndComp
Connection ~ 5150 1200
Wire Wire Line
	5450 1200 5450 1500
Wire Wire Line
	5150 1200 5450 1200
Wire Wire Line
	7350 4150 7350 4250
Wire Wire Line
	7150 4150 7350 4150
Wire Wire Line
	6750 4650 6850 4650
Connection ~ 6750 4650
Wire Wire Line
	6750 4650 6750 4750
Wire Wire Line
	6850 4650 7350 4650
Connection ~ 6850 4650
Wire Wire Line
	6850 4450 6850 4650
Wire Wire Line
	7350 4650 7350 4550
Wire Wire Line
	6350 4650 6750 4650
Wire Wire Line
	6350 4550 6350 4650
Wire Wire Line
	6350 4150 6550 4150
Wire Wire Line
	6350 4150 6350 4250
Wire Wire Line
	3850 4150 5650 4150
$Comp
L Device:C C133
U 1 1 5EA66DAD
P 7350 4400
F 0 "C133" H 7465 4354 50  0000 L CNN
F 1 "100nF" H 7465 4445 50  0000 L CNN
F 2 "10005011 Power Management:C0805_1" H 7388 4250 50  0001 C CNN
F 3 "~" H 7350 4400 50  0001 C CNN
F 4 "CAPACITOR CERAMIC, 100NF, +/-10%, 50V, X7R,0805" H 7350 4400 50  0001 C CNN "Description"
F 5 "10022135" H 7350 4400 50  0001 C CNN "Item Number"
	1    7350 4400
	1    0    0    1   
$EndComp
$Comp
L Device:C C132
U 1 1 5EA66DA7
P 6350 4400
F 0 "C132" H 6236 4354 50  0000 R CNN
F 1 "100nF" H 6236 4445 50  0000 R CNN
F 2 "10005011 Power Management:C0805_1" H 6388 4250 50  0001 C CNN
F 3 "~" H 6350 4400 50  0001 C CNN
F 4 "CAPACITOR CERAMIC, 100NF, +/-10%, 50V, X7R,0805" H 6350 4400 50  0001 C CNN "Description"
F 5 "10022135" H 6350 4400 50  0001 C CNN "Item Number"
	1    6350 4400
	1    0    0    1   
$EndComp
$Comp
L Regulator_Linear:L7805 IC28
U 1 1 5EA66DA1
P 6850 4150
F 0 "IC28" H 6850 4392 50  0000 C CNN
F 1 "L78M05CDT" H 6850 4301 50  0000 C CNN
F 2 "10005011 Power Management:DPAK_1" H 6875 4000 50  0001 L CIN
F 3 "http://www.st.com/content/ccc/resource/technical/document/datasheet/41/4f/b3/b0/12/d4/47/88/CD00000444.pdf/files/CD00000444.pdf/jcr:content/translations/en.CD00000444.pdf" H 6850 4100 50  0001 C CNN
	1    6850 4150
	1    0    0    -1  
$EndComp
Wire Wire Line
	3850 4600 4000 4600
Connection ~ 3850 4600
Wire Wire Line
	3850 4600 3850 4150
Wire Wire Line
	2150 2200 2150 2500
Connection ~ 4450 4600
Wire Wire Line
	4450 4600 5150 4600
Connection ~ 4450 1200
Wire Wire Line
	6500 6150 6500 7900
Wire Wire Line
	5150 1200 5150 4600
Wire Wire Line
	4450 1200 5150 1200
Connection ~ 3750 3600
Wire Wire Line
	2350 1200 2650 1200
Connection ~ 2350 1200
Wire Wire Line
	2350 1100 2350 1200
Connection ~ 2150 1200
Wire Wire Line
	1950 1200 2150 1200
Wire Wire Line
	1250 1200 1550 1200
Connection ~ 1250 1200
Wire Wire Line
	1250 1200 1250 1400
Wire Wire Line
	1550 1200 1650 1200
Connection ~ 1550 1200
Wire Wire Line
	1550 1200 1550 1400
Wire Wire Line
	1150 1200 1250 1200
Connection ~ 1550 1800
Wire Wire Line
	1550 1900 1550 1800
Wire Wire Line
	1550 1800 1550 1700
Wire Wire Line
	1250 1800 1550 1800
Wire Wire Line
	1250 1700 1250 1800
$Comp
L Device:C C18
U 1 1 5EA66D69
P 1250 1550
F 0 "C18" H 1136 1504 50  0000 R CNN
F 1 "10nF" H 1136 1595 50  0000 R CNN
F 2 "10005011 Power Management:C0603_1" H 1288 1400 50  0001 C CNN
F 3 "~" H 1250 1550 50  0001 C CNN
	1    1250 1550
	1    0    0    1   
$EndComp
$Comp
L Device:R R22
U 1 1 5EA66D63
P 1550 1550
F 0 "R22" H 1620 1504 50  0000 L CNN
F 1 "10k" H 1620 1595 50  0000 L CNN
F 2 "10005011 Power Management:R0603_1" V 1480 1550 50  0001 C CNN
F 3 "~" H 1550 1550 50  0001 C CNN
	1    1550 1550
	1    0    0    1   
$EndComp
$Comp
L Device:R R19
U 1 1 5EA66D5C
P 1800 1200
F 0 "R19" V 1593 1200 50  0000 C CNN
F 1 "110k" V 1684 1200 50  0000 C CNN
F 2 "10005011 Power Management:R0603_1" V 1730 1200 50  0001 C CNN
F 3 "~" H 1800 1200 50  0001 C CNN
	1    1800 1200
	0    1    1    0   
$EndComp
Wire Wire Line
	2150 1200 2350 1200
Wire Wire Line
	4200 2100 4200 2900
Wire Wire Line
	3750 3600 4200 3600
Wire Wire Line
	3750 3100 3900 3100
Connection ~ 3750 3100
Wire Wire Line
	3750 3700 3750 3600
Wire Wire Line
	3750 3500 3750 3600
Wire Wire Line
	3750 3100 3750 3200
Wire Wire Line
	4200 3300 4200 3600
$Comp
L Device:R R32
U 1 1 5EA66D4C
P 3750 3350
F 0 "R32" H 3681 3304 50  0000 R CNN
F 1 "100k" H 3681 3395 50  0000 R CNN
F 2 "10005011 Power Management:R0603_1" V 3680 3350 50  0001 C CNN
F 3 "~" H 3750 3350 50  0001 C CNN
	1    3750 3350
	1    0    0    1   
$EndComp
$Comp
L power:GND #PWR0229
U 1 1 5EA66D46
P 3750 3700
F 0 "#PWR0229" H 3750 3450 50  0001 C CNN
F 1 "GND" H 3750 3550 50  0000 C CNN
F 2 "" H 3750 3700 50  0001 C CNN
F 3 "" H 3750 3700 50  0001 C CNN
	1    3750 3700
	1    0    0    -1  
$EndComp
$Comp
L 10005011_Power_Management:2N7002 T8
U 1 1 5EA66D40
P 4100 3100
F 0 "T8" H 4300 3175 50  0000 L CNN
F 1 "2N7002" H 4300 3100 50  0000 L CNN
F 2 "10005011 Power Management:SOT23-GSD_1" H 4300 3025 50  0001 L CIN
F 3 "https://www.fairchildsemi.com/datasheets/2N/2N7002.pdf" H 4100 3100 50  0001 L CNN
	1    4100 3100
	1    0    0    -1  
$EndComp
Wire Wire Line
	4200 1700 4200 1800
Connection ~ 4200 1700
Wire Wire Line
	4450 1700 4200 1700
Wire Wire Line
	4450 1600 4450 1700
Wire Wire Line
	4200 1500 4200 1700
Wire Wire Line
	4450 1200 4450 1300
Wire Wire Line
	4400 1200 4450 1200
$Comp
L Device:R R27
U 1 1 5EA66D31
P 4200 1950
F 0 "R27" H 4130 1904 50  0000 R CNN
F 1 "10k" H 4130 1995 50  0000 R CNN
F 2 "10005011 Power Management:R0603_1" V 4130 1950 50  0001 C CNN
F 3 "~" H 4200 1950 50  0001 C CNN
	1    4200 1950
	-1   0    0    1   
$EndComp
$Comp
L Device:R R25
U 1 1 5EA66D2B
P 4450 1450
F 0 "R25" H 4520 1404 50  0000 L CNN
F 1 "10k" H 4520 1495 50  0000 L CNN
F 2 "10005011 Power Management:R0603_1" V 4380 1450 50  0001 C CNN
F 3 "~" H 4450 1450 50  0001 C CNN
	1    4450 1450
	1    0    0    1   
$EndComp
Wire Wire Line
	3700 1200 4000 1200
Wire Wire Line
	3500 2000 3500 2100
Connection ~ 3200 2000
Wire Wire Line
	3200 1700 3200 2000
Wire Wire Line
	3200 1200 3300 1200
Connection ~ 3200 1200
Wire Wire Line
	3200 1200 3200 1400
Wire Wire Line
	2150 1700 2150 1900
Connection ~ 2150 1700
Wire Wire Line
	2150 1700 2350 1700
Wire Wire Line
	3500 2000 3500 1500
Wire Wire Line
	2650 2000 3200 2000
Wire Wire Line
	2650 1900 2650 2000
Wire Wire Line
	3500 2500 3500 2400
$Comp
L power:GND #PWR0228
U 1 1 5EA66D15
P 3500 2500
F 0 "#PWR0228" H 3500 2250 50  0001 C CNN
F 1 "GND" H 3500 2350 50  0000 C CNN
F 2 "" H 3500 2500 50  0001 C CNN
F 3 "" H 3500 2500 50  0001 C CNN
	1    3500 2500
	1    0    0    -1  
$EndComp
$Comp
L Device:R R30
U 1 1 5EA66D0F
P 3500 2250
F 0 "R30" H 3570 2296 50  0000 L CNN
F 1 "10k" H 3570 2205 50  0000 L CNN
F 2 "10005011 Power Management:R0603_1" V 3430 2250 50  0001 C CNN
F 3 "~" H 3500 2250 50  0001 C CNN
	1    3500 2250
	1    0    0    -1  
$EndComp
Wire Wire Line
	2650 1200 3100 1200
Connection ~ 2650 1200
Wire Wire Line
	2650 1200 2650 1500
$Comp
L Device:R R24
U 1 1 5EA66D06
P 3200 1550
F 0 "R24" H 3131 1596 50  0000 R CNN
F 1 "10k" H 3131 1505 50  0000 R CNN
F 2 "10005011 Power Management:R0603_1" V 3130 1550 50  0001 C CNN
F 3 "~" H 3200 1550 50  0001 C CNN
	1    3200 1550
	1    0    0    -1  
$EndComp
Wire Wire Line
	2150 1300 2150 1200
$Comp
L 10005011_Power_Management:IRLML5103TRPBF T6
U 1 1 5EA66CFF
P 2550 1700
F 0 "T6" H 2754 1654 50  0000 L CNN
F 1 "IRLML5103" H 2754 1745 50  0000 L CNN
F 2 "10005011 Power Management:SOT23-GSD_1" H 2750 1800 50  0001 C CNN
F 3 "~" H 2550 1700 50  0001 C CNN
	1    2550 1700
	1    0    0    1   
$EndComp
$Comp
L 10005011_Power_Management:SUD50P06-15L-E3 T3
U 1 1 5EA66CF9
P 3500 1300
F 0 "T3" V 3842 1300 50  0000 C CNN
F 1 "SUD50P06-15L" V 3751 1300 50  0000 C CNN
F 2 "10005011 Power Management:DPAK-GDS_1" H 3695 1225 50  0001 L CIN
F 3 "https://www.vishay.com/docs/68940/sud50p06.pdf" H 3500 1300 50  0001 C CNN
	1    3500 1300
	0    -1   -1   0   
$EndComp
$Comp
L 10005011_Power_Management:SUD50P06-15L-E3 T4
U 1 1 5EA66CF3
P 4200 1300
F 0 "T4" V 4542 1300 50  0000 C CNN
F 1 "SUD50P06-15L" V 4451 1300 50  0000 C CNN
F 2 "10005011 Power Management:DPAK-GDS_1" H 4395 1225 50  0001 L CIN
F 3 "https://www.vishay.com/docs/68940/sud50p06.pdf" H 4200 1300 50  0001 C CNN
	1    4200 1300
	0    1    -1   0   
$EndComp
Wire Wire Line
	1750 3200 2150 3200
Wire Wire Line
	1750 2700 1850 2700
Connection ~ 1750 2700
Connection ~ 2150 3200
Wire Wire Line
	2150 3300 2150 3200
Wire Wire Line
	1750 3100 1750 3200
Wire Wire Line
	1350 2700 1750 2700
Wire Wire Line
	1750 2700 1750 2800
Wire Wire Line
	2150 2900 2150 3200
Wire Wire Line
	2150 1600 2150 1700
$Comp
L Device:R R21
U 1 1 5EA66CE3
P 2150 1450
F 0 "R21" H 2219 1404 50  0000 L CNN
F 1 "10k" H 2219 1495 50  0000 L CNN
F 2 "10005011 Power Management:R0603_1" V 2080 1450 50  0001 C CNN
F 3 "~" H 2150 1450 50  0001 C CNN
	1    2150 1450
	-1   0    0    1   
$EndComp
$Comp
L Device:R R28
U 1 1 5EA66CDD
P 2150 2050
F 0 "R28" H 2081 2004 50  0000 R CNN
F 1 "10k" H 2081 2095 50  0000 R CNN
F 2 "10005011 Power Management:R0603_1" V 2080 2050 50  0001 C CNN
F 3 "~" H 2150 2050 50  0001 C CNN
	1    2150 2050
	1    0    0    1   
$EndComp
$Comp
L Device:R R31
U 1 1 5EA66CD6
P 1750 2950
F 0 "R31" H 1820 2996 50  0000 L CNN
F 1 "100k" H 1820 2905 50  0000 L CNN
F 2 "10005011 Power Management:R0603_1" V 1680 2950 50  0001 C CNN
F 3 "~" H 1750 2950 50  0001 C CNN
	1    1750 2950
	1    0    0    -1  
$EndComp
$Comp
L power:GND #PWR0227
U 1 1 5EA66CD0
P 2150 3300
F 0 "#PWR0227" H 2150 3050 50  0001 C CNN
F 1 "GND" H 2150 3150 50  0000 C CNN
F 2 "" H 2150 3300 50  0001 C CNN
F 3 "" H 2150 3300 50  0001 C CNN
	1    2150 3300
	1    0    0    -1  
$EndComp
$Comp
L 10005011_Power_Management:2N7002 T7
U 1 1 5EA66CCA
P 2050 2700
F 0 "T7" H 2250 2775 50  0000 L CNN
F 1 "2N7002" H 2250 2700 50  0000 L CNN
F 2 "10005011 Power Management:SOT23-GSD_1" H 2250 2625 50  0001 L CIN
F 3 "https://www.fairchildsemi.com/datasheets/2N/2N7002.pdf" H 2050 2700 50  0001 L CNN
	1    2050 2700
	1    0    0    -1  
$EndComp
Wire Wire Line
	2200 4600 2600 4600
Connection ~ 2200 4600
Wire Wire Line
	2200 4500 2200 4600
Wire Wire Line
	2000 5600 2000 5800
Connection ~ 2000 4600
Wire Wire Line
	1800 4600 2000 4600
Wire Wire Line
	1100 4600 1400 4600
Connection ~ 1100 4600
Wire Wire Line
	1100 4600 1100 4800
Wire Wire Line
	1400 4600 1500 4600
Connection ~ 1400 4600
Wire Wire Line
	1400 4600 1400 4800
Wire Wire Line
	1000 4600 1100 4600
Connection ~ 1400 5200
Wire Wire Line
	1400 5300 1400 5200
Wire Wire Line
	1400 5200 1400 5100
Wire Wire Line
	1100 5200 1400 5200
Wire Wire Line
	1100 5100 1100 5200
$Comp
L Device:C C19
U 1 1 5EA66C9F
P 1100 4950
F 0 "C19" H 986 4904 50  0000 R CNN
F 1 "10nF" H 986 4995 50  0000 R CNN
F 2 "10005011 Power Management:C0603_1" H 1138 4800 50  0001 C CNN
F 3 "~" H 1100 4950 50  0001 C CNN
	1    1100 4950
	1    0    0    1   
$EndComp
$Comp
L Device:R R35
U 1 1 5EA66C99
P 1400 4950
F 0 "R35" H 1470 4904 50  0000 L CNN
F 1 "10k" H 1470 4995 50  0000 L CNN
F 2 "10005011 Power Management:R0603_1" V 1330 4950 50  0001 C CNN
F 3 "~" H 1400 4950 50  0001 C CNN
	1    1400 4950
	1    0    0    1   
$EndComp
$Comp
L Device:R R33
U 1 1 5EA66C92
P 1650 4600
F 0 "R33" V 1443 4600 50  0000 C CNN
F 1 "110k" V 1534 4600 50  0000 C CNN
F 2 "10005011 Power Management:R0603_1" V 1580 4600 50  0001 C CNN
F 3 "~" H 1650 4600 50  0001 C CNN
	1    1650 4600
	0    1    1    0   
$EndComp
Wire Wire Line
	2000 4600 2200 4600
Wire Wire Line
	3550 6300 3700 6300
Wire Wire Line
	4200 5500 4200 6100
Wire Wire Line
	3700 6800 4200 6800
Wire Wire Line
	3700 6300 3900 6300
Connection ~ 3700 6300
Connection ~ 4200 6800
Wire Wire Line
	4200 6900 4200 6800
Wire Wire Line
	3700 6700 3700 6800
Wire Wire Line
	3700 6300 3700 6400
Wire Wire Line
	4200 6500 4200 6800
$Comp
L Device:R R43
U 1 1 5EA66C81
P 3700 6550
F 0 "R43" H 3769 6504 50  0000 L CNN
F 1 "100k" H 3769 6595 50  0000 L CNN
F 2 "10005011 Power Management:R0603_1" V 3630 6550 50  0001 C CNN
F 3 "~" H 3700 6550 50  0001 C CNN
	1    3700 6550
	-1   0    0    1   
$EndComp
$Comp
L power:GND #PWR0226
U 1 1 5EA66C7B
P 4200 6900
F 0 "#PWR0226" H 4200 6650 50  0001 C CNN
F 1 "GND" H 4200 6750 50  0000 C CNN
F 2 "" H 4200 6900 50  0001 C CNN
F 3 "" H 4200 6900 50  0001 C CNN
	1    4200 6900
	1    0    0    -1  
$EndComp
$Comp
L 10005011_Power_Management:2N7002 T13
U 1 1 5EA66C75
P 4100 6300
F 0 "T13" H 4300 6375 50  0000 L CNN
F 1 "2N7002" H 4300 6300 50  0000 L CNN
F 2 "10005011 Power Management:SOT23-GSD_1" H 4300 6225 50  0001 L CIN
F 3 "https://www.fairchildsemi.com/datasheets/2N/2N7002.pdf" H 4100 6300 50  0001 L CNN
	1    4100 6300
	1    0    0    -1  
$EndComp
Wire Wire Line
	4200 5100 4200 5200
Connection ~ 4200 5100
Wire Wire Line
	4450 5100 4200 5100
Wire Wire Line
	4450 5000 4450 5100
Wire Wire Line
	4200 4900 4200 5100
Wire Wire Line
	4450 4600 4450 4700
Wire Wire Line
	4400 4600 4450 4600
$Comp
L Device:R R38
U 1 1 5EA66C66
P 4200 5350
F 0 "R38" H 4130 5304 50  0000 R CNN
F 1 "10k" H 4130 5395 50  0000 R CNN
F 2 "10005011 Power Management:R0603_1" V 4130 5350 50  0001 C CNN
F 3 "~" H 4200 5350 50  0001 C CNN
	1    4200 5350
	-1   0    0    1   
$EndComp
$Comp
L Device:R R37
U 1 1 5EA66C60
P 4450 4850
F 0 "R37" H 4520 4804 50  0000 L CNN
F 1 "10k" H 4520 4895 50  0000 L CNN
F 2 "10005011 Power Management:R0603_1" V 4380 4850 50  0001 C CNN
F 3 "~" H 4450 4850 50  0001 C CNN
	1    4450 4850
	1    0    0    1   
$EndComp
Wire Wire Line
	3700 4600 3850 4600
Wire Wire Line
	3500 5400 3500 5500
Connection ~ 3150 5400
Wire Wire Line
	3150 5100 3150 5400
Wire Wire Line
	3150 4600 3300 4600
Connection ~ 3150 4600
Wire Wire Line
	3150 4600 3150 4800
Wire Wire Line
	2000 5100 2000 5300
Connection ~ 2000 5100
Wire Wire Line
	2000 5100 2300 5100
Wire Wire Line
	3500 5400 3500 4900
Wire Wire Line
	2600 5400 3150 5400
Wire Wire Line
	2600 5300 2600 5400
Wire Wire Line
	3500 5900 3500 5800
$Comp
L power:GND #PWR0225
U 1 1 5EA66C4A
P 3500 5900
F 0 "#PWR0225" H 3500 5650 50  0001 C CNN
F 1 "GND" H 3500 5750 50  0000 C CNN
F 2 "" H 3500 5900 50  0001 C CNN
F 3 "" H 3500 5900 50  0001 C CNN
	1    3500 5900
	1    0    0    -1  
$EndComp
$Comp
L Device:R R41
U 1 1 5EA66C44
P 3500 5650
F 0 "R41" H 3570 5696 50  0000 L CNN
F 1 "10k" H 3570 5605 50  0000 L CNN
F 2 "10005011 Power Management:R0603_1" V 3430 5650 50  0001 C CNN
F 3 "~" H 3500 5650 50  0001 C CNN
	1    3500 5650
	1    0    0    -1  
$EndComp
Wire Wire Line
	2600 4600 3150 4600
Connection ~ 2600 4600
Wire Wire Line
	2600 4600 2600 4900
$Comp
L Device:R R36
U 1 1 5EA66C3B
P 3150 4950
F 0 "R36" H 3220 4996 50  0000 L CNN
F 1 "10k" H 3220 4905 50  0000 L CNN
F 2 "10005011 Power Management:R0603_1" V 3080 4950 50  0001 C CNN
F 3 "~" H 3150 4950 50  0001 C CNN
	1    3150 4950
	1    0    0    -1  
$EndComp
Wire Wire Line
	2000 4700 2000 4600
Wire Wire Line
	2000 5800 2000 6000
Connection ~ 2000 5800
$Comp
L 10005011_Power_Management:IRLML5103TRPBF T11
U 1 1 5EA66C32
P 2500 5100
F 0 "T11" H 2704 5054 50  0000 L CNN
F 1 "IRLML5103" H 2704 5145 50  0000 L CNN
F 2 "10005011 Power Management:SOT23-GSD_1" H 2700 5200 50  0001 C CNN
F 3 "~" H 2500 5100 50  0001 C CNN
	1    2500 5100
	1    0    0    1   
$EndComp
$Comp
L 10005011_Power_Management:SUD50P06-15L-E3 T9
U 1 1 5EA66C2C
P 3500 4700
F 0 "T9" V 3842 4700 50  0000 C CNN
F 1 "SUD50P06-15L" V 3751 4700 50  0000 C CNN
F 2 "10005011 Power Management:DPAK-GDS_1" H 3795 4625 50  0001 L CIN
F 3 "http://www.vishay.com/docs/72250/sud50p06.pdf" H 3500 4700 50  0001 C CNN
F 4 "MOSFET P-CH 60V 50A TO252" H 4375 4625 50  0001 C CNN "Description"
F 5 "10022560" H 3500 4700 50  0001 C CNN "Item Number"
F 6 "Vishay Siliconix" H 4100 4625 50  0001 C CNN "Mfgr"
F 7 "SUD50P06-15L-E3" H 4175 4625 50  0001 C CNN "Mfgr_PN"
F 8 "Digi-Key" H 3950 4625 50  0001 C CNN "Source"
F 9 "SUD50P06-15L-E3CT-ND" H 4275 4625 50  0001 C CNN "Source_PN"
	1    3500 4700
	0    -1   -1   0   
$EndComp
$Comp
L 10005011_Power_Management:SUD50P06-15L-E3 T10
U 1 1 5EA66C26
P 4200 4700
F 0 "T10" V 4542 4700 50  0000 C CNN
F 1 "SUD50P06-15L" V 4451 4700 50  0000 C CNN
F 2 "10005011 Power Management:DPAK-GDS_1" H 4395 4625 50  0001 L CIN
F 3 "https://www.vishay.com/docs/68940/sud50p06.pdf" H 4200 4700 50  0001 C CNN
	1    4200 4700
	0    1    -1   0   
$EndComp
Wire Wire Line
	1400 5800 2000 5800
Wire Wire Line
	1600 6700 2000 6700
Wire Wire Line
	1600 6200 1700 6200
Connection ~ 1600 6200
Wire Wire Line
	2000 6800 2000 6700
Wire Wire Line
	1600 6600 1600 6700
Wire Wire Line
	1200 6200 1600 6200
Wire Wire Line
	1600 6200 1600 6300
Wire Wire Line
	2000 6400 2000 6700
Wire Wire Line
	2000 5000 2000 5100
$Comp
L Device:R R34
U 1 1 5EA66C16
P 2000 4850
F 0 "R34" H 1930 4804 50  0000 R CNN
F 1 "10k" H 1930 4895 50  0000 R CNN
F 2 "10005011 Power Management:R0603_1" V 1930 4850 50  0001 C CNN
F 3 "~" H 2000 4850 50  0001 C CNN
	1    2000 4850
	-1   0    0    1   
$EndComp
$Comp
L Device:R R39
U 1 1 5EA66C10
P 2000 5450
F 0 "R39" H 1930 5404 50  0000 R CNN
F 1 "10k" H 1930 5495 50  0000 R CNN
F 2 "10005011 Power Management:R0603_1" V 1930 5450 50  0001 C CNN
F 3 "~" H 2000 5450 50  0001 C CNN
	1    2000 5450
	-1   0    0    1   
$EndComp
$Comp
L Device:R R42
U 1 1 5EA66C08
P 1600 6450
F 0 "R42" H 1670 6496 50  0000 L CNN
F 1 "100k" H 1670 6405 50  0000 L CNN
F 2 "10005011 Power Management:R0603_1" V 1530 6450 50  0001 C CNN
F 3 "~" H 1600 6450 50  0001 C CNN
	1    1600 6450
	1    0    0    -1  
$EndComp
$Comp
L power:GND #PWR0224
U 1 1 5EA66C02
P 2000 6800
F 0 "#PWR0224" H 2000 6550 50  0001 C CNN
F 1 "GND" H 2000 6650 50  0000 C CNN
F 2 "" H 2000 6800 50  0001 C CNN
F 3 "" H 2000 6800 50  0001 C CNN
	1    2000 6800
	1    0    0    -1  
$EndComp
$Comp
L 10005011_Power_Management:2N7002 T12
U 1 1 5EA66BFC
P 1900 6200
F 0 "T12" H 2100 6275 50  0000 L CNN
F 1 "2N7002" H 2100 6200 50  0000 L CNN
F 2 "10005011 Power Management:SOT23-GSD_1" H 2100 6125 50  0001 L CIN
F 3 "https://www.fairchildsemi.com/datasheets/2N/2N7002.pdf" H 1900 6200 50  0001 L CNN
	1    1900 6200
	1    0    0    -1  
$EndComp
Connection ~ 3500 5400
Wire Wire Line
	3150 5400 3500 5400
Wire Wire Line
	3250 3100 3750 3100
Connection ~ 3500 2000
Wire Wire Line
	3200 2000 3500 2000
Wire Notes Line width 39
	6950 11150 6950 6700
Wire Notes Line width 39
	6950 6700 16050 6700
Wire Notes Line width 39
	9300 6700 9300 500 
Wire Notes Line width 39
	9300 3700 16050 3700
$Comp
L 10005011_Power_Management:BAT54 D17
U 1 1 60B18780
P 14750 8350
F 0 "D17" H 14700 8169 50  0000 C CNN
F 1 "BAT54" H 14700 8260 50  0000 C CNN
F 2 "10005011 Power Management:SOT23-1G_1" H 14520 8188 50  0001 L CNN
F 3 "http://www.onsemi.com/pub/Collateral/BAT54LT1-D.PDF" H 14670 8450 50  0001 C CNN
F 4 "DIODE SCHOTTKY 30V 200MA SOT23-3" H 15075 8175 60  0001 C CNN "Description"
F 5 "10022652" H 14750 8300 50  0001 C CNN "Item Number"
F 6 "ON Semiconductor" H 15075 8175 60  0001 C CNN "Mfgr"
F 7 "BAT54LT1G" H 15075 8175 60  0001 C CNN "Mfgr_PN"
F 8 "Digi-Key" H 14925 8175 60  0001 C CNN "Source"
F 9 "BAT54LT1GOSTR-ND" H 14900 8175 60  0001 C CNN "Source_PN"
	1    14750 8350
	-1   0    0    1   
$EndComp
$Comp
L 10005011_Power_Management:1N5819 ZD19
U 1 1 5E9AF4B5
P 5800 4150
F 0 "ZD19" H 5800 3934 50  0000 C CNN
F 1 "??SOD87C" H 5800 4025 50  0000 C CNN
F 2 "10005011 Power Management:SOD87_1" H 5750 3850 50  0001 C CNN
F 3 "" H 5800 4150 50  0001 C CNN
F 4 "" H 5800 3450 50  0001 C CNN "Mfgr"
F 5 "" H 5850 3650 50  0001 C CNN "Mfgr_PN"
F 6 "" H 5800 3550 50  0001 C CNN "Source"
F 7 "" H 5750 3750 50  0001 C CNN "Source_PN"
F 8 "" H 5750 3950 50  0001 C CNN "Description"
F 9 "" H 5800 4150 50  0001 C CNN "Item Number"
	1    5800 4150
	-1   0    0    1   
$EndComp
Connection ~ 5650 4150
Connection ~ 5950 4150
$Comp
L 10005011_Power_Management:+3.0VREF #PWR0288
U 1 1 5E997247
P 800 9950
F 0 "#PWR0288" H 800 9800 50  0001 C CNN
F 1 "+3.0VREF" H 815 10123 50  0000 C CNN
F 2 "" H 800 9950 50  0001 C CNN
F 3 "" H 800 9950 50  0001 C CNN
	1    800  9950
	1    0    0    -1  
$EndComp
Wire Wire Line
	1800 9850 1800 10150
Wire Wire Line
	800  10050 800  9950
Wire Wire Line
	800  10050 1250 10050
Text Label 4350 4150 0    50   ~ 0
LED_DC_IN
$EndSCHEMATC
