EESchema Schematic File Version 4
EELAYER 30 0
EELAYER END
$Descr User 17335 11946
encoding utf-8
Sheet 2 8
Title "RB0505 CPU Board"
Date "2020-04-15"
Rev ""
Comp ""
Comment1 ""
Comment2 ""
Comment3 ""
Comment4 ""
$EndDescr
Text HLabel 2525 6225 0    70   Input ~ 0
MTSR-SPI-0
Text HLabel 6425 6150 0    56   Input ~ 0
MTSR-SPI-0
Text HLabel 2525 6075 0    70   Input ~ 0
SCLK-SPI-0
Text HLabel 6425 5950 0    56   Input ~ 0
SCLK-SPI-0
Text HLabel 2525 6525 0    70   Input ~ 0
CE-RTC1
Text HLabel 12575 3025 0    70   Input ~ 0
CD-O2
Text HLabel 13975 2725 2    56   Output ~ 0
O2-VALVE
Text HLabel 11125 5800 0    56   Input ~ 0
CD-VALVE
Text HLabel 14225 5500 2    56   Output ~ 0
EXHALATION-VALVE
Text HLabel 6425 6350 0    56   Input ~ 0
CE\-RTC2
Text HLabel 14775 6275 2    56   Output ~ 0
MES-I-VALVE
Text HLabel 8150 2700 2    56   Output ~ 0
FIO2-MEAS
Text HLabel 5725 2550 0    56   Input ~ 0
CON-FIO2-MEAS
Text HLabel 9675 3750 0    56   Input ~ 0
SEC-BUZ
Text HLabel 4150 3625 2    56   Output ~ 0
RESET
Text HLabel 9650 2750 0    56   Input ~ 0
RESET
Text HLabel 1925 2675 0    56   Input ~ 0
WDOG
Text HLabel 1675 2425 2    56   Output ~ 0
PFI
Text HLabel 4150 2675 2    56   Output ~ 0
POWER-FAIL
$Comp
L cpu-board:GND #U$94
U 1 1 6D0D8D91
P 2875 4575
AR Path="/6D0D8D91" Ref="#U$94"  Part="1" 
AR Path="/5E924756/6D0D8D91" Ref="#U$094"  Part="1" 
F 0 "#U$094" H 2875 4575 50  0001 C CNN
F 1 "GND" H 2787 4500 59  0000 L BNN
F 2 "" H 2875 4575 50  0001 C CNN
F 3 "" H 2875 4575 50  0001 C CNN
	1    2875 4575
	-1   0    0    1   
$EndComp
$Comp
L cpu-board:+5V #U$99
U 1 1 B1452B4B
P 3225 4550
AR Path="/B1452B4B" Ref="#U$99"  Part="1" 
AR Path="/5E924756/B1452B4B" Ref="#U$099"  Part="1" 
F 0 "#U$099" H 3225 4550 50  0001 C CNN
F 1 "+5V" H 3150 4475 59  0000 L BNN
F 2 "" H 3225 4550 50  0001 C CNN
F 3 "" H 3225 4550 50  0001 C CNN
	1    3225 4550
	-1   0    0    1   
$EndComp
$Comp
L cpu-board:C0805 C42
U 1 1 E64E96FA
P 3050 4925
AR Path="/E64E96FA" Ref="C42"  Part="1" 
AR Path="/5E924756/E64E96FA" Ref="C42"  Part="1" 
F 0 "C42" V 3213 5019 64  0000 R TNN
F 1 "100nF" V 3144 5013 42  0000 R TNN
F 2 "AllModules:C0402_1" H 3050 4925 50  0001 C CNN
F 3 "" H 3050 4925 50  0001 C CNN
F 4 "CAPACITOR,100NF,16V,+/-10%,X7R,0402" H 3050 4925 50  0001 C CNN "Description"
F 5 "10022607" H 3050 4925 50  0001 C CNN "Item Number"
F 6 "MURATA" H 3050 4925 50  0001 C CNN "Manufacturer"
F 7 "GRM155R71C104JA88J" H 3050 4925 50  0001 C CNN "Manufacturer_No"
F 8 "CAPACITOR, CERAMIC, MULTILAYER, 16V, X7R, 0.1UF, 0402" H 3050 4925 50  0001 C CNN "Manufacturer_Desc"
F 9 "YAGEO_RMS1" H 3050 4925 50  0001 C CNN "Manufacturer2"
F 10 "CC0402KRX7R7BB104" H 3050 4925 50  0001 C CNN "Manufacturer_No2"
F 11 "CAP CER 0.1uF 16V X7R 10% 0402" H 3050 4925 50  0001 C CNN "Manufacturer_Desc2"
F 12 "YAGEO_RMS1" H 3050 4925 50  0001 C CNN "Manufacturer3"
F 13 "223878715649" H 3050 4925 50  0001 C CNN "Manufacturer_No3"
F 14 "CAPACITOR, CERAMIC, MULTILAYER, 16 V, X7R, 0.1 UF, SURFACE MOUNT, 0402" H 3050 4925 50  0001 C CNN "Manufacturer_Desc3"
F 15 "MURATA MANUFACTURING CO., LTD." H 3050 4925 50  0001 C CNN "Manufacturer4"
F 16 "GRM155R71C104KA88D" H 3050 4925 50  0001 C CNN "Manufacturer_No4"
F 17 "MONOLITHIC CERAMIC CAPACITOR" H 3050 4925 50  0001 C CNN "Manufacturer_Desc4"
	1    3050 4925
	0    -1   -1   0   
$EndComp
$Comp
L cpu-board:GND #U$100
U 1 1 1B0C7F6A
P 4525 7275
AR Path="/1B0C7F6A" Ref="#U$100"  Part="1" 
AR Path="/5E924756/1B0C7F6A" Ref="#U$0100"  Part="1" 
F 0 "#U$0100" H 4525 7275 50  0001 C CNN
F 1 "GND" H 4463 7200 59  0000 L BNN
F 2 "" H 4525 7275 50  0001 C CNN
F 3 "" H 4525 7275 50  0001 C CNN
	1    4525 7275
	1    0    0    -1  
$EndComp
$Comp
L cpu-board:+5V #U$102
U 1 1 E9A68DEF
P 4250 6525
AR Path="/E9A68DEF" Ref="#U$102"  Part="1" 
AR Path="/5E924756/E9A68DEF" Ref="#U$0102"  Part="1" 
F 0 "#U$0102" H 4250 6525 50  0001 C CNN
F 1 "+5V" V 4375 6425 59  0000 L BNN
F 2 "" H 4250 6525 50  0001 C CNN
F 3 "" H 4250 6525 50  0001 C CNN
	1    4250 6525
	0    -1   -1   0   
$EndComp
$Comp
L cpu-board:DS1305E IC10
U 1 1 E884BF5E
P 3225 6225
AR Path="/E884BF5E" Ref="IC10"  Part="1" 
AR Path="/5E924756/E884BF5E" Ref="IC10"  Part="1" 
F 0 "IC10" H 3875 7387 64  0000 L BNN
F 1 "DS1305E" H 3875 7312 42  0000 L BNN
F 2 "AllModules:TSSOP20_SANS-MIRE_1" H 3225 6225 50  0001 C CNN
F 3 "" H 3225 6225 50  0001 C CNN
F 4 "IC,REALTIMECLOCK, TSSOP" H 3225 6225 50  0001 C CNN "Description"
F 5 "10022965" H 3225 6225 50  0001 C CNN "Item Number"
F 6 "MAXIM_RMS1" H 3225 6225 50  0001 C CNN "Manufacturer"
F 7 "DS1305E+" H 3225 6225 50  0001 C CNN "Manufacturer_No"
F 8 "" H 3225 6225 50  0001 C CNN "Manufacturer_Desc"
F 9 "MAXIM_RMS1" H 3225 6225 50  0001 C CNN "Manufacturer2"
F 10 "DS1305E+T&R" H 3225 6225 50  0001 C CNN "Manufacturer_No2"
F 11 "" H 3225 6225 50  0001 C CNN "Manufacturer_Desc2"
	1    3225 6225
	1    0    0    -1  
$EndComp
$Comp
L cpu-board:86SMX Q5
U 1 1 4396189E
P 4300 5775
AR Path="/4396189E" Ref="Q5"  Part="1" 
AR Path="/5E924756/4396189E" Ref="Q5"  Part="1" 
F 0 "Q5" V 4315 5650 51  0000 R TNN
F 1 "32,768KHz" V 4237 5650 51  0000 R TNN
F 2 "AllModules:85SMX_1" H 4300 5775 50  0001 C CNN
F 3 "" H 4300 5775 50  0001 C CNN
F 4 "CRYSTAL QUARTZ 32.768KHZ" H 4300 5775 50  0001 C CNN "Description"
F 5 "10023250" H 4300 5775 50  0001 C CNN "Item Number"
F 6 "IQD" H 4300 5775 50  0001 C CNN "Manufacturer"
F 7 "LFXTAL003000REEL" H 4300 5775 50  0001 C CNN "Manufacturer_No"
F 8 "CRYSTAL QUARTZ 32.768KHZ" H 4300 5775 50  0001 C CNN "Manufacturer_Desc"
	1    4300 5775
	0    -1   -1   0   
$EndComp
$Comp
L cpu-board:KEY_3000 G1
U 1 1 7E939E76
P 4525 6725
AR Path="/7E939E76" Ref="G1"  Part="1" 
AR Path="/5E924756/7E939E76" Ref="G1"  Part="1" 
F 0 "G1" V 4575 6575 59  0000 R TNN
F 1 "3V" V 4500 6562 59  0000 R TNN
F 2 "AllModules:CR1220-3000_1" H 4525 6725 50  0001 C CNN
F 3 "" H 4525 6725 50  0001 C CNN
F 4 "LITHIUM, 3V, 35MAH" H 4525 6725 50  0001 C CNN "Description"
F 5 "10022884" H 4525 6725 50  0001 C CNN "Item Number"
F 6 "SONY_RMS1" H 4525 6725 50  0001 C CNN "Manufacturer"
F 7 "CR1220-B1A" H 4525 6725 50  0001 C CNN "Manufacturer_No"
F 8 "COIN CELL BATTERY" H 4525 6725 50  0001 C CNN "Manufacturer_Desc"
F 9 "MAXELL" H 4525 6725 50  0001 C CNN "Manufacturer2"
F 10 "CR1220" H 4525 6725 50  0001 C CNN "Manufacturer_No2"
F 11 "" H 4525 6725 50  0001 C CNN "Manufacturer_Desc2"
F 12 "VARTA                           (917650)" H 4525 6725 50  0001 C CNN "Manufacturer3"
F 13 "CR 1220" H 4525 6725 50  0001 C CNN "Manufacturer_No3"
F 14 "BATTERY" H 4525 6725 50  0001 C CNN "Manufacturer_Desc3"
	1    4525 6725
	0    -1   -1   0   
$EndComp
$Comp
L cpu-board:+24V #U$217
U 1 1 82B40965
P 13575 2100
AR Path="/82B40965" Ref="#U$217"  Part="1" 
AR Path="/5E924756/82B40965" Ref="#U$0217"  Part="1" 
F 0 "#U$0217" H 13575 2100 50  0001 C CNN
F 1 "+24V" H 13462 1962 59  0000 L BNN
F 2 "" H 13575 2100 50  0001 C CNN
F 3 "" H 13575 2100 50  0001 C CNN
	1    13575 2100
	-1   0    0    1   
$EndComp
$Comp
L cpu-board:R0805 R8
U 1 1 C507FD3A
P 13225 3325
AR Path="/C507FD3A" Ref="R8"  Part="1" 
AR Path="/5E924756/C507FD3A" Ref="R8"  Part="1" 
F 0 "R8" V 13237 3550 64  0000 R TNN
F 1 "100k" V 13162 3550 42  0000 R TNN
F 2 "AllModules:R0603_1" H 13225 3325 50  0001 C CNN
F 3 "" H 13225 3325 50  0001 C CNN
F 4 "RESISTOR,100 K OHM, 0.063W +/-5%" H 13225 3325 50  0001 C CNN "Description"
F 5 "10022732" H 13225 3325 50  0001 C CNN "Item Number"
F 6 "YAGEO_RMS1" H 13225 3325 50  0001 C CNN "Manufacturer"
F 7 "232270260104L" H 13225 3325 50  0001 C CNN "Manufacturer_No"
F 8 "RESISTOR, METAL GLAZE/THICK FILM, 0.1 W, 5 %, 100 PPM, 100000 OHM, SURFACE MOUNT, 0603" H 13225 3325 50  0001 C CNN "Manufacturer_Desc"
F 9 "YAGEO_RMS1" H 13225 3325 50  0001 C CNN "Manufacturer2"
F 10 "232270260104" H 13225 3325 50  0001 C CNN "Manufacturer_No2"
F 11 "RESISTOR, METAL GLAZE/THICK FILM, 0.1 W, 5 %, 100 PPM, 100000 OHM, SURFACE MOUNT, 0603" H 13225 3325 50  0001 C CNN "Manufacturer_Desc2"
F 12 "YAGEO_RMS1" H 13225 3325 50  0001 C CNN "Manufacturer3"
F 13 "RC0603JR-07100KL" H 13225 3325 50  0001 C CNN "Manufacturer_No3"
F 14 "RESISTOR, METAL GLAZE/THICK FILM, 0.1 W, 5 %, 100 PPM, 100000 OHM, SURFACE MOUNT, 0603" H 13225 3325 50  0001 C CNN "Manufacturer_Desc3"
F 15 "PANASONIC_RMS1" H 13225 3325 50  0001 C CNN "Manufacturer4"
F 16 "ERJ3GEYJ104V" H 13225 3325 50  0001 C CNN "Manufacturer_No4"
F 17 "THICK FILM CHIP RESISTOR" H 13225 3325 50  0001 C CNN "Manufacturer_Desc4"
	1    13225 3325
	0    -1   -1   0   
$EndComp
$Comp
L cpu-board:PRLL5819 D15
U 1 1 557FCCAF
P 13575 2575
AR Path="/557FCCAF" Ref="D15"  Part="1" 
AR Path="/5E924756/557FCCAF" Ref="D15"  Part="1" 
F 0 "D15" V 13671 2809 59  0000 L BNN
F 1 "PRLL5819" V 13577 2674 42  0000 L BNN
F 2 "AllModules:SOD87_1" H 13575 2575 50  0001 C CNN
F 3 "" H 13575 2575 50  0001 C CNN
F 4 "DIODE SCHOTTKY, 40V, 1A" H 13575 2575 50  0001 C CNN "Description"
F 5 "10097253" H 13575 2575 50  0001 C CNN "Item Number"
F 6 "DIODES INC_RMS1" H 13575 2575 50  0001 C CNN "Manufacturer"
F 7 "1N5819HW-7-F" H 13575 2575 50  0001 C CNN "Manufacturer_No"
F 8 "SURFACE MOUNT SCHOTTKY BARRIER RECTIFIER" H 13575 2575 50  0001 C CNN "Manufacturer_Desc"
	1    13575 2575
	0    -1   -1   0   
$EndComp
$Comp
L cpu-board:R0805 R9
U 1 1 D76F26ED
P 11375 6050
AR Path="/D76F26ED" Ref="R9"  Part="1" 
AR Path="/5E924756/D76F26ED" Ref="R9"  Part="1" 
F 0 "R9" V 11450 6163 64  0000 L BNN
F 1 "100k" V 11362 6125 42  0000 L BNN
F 2 "AllModules:R0603_1" H 11375 6050 50  0001 C CNN
F 3 "" H 11375 6050 50  0001 C CNN
F 4 "RESISTOR,100 K OHM, 0.063W +/-5%" H 11375 6050 50  0001 C CNN "Description"
F 5 "10022732" H 11375 6050 50  0001 C CNN "Item Number"
F 6 "YAGEO_RMS1" H 11375 6050 50  0001 C CNN "Manufacturer"
F 7 "232270260104L" H 11375 6050 50  0001 C CNN "Manufacturer_No"
F 8 "RESISTOR, METAL GLAZE/THICK FILM, 0.1 W, 5 %, 100 PPM, 100000 OHM, SURFACE MOUNT, 0603" H 11375 6050 50  0001 C CNN "Manufacturer_Desc"
F 9 "YAGEO_RMS1" H 11375 6050 50  0001 C CNN "Manufacturer2"
F 10 "232270260104" H 11375 6050 50  0001 C CNN "Manufacturer_No2"
F 11 "RESISTOR, METAL GLAZE/THICK FILM, 0.1 W, 5 %, 100 PPM, 100000 OHM, SURFACE MOUNT, 0603" H 11375 6050 50  0001 C CNN "Manufacturer_Desc2"
F 12 "YAGEO_RMS1" H 11375 6050 50  0001 C CNN "Manufacturer3"
F 13 "RC0603JR-07100KL" H 11375 6050 50  0001 C CNN "Manufacturer_No3"
F 14 "RESISTOR, METAL GLAZE/THICK FILM, 0.1 W, 5 %, 100 PPM, 100000 OHM, SURFACE MOUNT, 0603" H 11375 6050 50  0001 C CNN "Manufacturer_Desc3"
F 15 "PANASONIC_RMS1" H 11375 6050 50  0001 C CNN "Manufacturer4"
F 16 "ERJ3GEYJ104V" H 11375 6050 50  0001 C CNN "Manufacturer_No4"
F 17 "THICK FILM CHIP RESISTOR" H 11375 6050 50  0001 C CNN "Manufacturer_Desc4"
	1    11375 6050
	0    -1   -1   0   
$EndComp
$Comp
L cpu-board:MTD3055 T21
U 1 1 2CDC58F9
P 11850 5750
AR Path="/2CDC58F9" Ref="T21"  Part="1" 
AR Path="/5E924756/2CDC58F9" Ref="T21"  Part="1" 
F 0 "T21" H 12002 5850 64  0000 L BNN
F 1 "2N7002" H 12015 5755 42  0000 L BNN
F 2 "AllModules:SOT23-GSD_1" H 11850 5750 50  0001 C CNN
F 3 "" H 11850 5750 50  0001 C CNN
F 4 "TRANSISTOR MOSFET N CHANNEL 60V, 0.18A" H 11850 5750 50  0001 C CNN "Description"
F 5 "10097274" H 11850 5750 50  0001 C CNN "Item Number"
F 6 "ON SEMICONDUCTOR_RMS1" H 11850 5750 50  0001 C CNN "Manufacturer"
F 7 "2N7002LT1G" H 11850 5750 50  0001 C CNN "Manufacturer_No"
F 8 "SMALL SIGNAL MOSFET" H 11850 5750 50  0001 C CNN "Manufacturer_Desc"
F 9 "NXP SEMICONDUCTORS_RMS1" H 11850 5750 50  0001 C CNN "Manufacturer2"
F 10 "2N7002,215" H 11850 5750 50  0001 C CNN "Manufacturer_No2"
F 11 "" H 11850 5750 50  0001 C CNN "Manufacturer_Desc2"
F 12 "NXP SEMICONDUCTORS_RMS1" H 11850 5750 50  0001 C CNN "Manufacturer3"
F 13 "2N7002" H 11850 5750 50  0001 C CNN "Manufacturer_No3"
F 14 "N-CHANNEL TRENCHMOS FET" H 11850 5750 50  0001 C CNN "Manufacturer_Desc3"
	1    11850 5750
	1    0    0    -1  
$EndComp
$Comp
L cpu-board:GND #U$228
U 1 1 0966E2B7
P 11375 6400
AR Path="/0966E2B7" Ref="#U$228"  Part="1" 
AR Path="/5E924756/0966E2B7" Ref="#U$0228"  Part="1" 
F 0 "#U$0228" H 11375 6400 50  0001 C CNN
F 1 "GND" H 11300 6325 59  0000 L BNN
F 2 "" H 11375 6400 50  0001 C CNN
F 3 "" H 11375 6400 50  0001 C CNN
	1    11375 6400
	1    0    0    -1  
$EndComp
$Comp
L cpu-board:PRLL5819 D16
U 1 1 16F46E82
P 11900 5075
AR Path="/16F46E82" Ref="D16"  Part="1" 
AR Path="/5E924756/16F46E82" Ref="D16"  Part="1" 
F 0 "D16" V 11954 5491 59  0000 R TNN
F 1 "PRLL5819" V 11886 5488 42  0000 R TNN
F 2 "AllModules:SOD87_1" H 11900 5075 50  0001 C CNN
F 3 "" H 11900 5075 50  0001 C CNN
F 4 "DIODE SCHOTTKY, 40V, 1A" H 11900 5075 50  0001 C CNN "Description"
F 5 "10097253" H 11900 5075 50  0001 C CNN "Item Number"
F 6 "DIODES INC_RMS1" H 11900 5075 50  0001 C CNN "Manufacturer"
F 7 "1N5819HW-7-F" H 11900 5075 50  0001 C CNN "Manufacturer_No"
F 8 "SURFACE MOUNT SCHOTTKY BARRIER RECTIFIER" H 11900 5075 50  0001 C CNN "Manufacturer_Desc"
	1    11900 5075
	0    -1   -1   0   
$EndComp
$Comp
L cpu-board:FAS-PPS-1P-3NIP-INJ V2
U 1 1 F1FC2759
P 13525 5250
AR Path="/F1FC2759" Ref="V2"  Part="1" 
AR Path="/5E924756/F1FC2759" Ref="V2"  Part="1" 
F 0 "V2" H 14125 5775 59  0000 L BNN
F 1 "FAS-PPS-1P-3NIP-INJ" H 13987 5787 59  0001 L BNN
F 2 "AllModules:S142.0011-SANS-FIX_1" H 13525 5250 50  0001 C CNN
F 3 "" H 13525 5250 50  0001 C CNN
F 4 "3 WAY, PROPORTIONAL VALVE" H 13525 5250 50  0001 C CNN "Description"
F 5 "10025112" H 13525 5250 50  0001 C CNN "Item Number"
F 6 "FAS" H 13525 5250 50  0001 C CNN "Manufacturer"
F 7 "S142.0048A" H 13525 5250 50  0001 C CNN "Manufacturer_No"
F 8 "3 WAY PROPORTIONAL VALVE" H 13525 5250 50  0001 C CNN "Manufacturer_Desc"
	1    13525 5250
	-1   0    0    -1  
$EndComp
$Comp
L cpu-board:+5V #U$289
U 1 1 8B09CC94
P 7025 4600
AR Path="/8B09CC94" Ref="#U$289"  Part="1" 
AR Path="/5E924756/8B09CC94" Ref="#U$0289"  Part="1" 
F 0 "#U$0289" H 7025 4600 50  0001 C CNN
F 1 "+5V" H 6938 4512 59  0000 L BNN
F 2 "" H 7025 4600 50  0001 C CNN
F 3 "" H 7025 4600 50  0001 C CNN
	1    7025 4600
	-1   0    0    1   
$EndComp
$Comp
L cpu-board:GND #U$290
U 1 1 22942F50
P 7625 4625
AR Path="/22942F50" Ref="#U$290"  Part="1" 
AR Path="/5E924756/22942F50" Ref="#U$0290"  Part="1" 
F 0 "#U$0290" H 7625 4625 50  0001 C CNN
F 1 "GND" H 7550 4550 59  0000 L BNN
F 2 "" H 7625 4625 50  0001 C CNN
F 3 "" H 7625 4625 50  0001 C CNN
	1    7625 4625
	-1   0    0    1   
$EndComp
$Comp
L cpu-board:C0805 C77
U 1 1 28576E5F
P 7325 4950
AR Path="/28576E5F" Ref="C77"  Part="1" 
AR Path="/5E924756/28576E5F" Ref="C77"  Part="1" 
F 0 "C77" V 7550 4844 64  0000 L BNN
F 1 "100nF" V 7456 4838 42  0000 L BNN
F 2 "AllModules:C0402_1" H 7325 4950 50  0001 C CNN
F 3 "" H 7325 4950 50  0001 C CNN
F 4 "CAPACITOR,100NF,16V,+/-10%,X7R,0402" H 7325 4950 50  0001 C CNN "Description"
F 5 "10022607" H 7325 4950 50  0001 C CNN "Item Number"
F 6 "MURATA" H 7325 4950 50  0001 C CNN "Manufacturer"
F 7 "GRM155R71C104JA88J" H 7325 4950 50  0001 C CNN "Manufacturer_No"
F 8 "CAPACITOR, CERAMIC, MULTILAYER, 16V, X7R, 0.1UF, 0402" H 7325 4950 50  0001 C CNN "Manufacturer_Desc"
F 9 "YAGEO_RMS1" H 7325 4950 50  0001 C CNN "Manufacturer2"
F 10 "CC0402KRX7R7BB104" H 7325 4950 50  0001 C CNN "Manufacturer_No2"
F 11 "CAP CER 0.1uF 16V X7R 10% 0402" H 7325 4950 50  0001 C CNN "Manufacturer_Desc2"
F 12 "YAGEO_RMS1" H 7325 4950 50  0001 C CNN "Manufacturer3"
F 13 "223878715649" H 7325 4950 50  0001 C CNN "Manufacturer_No3"
F 14 "CAPACITOR, CERAMIC, MULTILAYER, 16 V, X7R, 0.1 UF, SURFACE MOUNT, 0402" H 7325 4950 50  0001 C CNN "Manufacturer_Desc3"
F 15 "MURATA MANUFACTURING CO., LTD." H 7325 4950 50  0001 C CNN "Manufacturer4"
F 16 "GRM155R71C104KA88D" H 7325 4950 50  0001 C CNN "Manufacturer_No4"
F 17 "MONOLITHIC CERAMIC CAPACITOR" H 7325 4950 50  0001 C CNN "Manufacturer_Desc4"
	1    7325 4950
	0    -1   -1   0   
$EndComp
$Comp
L cpu-board:86SMX Q3
U 1 1 7ABFF94E
P 6375 5550
AR Path="/7ABFF94E" Ref="Q3"  Part="1" 
AR Path="/5E924756/7ABFF94E" Ref="Q3"  Part="1" 
F 0 "Q3" V 6375 5975 53  0000 R TNN
F 1 "32,768KHz" V 6300 5975 42  0000 R TNN
F 2 "AllModules:85SMX_1" H 6375 5550 50  0001 C CNN
F 3 "" H 6375 5550 50  0001 C CNN
	1    6375 5550
	0    -1   -1   0   
$EndComp
$Comp
L cpu-board:R0805 R53
U 1 1 CFBE9597
P 12425 6125
AR Path="/CFBE9597" Ref="R53"  Part="1" 
AR Path="/5E924756/CFBE9597" Ref="R53"  Part="1" 
F 0 "R53" H 12362 6275 64  0000 L BNN
F 1 "10k" H 12362 6212 42  0000 L BNN
F 2 "AllModules:R0603_1" H 12425 6125 50  0001 C CNN
F 3 "" H 12425 6125 50  0001 C CNN
F 4 "RESISTOR,10K OHM, 0.063W,+/-5%,0603" H 12425 6125 50  0001 C CNN "Description"
F 5 "10097266" H 12425 6125 50  0001 C CNN "Item Number"
F 6 "YAGEO_RMS1" H 12425 6125 50  0001 C CNN "Manufacturer"
F 7 "232270260103L" H 12425 6125 50  0001 C CNN "Manufacturer_No"
F 8 "RESISTOR, METAL GLAZE/THICK FILM, 0.1 W, 5 %, 100 PPM, 10000 OHM, SURFACE MOUNT, 0603" H 12425 6125 50  0001 C CNN "Manufacturer_Desc"
F 9 "YAGEO_RMS1" H 12425 6125 50  0001 C CNN "Manufacturer2"
F 10 "232270260103" H 12425 6125 50  0001 C CNN "Manufacturer_No2"
F 11 "RESISTOR, METAL GLAZE/THICK FILM, 0.1 W, 5 %, 100 PPM, 10000 OHM, SURFACE MOUNT, 0603" H 12425 6125 50  0001 C CNN "Manufacturer_Desc2"
F 12 "VISHAY_RMS1" H 12425 6125 50  0001 C CNN "Manufacturer3"
F 13 "CRCW060310K0JNEA" H 12425 6125 50  0001 C CNN "Manufacturer_No3"
F 14 "THICK FILM RECTANGULAR CHIP RESISTOR" H 12425 6125 50  0001 C CNN "Manufacturer_Desc3"
F 15 "ASJ" H 12425 6125 50  0001 C CNN "Manufacturer4"
F 16 "CR16-103JL" H 12425 6125 50  0001 C CNN "Manufacturer_No4"
F 17 "THICK FILM CHIP RESISTOR" H 12425 6125 50  0001 C CNN "Manufacturer_Desc4"
F 18 "YAGEO_RMS1" H 12425 6125 50  0001 C CNN "Manufacturer5"
F 19 "RC0603JR-0710KL" H 12425 6125 50  0001 C CNN "Manufacturer_No5"
F 20 "RESISTOR, METAL GLAZE/THICK FILM, 0.1 W, 5 %, 100 PPM, 10000 OHM, SURFACE MOUNT, 0603" H 12425 6125 50  0001 C CNN "Manufacturer_Desc5"
	1    12425 6125
	1    0    0    -1  
$EndComp
$Comp
L cpu-board:R0805 R54
U 1 1 E78706DF
P 12400 6925
AR Path="/E78706DF" Ref="R54"  Part="1" 
AR Path="/5E924756/E78706DF" Ref="R54"  Part="1" 
F 0 "R54" H 12313 7063 64  0000 L BNN
F 1 "10k" H 12313 7000 42  0000 L BNN
F 2 "AllModules:R0603_1" H 12400 6925 50  0001 C CNN
F 3 "" H 12400 6925 50  0001 C CNN
F 4 "RESISTOR,10K OHM, 0.063W,+/-5%,0603" H 12400 6925 50  0001 C CNN "Description"
F 5 "10097266" H 12400 6925 50  0001 C CNN "Item Number"
F 6 "YAGEO_RMS1" H 12400 6925 50  0001 C CNN "Manufacturer"
F 7 "232270260103L" H 12400 6925 50  0001 C CNN "Manufacturer_No"
F 8 "RESISTOR, METAL GLAZE/THICK FILM, 0.1 W, 5 %, 100 PPM, 10000 OHM, SURFACE MOUNT, 0603" H 12400 6925 50  0001 C CNN "Manufacturer_Desc"
F 9 "YAGEO_RMS1" H 12400 6925 50  0001 C CNN "Manufacturer2"
F 10 "232270260103" H 12400 6925 50  0001 C CNN "Manufacturer_No2"
F 11 "RESISTOR, METAL GLAZE/THICK FILM, 0.1 W, 5 %, 100 PPM, 10000 OHM, SURFACE MOUNT, 0603" H 12400 6925 50  0001 C CNN "Manufacturer_Desc2"
F 12 "VISHAY_RMS1" H 12400 6925 50  0001 C CNN "Manufacturer3"
F 13 "CRCW060310K0JNEA" H 12400 6925 50  0001 C CNN "Manufacturer_No3"
F 14 "THICK FILM RECTANGULAR CHIP RESISTOR" H 12400 6925 50  0001 C CNN "Manufacturer_Desc3"
F 15 "ASJ" H 12400 6925 50  0001 C CNN "Manufacturer4"
F 16 "CR16-103JL" H 12400 6925 50  0001 C CNN "Manufacturer_No4"
F 17 "THICK FILM CHIP RESISTOR" H 12400 6925 50  0001 C CNN "Manufacturer_Desc4"
F 18 "YAGEO_RMS1" H 12400 6925 50  0001 C CNN "Manufacturer5"
F 19 "RC0603JR-0710KL" H 12400 6925 50  0001 C CNN "Manufacturer_No5"
F 20 "RESISTOR, METAL GLAZE/THICK FILM, 0.1 W, 5 %, 100 PPM, 10000 OHM, SURFACE MOUNT, 0603" H 12400 6925 50  0001 C CNN "Manufacturer_Desc5"
	1    12400 6925
	1    0    0    -1  
$EndComp
$Comp
L cpu-board:R0805 R55
U 1 1 19D405B0
P 12975 6350
AR Path="/19D405B0" Ref="R55"  Part="1" 
AR Path="/5E924756/19D405B0" Ref="R55"  Part="1" 
F 0 "R55" V 12988 6263 64  0000 R TNN
F 1 "100k" V 12963 6100 42  0000 L BNN
F 2 "AllModules:R0603_1" H 12975 6350 50  0001 C CNN
F 3 "" H 12975 6350 50  0001 C CNN
F 4 "RESISTOR,100 K OHM, 0.063W +/-5%" H 12975 6350 50  0001 C CNN "Description"
F 5 "10022732" H 12975 6350 50  0001 C CNN "Item Number"
F 6 "YAGEO_RMS1" H 12975 6350 50  0001 C CNN "Manufacturer"
F 7 "232270260104L" H 12975 6350 50  0001 C CNN "Manufacturer_No"
F 8 "RESISTOR, METAL GLAZE/THICK FILM, 0.1 W, 5 %, 100 PPM, 100000 OHM, SURFACE MOUNT, 0603" H 12975 6350 50  0001 C CNN "Manufacturer_Desc"
F 9 "YAGEO_RMS1" H 12975 6350 50  0001 C CNN "Manufacturer2"
F 10 "232270260104" H 12975 6350 50  0001 C CNN "Manufacturer_No2"
F 11 "RESISTOR, METAL GLAZE/THICK FILM, 0.1 W, 5 %, 100 PPM, 100000 OHM, SURFACE MOUNT, 0603" H 12975 6350 50  0001 C CNN "Manufacturer_Desc2"
F 12 "YAGEO_RMS1" H 12975 6350 50  0001 C CNN "Manufacturer3"
F 13 "RC0603JR-07100KL" H 12975 6350 50  0001 C CNN "Manufacturer_No3"
F 14 "RESISTOR, METAL GLAZE/THICK FILM, 0.1 W, 5 %, 100 PPM, 100000 OHM, SURFACE MOUNT, 0603" H 12975 6350 50  0001 C CNN "Manufacturer_Desc3"
F 15 "PANASONIC_RMS1" H 12975 6350 50  0001 C CNN "Manufacturer4"
F 16 "ERJ3GEYJ104V" H 12975 6350 50  0001 C CNN "Manufacturer_No4"
F 17 "THICK FILM CHIP RESISTOR" H 12975 6350 50  0001 C CNN "Manufacturer_Desc4"
	1    12975 6350
	0    -1   -1   0   
$EndComp
$Comp
L cpu-board:R0805 R56
U 1 1 D165D9D0
P 13900 6925
AR Path="/D165D9D0" Ref="R56"  Part="1" 
AR Path="/5E924756/D165D9D0" Ref="R56"  Part="1" 
F 0 "R56" H 13812 6712 64  0000 L BNN
F 1 "100k" H 13825 6800 42  0000 L BNN
F 2 "AllModules:R0603_1" H 13900 6925 50  0001 C CNN
F 3 "" H 13900 6925 50  0001 C CNN
F 4 "RESISTOR,100 K OHM, 0.063W +/-5%" H 13900 6925 50  0001 C CNN "Description"
F 5 "10022732" H 13900 6925 50  0001 C CNN "Item Number"
F 6 "YAGEO_RMS1" H 13900 6925 50  0001 C CNN "Manufacturer"
F 7 "232270260104L" H 13900 6925 50  0001 C CNN "Manufacturer_No"
F 8 "RESISTOR, METAL GLAZE/THICK FILM, 0.1 W, 5 %, 100 PPM, 100000 OHM, SURFACE MOUNT, 0603" H 13900 6925 50  0001 C CNN "Manufacturer_Desc"
F 9 "YAGEO_RMS1" H 13900 6925 50  0001 C CNN "Manufacturer2"
F 10 "232270260104" H 13900 6925 50  0001 C CNN "Manufacturer_No2"
F 11 "RESISTOR, METAL GLAZE/THICK FILM, 0.1 W, 5 %, 100 PPM, 100000 OHM, SURFACE MOUNT, 0603" H 13900 6925 50  0001 C CNN "Manufacturer_Desc2"
F 12 "YAGEO_RMS1" H 13900 6925 50  0001 C CNN "Manufacturer3"
F 13 "RC0603JR-07100KL" H 13900 6925 50  0001 C CNN "Manufacturer_No3"
F 14 "RESISTOR, METAL GLAZE/THICK FILM, 0.1 W, 5 %, 100 PPM, 100000 OHM, SURFACE MOUNT, 0603" H 13900 6925 50  0001 C CNN "Manufacturer_Desc3"
F 15 "PANASONIC_RMS1" H 13900 6925 50  0001 C CNN "Manufacturer4"
F 16 "ERJ3GEYJ104V" H 13900 6925 50  0001 C CNN "Manufacturer_No4"
F 17 "THICK FILM CHIP RESISTOR" H 13900 6925 50  0001 C CNN "Manufacturer_Desc4"
	1    13900 6925
	-1   0    0    1   
$EndComp
$Comp
L cpu-board:0VANA #U$298
U 1 1 9D64A308
P 12975 6625
AR Path="/9D64A308" Ref="#U$298"  Part="1" 
AR Path="/5E924756/9D64A308" Ref="#U$0298"  Part="1" 
F 0 "#U$0298" H 12975 6625 50  0001 C CNN
F 1 "0VANA" H 12862 6450 59  0000 L BNN
F 2 "" H 12975 6625 50  0001 C CNN
F 3 "" H 12975 6625 50  0001 C CNN
	1    12975 6625
	1    0    0    -1  
$EndComp
$Comp
L cpu-board:GND #U$299
U 1 1 03BA1079
P 11900 7325
AR Path="/03BA1079" Ref="#U$299"  Part="1" 
AR Path="/5E924756/03BA1079" Ref="#U$0299"  Part="1" 
F 0 "#U$0299" H 11900 7325 50  0001 C CNN
F 1 "GND" H 11825 7250 59  0000 L BNN
F 2 "" H 11900 7325 50  0001 C CNN
F 3 "" H 11900 7325 50  0001 C CNN
	1    11900 7325
	1    0    0    -1  
$EndComp
$Comp
L cpu-board:C0805 C39
U 1 1 849D34A1
P 13900 7250
AR Path="/849D34A1" Ref="C39"  Part="1" 
AR Path="/5E924756/849D34A1" Ref="C39"  Part="1" 
F 0 "C39" V 14050 7344 64  0000 R TNN
F 1 "10nF" V 13981 7350 42  0000 R TNN
F 2 "AllModules:C0603_1" H 13900 7250 50  0001 C CNN
F 3 "" H 13900 7250 50  0001 C CNN
F 4 "CAPACITOR CERAMIC,10NF,+/-10%,50V,0603" H 13900 7250 50  0001 C CNN "Description"
F 5 "10022508" H 13900 7250 50  0001 C CNN "Item Number"
F 6 "YAGEO_RMS1" H 13900 7250 50  0001 C CNN "Manufacturer"
F 7 "223858615636" H 13900 7250 50  0001 C CNN "Manufacturer_No"
F 8 "CAPACITOR, CERAMIC, MULTILAYER, 50 V, X7R, 0.01 UF, SURFACE MOUNT, 0603" H 13900 7250 50  0001 C CNN "Manufacturer_Desc"
F 9 "YAGEO_RMS1" H 13900 7250 50  0001 C CNN "Manufacturer2"
F 10 "223858615536" H 13900 7250 50  0001 C CNN "Manufacturer_No2"
F 11 "CAPACITOR, CERAMIC, MULTILAYER, 50 V, X7R, 0.01 UF, SURFACE MOUNT, 0603" H 13900 7250 50  0001 C CNN "Manufacturer_Desc2"
F 12 "KEMET_RMS1" H 13900 7250 50  0001 C CNN "Manufacturer3"
F 13 "C0603C103K5RACTU" H 13900 7250 50  0001 C CNN "Manufacturer_No3"
F 14 "CERAMIC CHIP CAPACITOR" H 13900 7250 50  0001 C CNN "Manufacturer_Desc3"
F 15 "YAGEO_RMS1" H 13900 7250 50  0001 C CNN "Manufacturer4"
F 16 "CC0603KRX7R9BB103" H 13900 7250 50  0001 C CNN "Manufacturer_No4"
F 17 "CAPACITOR, CERAMIC, MULTILAYER, 50 V, X7R, 0.01 UF, SURFACE MOUNT, 0603" H 13900 7250 50  0001 C CNN "Manufacturer_Desc4"
	1    13900 7250
	0    -1   -1   0   
$EndComp
$Comp
L cpu-board:C0805 C43
U 1 1 A25B9E4F
P 12825 6350
AR Path="/A25B9E4F" Ref="C43"  Part="1" 
AR Path="/5E924756/A25B9E4F" Ref="C43"  Part="1" 
F 0 "C43" H 12550 6325 64  0000 L BNN
F 1 "10nF" H 12600 6250 42  0000 L BNN
F 2 "AllModules:C0603_1" H 12825 6350 50  0001 C CNN
F 3 "" H 12825 6350 50  0001 C CNN
F 4 "CAPACITOR CERAMIC,10NF,+/-10%,50V,0603" H 12825 6350 50  0001 C CNN "Description"
F 5 "10022508" H 12825 6350 50  0001 C CNN "Item Number"
F 6 "YAGEO_RMS1" H 12825 6350 50  0001 C CNN "Manufacturer"
F 7 "223858615636" H 12825 6350 50  0001 C CNN "Manufacturer_No"
F 8 "CAPACITOR, CERAMIC, MULTILAYER, 50 V, X7R, 0.01 UF, SURFACE MOUNT, 0603" H 12825 6350 50  0001 C CNN "Manufacturer_Desc"
F 9 "YAGEO_RMS1" H 12825 6350 50  0001 C CNN "Manufacturer2"
F 10 "223858615536" H 12825 6350 50  0001 C CNN "Manufacturer_No2"
F 11 "CAPACITOR, CERAMIC, MULTILAYER, 50 V, X7R, 0.01 UF, SURFACE MOUNT, 0603" H 12825 6350 50  0001 C CNN "Manufacturer_Desc2"
F 12 "KEMET_RMS1" H 12825 6350 50  0001 C CNN "Manufacturer3"
F 13 "C0603C103K5RACTU" H 12825 6350 50  0001 C CNN "Manufacturer_No3"
F 14 "CERAMIC CHIP CAPACITOR" H 12825 6350 50  0001 C CNN "Manufacturer_Desc3"
F 15 "YAGEO_RMS1" H 12825 6350 50  0001 C CNN "Manufacturer4"
F 16 "CC0603KRX7R9BB103" H 12825 6350 50  0001 C CNN "Manufacturer_No4"
F 17 "CAPACITOR, CERAMIC, MULTILAYER, 50 V, X7R, 0.01 UF, SURFACE MOUNT, 0603" H 12825 6350 50  0001 C CNN "Manufacturer_Desc4"
	1    12825 6350
	1    0    0    -1  
$EndComp
$Comp
L cpu-board:C0805 C45
U 1 1 72A1248A
P 14525 6775
AR Path="/72A1248A" Ref="C45"  Part="1" 
AR Path="/5E924756/72A1248A" Ref="C45"  Part="1" 
F 0 "C45" H 14625 6800 64  0000 L BNN
F 1 "10nF" H 14650 6725 42  0000 L BNN
F 2 "AllModules:C0603_1" H 14525 6775 50  0001 C CNN
F 3 "" H 14525 6775 50  0001 C CNN
F 4 "CAPACITOR CERAMIC,10NF,+/-10%,50V,0603" H 14525 6775 50  0001 C CNN "Description"
F 5 "10022508" H 14525 6775 50  0001 C CNN "Item Number"
F 6 "YAGEO_RMS1" H 14525 6775 50  0001 C CNN "Manufacturer"
F 7 "223858615636" H 14525 6775 50  0001 C CNN "Manufacturer_No"
F 8 "CAPACITOR, CERAMIC, MULTILAYER, 50 V, X7R, 0.01 UF, SURFACE MOUNT, 0603" H 14525 6775 50  0001 C CNN "Manufacturer_Desc"
F 9 "YAGEO_RMS1" H 14525 6775 50  0001 C CNN "Manufacturer2"
F 10 "223858615536" H 14525 6775 50  0001 C CNN "Manufacturer_No2"
F 11 "CAPACITOR, CERAMIC, MULTILAYER, 50 V, X7R, 0.01 UF, SURFACE MOUNT, 0603" H 14525 6775 50  0001 C CNN "Manufacturer_Desc2"
F 12 "KEMET_RMS1" H 14525 6775 50  0001 C CNN "Manufacturer3"
F 13 "C0603C103K5RACTU" H 14525 6775 50  0001 C CNN "Manufacturer_No3"
F 14 "CERAMIC CHIP CAPACITOR" H 14525 6775 50  0001 C CNN "Manufacturer_Desc3"
F 15 "YAGEO_RMS1" H 14525 6775 50  0001 C CNN "Manufacturer4"
F 16 "CC0603KRX7R9BB103" H 14525 6775 50  0001 C CNN "Manufacturer_No4"
F 17 "CAPACITOR, CERAMIC, MULTILAYER, 50 V, X7R, 0.01 UF, SURFACE MOUNT, 0603" H 14525 6775 50  0001 C CNN "Manufacturer_Desc4"
	1    14525 6775
	1    0    0    -1  
$EndComp
$Comp
L cpu-board:0VANA #U$324
U 1 1 CBB6799F
P 14525 7275
AR Path="/CBB6799F" Ref="#U$324"  Part="1" 
AR Path="/5E924756/CBB6799F" Ref="#U$0324"  Part="1" 
F 0 "#U$0324" H 14525 7275 50  0001 C CNN
F 1 "0VANA" H 14425 7100 59  0000 L BNN
F 2 "" H 14525 7275 50  0001 C CNN
F 3 "" H 14525 7275 50  0001 C CNN
	1    14525 7275
	1    0    0    -1  
$EndComp
$Comp
L cpu-board:R0805 R52
U 1 1 9AA44C7C
P 11900 6500
AR Path="/9AA44C7C" Ref="R52"  Part="1" 
AR Path="/5E924756/9AA44C7C" Ref="R52"  Part="1" 
F 0 "R52" V 11900 6750 64  0000 R TNN
F 1 "10" V 11825 6750 42  0000 R TNN
F 2 "AllModules:R0805_1" H 11900 6500 50  0001 C CNN
F 3 "" H 11900 6500 50  0001 C CNN
F 4 "RESISTOR 10 OHM, 0.125W, +/-5%,0805" H 11900 6500 50  0001 C CNN "Description"
F 5 "10023242" H 11900 6500 50  0001 C CNN "Item Number"
F 6 "YAGEO_RMS1" H 11900 6500 50  0001 C CNN "Manufacturer"
F 7 "RC0805JR-0710RL" H 11900 6500 50  0001 C CNN "Manufacturer_No"
F 8 "RESISTOR, METAL GLAZE/THICK FILM, 0.125 W, 5 %, 200 PPM, 10 OHM, SURFACE MOUNT, 0805" H 11900 6500 50  0001 C CNN "Manufacturer_Desc"
F 9 "KOA SPEER" H 11900 6500 50  0001 C CNN "Manufacturer2"
F 10 "RK73B2ATTD100J" H 11900 6500 50  0001 C CNN "Manufacturer_No2"
F 11 "THICK FILM CHIP RESISTOR" H 11900 6500 50  0001 C CNN "Manufacturer_Desc2"
F 12 "YAGEO_RMS1" H 11900 6500 50  0001 C CNN "Manufacturer3"
F 13 "232273061109L" H 11900 6500 50  0001 C CNN "Manufacturer_No3"
F 14 "RESISTOR, METAL GLAZE/THICK FILM, 0.125 W, 5 %, 200 PPM, 10 OHM, SURFACE MOUNT, 0805" H 11900 6500 50  0001 C CNN "Manufacturer_Desc3"
F 15 "YAGEO_RMS1" H 11900 6500 50  0001 C CNN "Manufacturer4"
F 16 "232273061109" H 11900 6500 50  0001 C CNN "Manufacturer_No4"
F 17 "RESISTOR, METAL GLAZE/THICK FILM, 0.125 W, 5 %, 200 PPM, 10 OHM, SURFACE MOUNT, 0805" H 11900 6500 50  0001 C CNN "Manufacturer_Desc4"
	1    11900 6500
	0    -1   -1   0   
$EndComp
$Comp
L cpu-board:R0805 R57
U 1 1 E37BEEA0
P 6625 3925
AR Path="/E37BEEA0" Ref="R57"  Part="1" 
AR Path="/5E924756/E37BEEA0" Ref="R57"  Part="1" 
F 0 "R57" H 6550 4075 64  0000 L BNN
F 1 "1.37k" H 6537 4050 42  0000 L TNN
F 2 "AllModules:R0603_1" H 6625 3925 50  0001 C CNN
F 3 "" H 6625 3925 50  0001 C CNN
F 4 "RESISTOR,1.37K OHM,0.063W,+/-0.1%,0603" H 6625 3925 50  0001 C CNN "Description"
F 5 "10097270" H 6625 3925 50  0001 C CNN "Item Number"
F 6 "SUSUMU CO." H 6625 3925 50  0001 C CNN "Manufacturer"
F 7 "RG1608P-1371-B-T5" H 6625 3925 50  0001 C CNN "Manufacturer_No"
F 8 "" H 6625 3925 50  0001 C CNN "Manufacturer_Desc"
F 9 "TYCO ELECTRONICS" H 6625 3925 50  0001 C CNN "Manufacturer2"
F 10 "3-1879219-4" H 6625 3925 50  0001 C CNN "Manufacturer_No2"
F 11 "THIN FILM PRECISION CHIP RESISTOR" H 6625 3925 50  0001 C CNN "Manufacturer_Desc2"
F 12 "TYCO ELECTRONICS" H 6625 3925 50  0001 C CNN "Manufacturer3"
F 13 "CPF0603B-1K37E" H 6625 3925 50  0001 C CNN "Manufacturer_No3"
F 14 "THIN FILM PRECISION CHIP RESISTOR" H 6625 3925 50  0001 C CNN "Manufacturer_Desc3"
F 15 "VISHAY_RMS1" H 6625 3925 50  0001 C CNN "Manufacturer4"
F 16 "TNPW06031K37BEEA" H 6625 3925 50  0001 C CNN "Manufacturer_No4"
F 17 "PRECISION CHIP RESISTOR" H 6625 3925 50  0001 C CNN "Manufacturer_Desc4"
F 18 "WELWYN" H 6625 3925 50  0001 C CNN "Manufacturer5"
F 19 "PCF0603R-1K37BI" H 6625 3925 50  0001 C CNN "Manufacturer_No5"
F 20 "PRECISION SURFACE MOUNT RESISTOR" H 6625 3925 50  0001 C CNN "Manufacturer_Desc5"
	1    6625 3925
	1    0    0    -1  
$EndComp
$Comp
L cpu-board:R0805 R58
U 1 1 699A423E
P 7350 3725
AR Path="/699A423E" Ref="R58"  Part="1" 
AR Path="/5E924756/699A423E" Ref="R58"  Part="1" 
F 0 "R58" H 7250 3875 64  0000 L BNN
F 1 "100k" H 7263 3800 42  0000 L BNN
F 2 "AllModules:R0603_1" H 7350 3725 50  0001 C CNN
F 3 "" H 7350 3725 50  0001 C CNN
F 4 "RESISTOR, 100K OHM, 0.063W,+/-0.1%,0603" H 7350 3725 50  0001 C CNN "Description"
F 5 "10097271" H 7350 3725 50  0001 C CNN "Item Number"
F 6 "SUSUMU CO." H 7350 3725 50  0001 C CNN "Manufacturer"
F 7 "RG1608P-104-B-T5" H 7350 3725 50  0001 C CNN "Manufacturer_No"
F 8 "RES SMD 100K OHM 0.1% 1/10W 0603" H 7350 3725 50  0001 C CNN "Manufacturer_Desc"
F 9 "WELWYN" H 7350 3725 50  0001 C CNN "Manufacturer2"
F 10 "PCF0603R-100KBI" H 7350 3725 50  0001 C CNN "Manufacturer_No2"
F 11 "LOW VALUE FLAT CHIP RESISTOR" H 7350 3725 50  0001 C CNN "Manufacturer_Desc2"
F 12 "YAGEO_RMS1" H 7350 3725 50  0001 C CNN "Manufacturer3"
F 13 "RT0603BRD07100KL" H 7350 3725 50  0001 C CNN "Manufacturer_No3"
F 14 "RESISTOR, THIN FILM, 0.1 W, 0.1 %, 25 PPM, 100000 OHM, SURFACE MOUNT, 0603" H 7350 3725 50  0001 C CNN "Manufacturer_Desc3"
	1    7350 3725
	1    0    0    -1  
$EndComp
$Comp
L cpu-board:C0805 C53
U 1 1 EE013C0B
P 6375 3250
AR Path="/EE013C0B" Ref="C53"  Part="1" 
AR Path="/5E924756/EE013C0B" Ref="C53"  Part="1" 
F 0 "C53" H 6475 3250 64  0000 L BNN
F 1 "10nF" H 6475 3175 42  0000 L BNN
F 2 "AllModules:C0603_1" H 6375 3250 50  0001 C CNN
F 3 "" H 6375 3250 50  0001 C CNN
F 4 "CAPACITOR CERAMIC,10NF,+/-10%,50V,0603" H 6375 3250 50  0001 C CNN "Description"
F 5 "10022508" H 6375 3250 50  0001 C CNN "Item Number"
F 6 "YAGEO_RMS1" H 6375 3250 50  0001 C CNN "Manufacturer"
F 7 "223858615636" H 6375 3250 50  0001 C CNN "Manufacturer_No"
F 8 "CAPACITOR, CERAMIC, MULTILAYER, 50 V, X7R, 0.01 UF, SURFACE MOUNT, 0603" H 6375 3250 50  0001 C CNN "Manufacturer_Desc"
F 9 "YAGEO_RMS1" H 6375 3250 50  0001 C CNN "Manufacturer2"
F 10 "223858615536" H 6375 3250 50  0001 C CNN "Manufacturer_No2"
F 11 "CAPACITOR, CERAMIC, MULTILAYER, 50 V, X7R, 0.01 UF, SURFACE MOUNT, 0603" H 6375 3250 50  0001 C CNN "Manufacturer_Desc2"
F 12 "KEMET_RMS1" H 6375 3250 50  0001 C CNN "Manufacturer3"
F 13 "C0603C103K5RACTU" H 6375 3250 50  0001 C CNN "Manufacturer_No3"
F 14 "CERAMIC CHIP CAPACITOR" H 6375 3250 50  0001 C CNN "Manufacturer_Desc3"
F 15 "YAGEO_RMS1" H 6375 3250 50  0001 C CNN "Manufacturer4"
F 16 "CC0603KRX7R9BB103" H 6375 3250 50  0001 C CNN "Manufacturer_No4"
F 17 "CAPACITOR, CERAMIC, MULTILAYER, 50 V, X7R, 0.01 UF, SURFACE MOUNT, 0603" H 6375 3250 50  0001 C CNN "Manufacturer_Desc4"
	1    6375 3250
	1    0    0    -1  
$EndComp
$Comp
L cpu-board:C0805 C54
U 1 1 B2D23927
P 7350 3925
AR Path="/B2D23927" Ref="C54"  Part="1" 
AR Path="/5E924756/B2D23927" Ref="C54"  Part="1" 
F 0 "C54" V 7437 4043 64  0000 R TNN
F 1 "1uF" V 7531 3987 42  0000 R TNN
F 2 "AllModules:C0805_1" H 7350 3925 50  0001 C CNN
F 3 "" H 7350 3925 50  0001 C CNN
F 4 "CAPACITOR CERAMIC,1UF,16V,+/-10%, 0805" H 7350 3925 50  0001 C CNN "Description"
F 5 "10022967" H 7350 3925 50  0001 C CNN "Item Number"
F 6 "KEMET_RMS1" H 7350 3925 50  0001 C CNN "Manufacturer"
F 7 "C0805C105Z4VACTU" H 7350 3925 50  0001 C CNN "Manufacturer_No"
F 8 "CERAMIC CHIP CAPACITOR" H 7350 3925 50  0001 C CNN "Manufacturer_Desc"
F 9 "KEMET_RMS1" H 7350 3925 50  0001 C CNN "Manufacturer2"
F 10 "C0805C105Z4VAC" H 7350 3925 50  0001 C CNN "Manufacturer_No2"
F 11 "CERAMIC SURFACE MOUNT" H 7350 3925 50  0001 C CNN "Manufacturer_Desc2"
F 12 "YAGEO_RMS1" H 7350 3925 50  0001 C CNN "Manufacturer3"
F 13 "CC0805ZRY5V7BB105" H 7350 3925 50  0001 C CNN "Manufacturer_No3"
F 14 "CAPACITOR, CERAMIC, MULTILAYER, 16 V, Y5V, 1 UF, SURFACE MOUNT, 0805" H 7350 3925 50  0001 C CNN "Manufacturer_Desc3"
F 15 "MURATA_RMS1" H 7350 3925 50  0001 C CNN "Manufacturer4"
F 16 "GRM216B31C105KA87D" H 7350 3925 50  0001 C CNN "Manufacturer_No4"
F 17 "MONOLITHIC CERAMIC CAPACITOR" H 7350 3925 50  0001 C CNN "Manufacturer_Desc4"
	1    7350 3925
	0    1    1    0   
$EndComp
$Comp
L cpu-board:C0805 C78
U 1 1 7765160B
P 7600 2200
AR Path="/7765160B" Ref="C78"  Part="1" 
AR Path="/5E924756/7765160B" Ref="C78"  Part="1" 
F 0 "C78" V 7750 2281 64  0000 R TNN
F 1 "100nF" V 7681 2287 42  0000 R TNN
F 2 "AllModules:C0402_1" H 7600 2200 50  0001 C CNN
F 3 "" H 7600 2200 50  0001 C CNN
F 4 "CAPACITOR,100NF,16V,+/-10%,X7R,0402" H 7600 2200 50  0001 C CNN "Description"
F 5 "10022607" H 7600 2200 50  0001 C CNN "Item Number"
F 6 "MURATA" H 7600 2200 50  0001 C CNN "Manufacturer"
F 7 "GRM155R71C104JA88J" H 7600 2200 50  0001 C CNN "Manufacturer_No"
F 8 "CAPACITOR, CERAMIC, MULTILAYER, 16V, X7R, 0.1UF, 0402" H 7600 2200 50  0001 C CNN "Manufacturer_Desc"
F 9 "YAGEO_RMS1" H 7600 2200 50  0001 C CNN "Manufacturer2"
F 10 "CC0402KRX7R7BB104" H 7600 2200 50  0001 C CNN "Manufacturer_No2"
F 11 "CAP CER 0.1uF 16V X7R 10% 0402" H 7600 2200 50  0001 C CNN "Manufacturer_Desc2"
F 12 "YAGEO_RMS1" H 7600 2200 50  0001 C CNN "Manufacturer3"
F 13 "223878715649" H 7600 2200 50  0001 C CNN "Manufacturer_No3"
F 14 "CAPACITOR, CERAMIC, MULTILAYER, 16 V, X7R, 0.1 UF, SURFACE MOUNT, 0402" H 7600 2200 50  0001 C CNN "Manufacturer_Desc3"
F 15 "MURATA MANUFACTURING CO., LTD." H 7600 2200 50  0001 C CNN "Manufacturer4"
F 16 "GRM155R71C104KA88D" H 7600 2200 50  0001 C CNN "Manufacturer_No4"
F 17 "MONOLITHIC CERAMIC CAPACITOR" H 7600 2200 50  0001 C CNN "Manufacturer_Desc4"
	1    7600 2200
	0    -1   -1   0   
$EndComp
$Comp
L cpu-board:+5V #U$327
U 1 1 36B5ECB2
P 7325 1975
AR Path="/36B5ECB2" Ref="#U$327"  Part="1" 
AR Path="/5E924756/36B5ECB2" Ref="#U$0327"  Part="1" 
F 0 "#U$0327" H 7325 1975 50  0001 C CNN
F 1 "+5V" H 7250 1900 59  0000 L BNN
F 2 "" H 7325 1975 50  0001 C CNN
F 3 "" H 7325 1975 50  0001 C CNN
	1    7325 1975
	-1   0    0    1   
$EndComp
$Comp
L cpu-board:C0805 C84
U 1 1 86B4EA67
P 8050 3025
AR Path="/86B4EA67" Ref="C84"  Part="1" 
AR Path="/5E924756/86B4EA67" Ref="C84"  Part="1" 
F 0 "C84" H 8125 3025 64  0000 L BNN
F 1 "1nF" H 8150 2950 42  0000 L BNN
F 2 "AllModules:C0402_1" H 8050 3025 50  0001 C CNN
F 3 "" H 8050 3025 50  0001 C CNN
F 4 "CAPACITOR CERAMIC, 1NF,50V,+/-10%, 0402" H 8050 3025 50  0001 C CNN "Description"
F 5 "10022971" H 8050 3025 50  0001 C CNN "Item Number"
F 6 "YAGEO_RMS1" H 8050 3025 50  0001 C CNN "Manufacturer"
F 7 "CC0402KRX7R9BB102*" H 8050 3025 50  0001 C CNN "Manufacturer_No"
F 8 "CAPACITOR, CERAMIC, MULTILAYER, 50 V, X7R, 0.001 UF, SURFACE MOUNT, 0402" H 8050 3025 50  0001 C CNN "Manufacturer_Desc"
F 9 "YAGEO_RMS1" H 8050 3025 50  0001 C CNN "Manufacturer2"
F 10 "223858715623" H 8050 3025 50  0001 C CNN "Manufacturer_No2"
F 11 "CAPACITOR, CERAMIC, MULTILAYER, 50 V, X7R, 0.001 UF, SURFACE MOUNT, 0402" H 8050 3025 50  0001 C CNN "Manufacturer_Desc2"
F 12 "KEMET_RMS1" H 8050 3025 50  0001 C CNN "Manufacturer3"
F 13 "C0402C102K5RACTU" H 8050 3025 50  0001 C CNN "Manufacturer_No3"
F 14 "CAP, CER, 0.001UF, 50V, 10%, X7R, 0402" H 8050 3025 50  0001 C CNN "Manufacturer_Desc3"
F 15 "YAGEO_RMS1" H 8050 3025 50  0001 C CNN "Manufacturer4"
F 16 "223858715523" H 8050 3025 50  0001 C CNN "Manufacturer_No4"
F 17 "CAPACITOR, CERAMIC, MULTILAYER, 50 V, X7R, 0.001 UF, SURFACE MOUNT, 0402" H 8050 3025 50  0001 C CNN "Manufacturer_Desc4"
	1    8050 3025
	1    0    0    -1  
$EndComp
$Comp
L cpu-board:0VANA #U$334
U 1 1 03007719
P 8050 3225
AR Path="/03007719" Ref="#U$334"  Part="1" 
AR Path="/5E924756/03007719" Ref="#U$0334"  Part="1" 
F 0 "#U$0334" H 8050 3225 50  0001 C CNN
F 1 "0VANA" H 7950 3050 59  0000 L BNN
F 2 "" H 8050 3225 50  0001 C CNN
F 3 "" H 8050 3225 50  0001 C CNN
	1    8050 3225
	1    0    0    -1  
$EndComp
$Comp
L cpu-board:0VANA #U$335
U 1 1 0B15C6BC
P 6375 4025
AR Path="/0B15C6BC" Ref="#U$335"  Part="1" 
AR Path="/5E924756/0B15C6BC" Ref="#U$0335"  Part="1" 
F 0 "#U$0335" H 6375 4025 50  0001 C CNN
F 1 "0VANA" H 6263 3850 59  0000 L BNN
F 2 "" H 6375 4025 50  0001 C CNN
F 3 "" H 6375 4025 50  0001 C CNN
	1    6375 4025
	1    0    0    -1  
$EndComp
$Comp
L cpu-board:0VANA #U$341
U 1 1 860440EB
P 7325 3200
AR Path="/860440EB" Ref="#U$341"  Part="1" 
AR Path="/5E924756/860440EB" Ref="#U$0341"  Part="1" 
F 0 "#U$0341" H 7325 3200 50  0001 C CNN
F 1 "0VANA" H 7225 3025 59  0000 L BNN
F 2 "" H 7325 3200 50  0001 C CNN
F 3 "" H 7325 3200 50  0001 C CNN
	1    7325 3200
	1    0    0    -1  
$EndComp
$Comp
L cpu-board:0VANA #U$342
U 1 1 C1C3A0AE
P 7925 2200
AR Path="/C1C3A0AE" Ref="#U$342"  Part="1" 
AR Path="/5E924756/C1C3A0AE" Ref="#U$0342"  Part="1" 
F 0 "#U$0342" H 7925 2200 50  0001 C CNN
F 1 "0VANA" H 7800 2025 59  0000 L BNN
F 2 "" H 7925 2200 50  0001 C CNN
F 3 "" H 7925 2200 50  0001 C CNN
	1    7925 2200
	0    -1   -1   0   
$EndComp
$Comp
L cpu-board:LM358 IC11
U 3 1 D9B46218
P 7325 2700
AR Path="/D9B46218" Ref="IC11"  Part="3" 
AR Path="/5E924756/D9B46218" Ref="IC11"  Part="3" 
F 0 "IC11" H 7525 2950 73  0001 L BNN
F 1 "OP295" H 7675 2850 73  0001 L BNN
F 2 "AllModules:MX.A8_COMPOSANT_1" H 7325 2700 50  0001 C CNN
F 3 "" H 7325 2700 50  0001 C CNN
F 4 "DOUBLE AMPLIFIER RAIL TO RAIL, SO8" H 7325 2700 50  0001 C CNN "Description"
F 5 "10022969" H 7325 2700 50  0001 C CNN "Item Number"
F 6 "ANALOG DEVICES, INC." H 7325 2700 50  0001 C CNN "Manufacturer"
F 7 "OP295GSZ-REEL7" H 7325 2700 50  0001 C CNN "Manufacturer_No"
F 8 "IC OPAMP GP R-R 85KHZ DUAL 8SOIC" H 7325 2700 50  0001 C CNN "Manufacturer_Desc"
F 9 "ANALOG DEVICES, INC." H 7325 2700 50  0001 C CNN "Manufacturer2"
F 10 "OP295GSZ" H 7325 2700 50  0001 C CNN "Manufacturer_No2"
F 11 "IC OPAMP DUAL RAIL-RAIL 8SOIC" H 7325 2700 50  0001 C CNN "Manufacturer_Desc2"
	3    7325 2700
	1    0    0    -1  
$EndComp
$Comp
L cpu-board:R0805 R59
U 1 1 C270A6BB
P 6175 3275
AR Path="/C270A6BB" Ref="R59"  Part="1" 
AR Path="/5E924756/C270A6BB" Ref="R59"  Part="1" 
F 0 "R59" V 6263 3363 64  0000 L BNN
F 1 "100k" V 6125 3375 42  0000 L TNN
F 2 "AllModules:R0603_1" H 6175 3275 50  0001 C CNN
F 3 "" H 6175 3275 50  0001 C CNN
F 4 "RESISTOR,100 K OHM, 0.063W +/-5%" H 6175 3275 50  0001 C CNN "Description"
F 5 "10022732" H 6175 3275 50  0001 C CNN "Item Number"
F 6 "YAGEO_RMS1" H 6175 3275 50  0001 C CNN "Manufacturer"
F 7 "232270260104L" H 6175 3275 50  0001 C CNN "Manufacturer_No"
F 8 "RESISTOR, METAL GLAZE/THICK FILM, 0.1 W, 5 %, 100 PPM, 100000 OHM, SURFACE MOUNT, 0603" H 6175 3275 50  0001 C CNN "Manufacturer_Desc"
F 9 "YAGEO_RMS1" H 6175 3275 50  0001 C CNN "Manufacturer2"
F 10 "232270260104" H 6175 3275 50  0001 C CNN "Manufacturer_No2"
F 11 "RESISTOR, METAL GLAZE/THICK FILM, 0.1 W, 5 %, 100 PPM, 100000 OHM, SURFACE MOUNT, 0603" H 6175 3275 50  0001 C CNN "Manufacturer_Desc2"
F 12 "YAGEO_RMS1" H 6175 3275 50  0001 C CNN "Manufacturer3"
F 13 "RC0603JR-07100KL" H 6175 3275 50  0001 C CNN "Manufacturer_No3"
F 14 "RESISTOR, METAL GLAZE/THICK FILM, 0.1 W, 5 %, 100 PPM, 100000 OHM, SURFACE MOUNT, 0603" H 6175 3275 50  0001 C CNN "Manufacturer_Desc3"
F 15 "PANASONIC_RMS1" H 6175 3275 50  0001 C CNN "Manufacturer4"
F 16 "ERJ3GEYJ104V" H 6175 3275 50  0001 C CNN "Manufacturer_No4"
F 17 "THICK FILM CHIP RESISTOR" H 6175 3275 50  0001 C CNN "Manufacturer_Desc4"
	1    6175 3275
	0    -1   -1   0   
$EndComp
$Comp
L cpu-board:GND #U$344
U 1 1 B42825EF
P 13575 3700
AR Path="/B42825EF" Ref="#U$344"  Part="1" 
AR Path="/5E924756/B42825EF" Ref="#U$0344"  Part="1" 
F 0 "#U$0344" H 13575 3700 50  0001 C CNN
F 1 "GND" H 13500 3625 59  0000 L BNN
F 2 "" H 13575 3700 50  0001 C CNN
F 3 "" H 13575 3700 50  0001 C CNN
	1    13575 3700
	1    0    0    -1  
$EndComp
$Comp
L cpu-board:MTD3055 T14
U 1 1 B63BD651
P 11025 3225
AR Path="/B63BD651" Ref="T14"  Part="1" 
AR Path="/5E924756/B63BD651" Ref="T14"  Part="1" 
F 0 "T14" H 11165 3312 64  0000 L BNN
F 1 "2N7002" H 11178 3242 42  0000 L BNN
F 2 "AllModules:SOT23-GSD_1" H 11025 3225 50  0001 C CNN
F 3 "" H 11025 3225 50  0001 C CNN
F 4 "TRANSISTOR MOSFET N CHANNEL 60V, 0.18A" H 11025 3225 50  0001 C CNN "Description"
F 5 "10097274" H 11025 3225 50  0001 C CNN "Item Number"
F 6 "ON SEMICONDUCTOR_RMS1" H 11025 3225 50  0001 C CNN "Manufacturer"
F 7 "2N7002LT1G" H 11025 3225 50  0001 C CNN "Manufacturer_No"
F 8 "SMALL SIGNAL MOSFET" H 11025 3225 50  0001 C CNN "Manufacturer_Desc"
F 9 "NXP SEMICONDUCTORS_RMS1" H 11025 3225 50  0001 C CNN "Manufacturer2"
F 10 "2N7002,215" H 11025 3225 50  0001 C CNN "Manufacturer_No2"
F 11 "" H 11025 3225 50  0001 C CNN "Manufacturer_Desc2"
F 12 "NXP SEMICONDUCTORS_RMS1" H 11025 3225 50  0001 C CNN "Manufacturer3"
F 13 "2N7002" H 11025 3225 50  0001 C CNN "Manufacturer_No3"
F 14 "N-CHANNEL TRENCHMOS FET" H 11025 3225 50  0001 C CNN "Manufacturer_Desc3"
	1    11025 3225
	1    0    0    -1  
$EndComp
$Comp
L cpu-board:+24V #U$222
U 1 1 D3678DB3
P 11075 2075
AR Path="/D3678DB3" Ref="#U$222"  Part="1" 
AR Path="/5E924756/D3678DB3" Ref="#U$0222"  Part="1" 
F 0 "#U$0222" H 11075 2075 50  0001 C CNN
F 1 "+24V" H 10963 1938 59  0000 L BNN
F 2 "" H 11075 2075 50  0001 C CNN
F 3 "" H 11075 2075 50  0001 C CNN
	1    11075 2075
	-1   0    0    1   
$EndComp
$Comp
L cpu-board:F_HMB BUZ1
U 1 1 A198C796
P 11175 2750
AR Path="/A198C796" Ref="BUZ1"  Part="1" 
AR Path="/5E924756/A198C796" Ref="BUZ1"  Part="1" 
F 0 "BUZ1" V 11200 2987 59  0000 L BNN
F 1 "HMB12" V 11288 2987 42  0000 L BNN
F 2 "AllModules:HMB12_1" H 11175 2750 50  0001 C CNN
F 3 "" H 11175 2750 50  0001 C CNN
F 4 "BUZZER, 12V, 30MA, 85DB" H 11175 2750 50  0001 C CNN "Description"
F 5 "10023244" H 11175 2750 50  0001 C CNN "Item Number"
F 6 "STAR MICRONICS INC." H 11175 2750 50  0001 C CNN "Manufacturer"
F 7 "HMB-12" H 11175 2750 50  0001 C CNN "Manufacturer_No"
F 8 "MAGNETIC BUZZER" H 11175 2750 50  0001 C CNN "Manufacturer_Desc"
	1    11175 2750
	0    1    1    0   
$EndComp
$Comp
L cpu-board:GND #U$345
U 1 1 7FAE653E
P 11075 3875
AR Path="/7FAE653E" Ref="#U$345"  Part="1" 
AR Path="/5E924756/7FAE653E" Ref="#U$0345"  Part="1" 
F 0 "#U$0345" H 11075 3875 50  0001 C CNN
F 1 "GND" H 11012 3800 59  0000 L BNN
F 2 "" H 11075 3875 50  0001 C CNN
F 3 "" H 11075 3875 50  0001 C CNN
	1    11075 3875
	1    0    0    -1  
$EndComp
$Comp
L cpu-board:R0805 R65
U 1 1 3D749CE4
P 10550 3500
AR Path="/3D749CE4" Ref="R65"  Part="1" 
AR Path="/5E924756/3D749CE4" Ref="R65"  Part="1" 
F 0 "R65" V 10550 3425 64  0000 R TNN
F 1 "100k" V 10487 3425 42  0000 R TNN
F 2 "AllModules:R0603_1" H 10550 3500 50  0001 C CNN
F 3 "" H 10550 3500 50  0001 C CNN
F 4 "RESISTOR,100 K OHM, 0.063W +/-5%" H 10550 3500 50  0001 C CNN "Description"
F 5 "10022732" H 10550 3500 50  0001 C CNN "Item Number"
F 6 "YAGEO_RMS1" H 10550 3500 50  0001 C CNN "Manufacturer"
F 7 "232270260104L" H 10550 3500 50  0001 C CNN "Manufacturer_No"
F 8 "RESISTOR, METAL GLAZE/THICK FILM, 0.1 W, 5 %, 100 PPM, 100000 OHM, SURFACE MOUNT, 0603" H 10550 3500 50  0001 C CNN "Manufacturer_Desc"
F 9 "YAGEO_RMS1" H 10550 3500 50  0001 C CNN "Manufacturer2"
F 10 "232270260104" H 10550 3500 50  0001 C CNN "Manufacturer_No2"
F 11 "RESISTOR, METAL GLAZE/THICK FILM, 0.1 W, 5 %, 100 PPM, 100000 OHM, SURFACE MOUNT, 0603" H 10550 3500 50  0001 C CNN "Manufacturer_Desc2"
F 12 "YAGEO_RMS1" H 10550 3500 50  0001 C CNN "Manufacturer3"
F 13 "RC0603JR-07100KL" H 10550 3500 50  0001 C CNN "Manufacturer_No3"
F 14 "RESISTOR, METAL GLAZE/THICK FILM, 0.1 W, 5 %, 100 PPM, 100000 OHM, SURFACE MOUNT, 0603" H 10550 3500 50  0001 C CNN "Manufacturer_Desc3"
F 15 "PANASONIC_RMS1" H 10550 3500 50  0001 C CNN "Manufacturer4"
F 16 "ERJ3GEYJ104V" H 10550 3500 50  0001 C CNN "Manufacturer_No4"
F 17 "THICK FILM CHIP RESISTOR" H 10550 3500 50  0001 C CNN "Manufacturer_Desc4"
	1    10550 3500
	0    -1   -1   0   
$EndComp
$Comp
L cpu-board:M41T94MQ6E IC31
U 1 1 E249C229
P 7325 6150
AR Path="/E249C229" Ref="IC31"  Part="1" 
AR Path="/5E924756/E249C229" Ref="IC31"  Part="1" 
F 0 "IC31" H 7675 7150 64  0000 L BNN
F 1 "M41T94MQ6E" H 7687 7075 42  0000 L BNN
F 2 "AllModules:MX.A16_COMPOSANT_1" H 7325 6150 50  0001 C CNN
F 3 "" H 7325 6150 50  0001 C CNN
	1    7325 6150
	1    0    0    -1  
$EndComp
$Comp
L cpu-board:GND #U$409
U 1 1 8319BA5C
P 2875 1975
AR Path="/8319BA5C" Ref="#U$409"  Part="1" 
AR Path="/5E924756/8319BA5C" Ref="#U$0409"  Part="1" 
F 0 "#U$0409" H 2875 1975 50  0001 C CNN
F 1 "GND" H 2800 1912 59  0000 L BNN
F 2 "" H 2875 1975 50  0001 C CNN
F 3 "" H 2875 1975 50  0001 C CNN
	1    2875 1975
	1    0    0    1   
$EndComp
$Comp
L cpu-board:C0805 C44
U 1 1 43269358
P 2675 2275
AR Path="/43269358" Ref="C44"  Part="1" 
AR Path="/5E924756/43269358" Ref="C44"  Part="1" 
F 0 "C44" V 2875 2175 64  0000 L BNN
F 1 "100nF" V 2800 2175 42  0000 L BNN
F 2 "AllModules:C0402_1" H 2675 2275 50  0001 C CNN
F 3 "" H 2675 2275 50  0001 C CNN
F 4 "CAPACITOR,100NF,16V,+/-10%,X7R,0402" H 2675 2275 50  0001 C CNN "Description"
F 5 "10022607" H 2675 2275 50  0001 C CNN "Item Number"
F 6 "MURATA" H 2675 2275 50  0001 C CNN "Manufacturer"
F 7 "GRM155R71C104JA88J" H 2675 2275 50  0001 C CNN "Manufacturer_No"
F 8 "CAPACITOR, CERAMIC, MULTILAYER, 16V, X7R, 0.1UF, 0402" H 2675 2275 50  0001 C CNN "Manufacturer_Desc"
F 9 "YAGEO_RMS1" H 2675 2275 50  0001 C CNN "Manufacturer2"
F 10 "CC0402KRX7R7BB104" H 2675 2275 50  0001 C CNN "Manufacturer_No2"
F 11 "CAP CER 0.1uF 16V X7R 10% 0402" H 2675 2275 50  0001 C CNN "Manufacturer_Desc2"
F 12 "YAGEO_RMS1" H 2675 2275 50  0001 C CNN "Manufacturer3"
F 13 "223878715649" H 2675 2275 50  0001 C CNN "Manufacturer_No3"
F 14 "CAPACITOR, CERAMIC, MULTILAYER, 16 V, X7R, 0.1 UF, SURFACE MOUNT, 0402" H 2675 2275 50  0001 C CNN "Manufacturer_Desc3"
F 15 "MURATA MANUFACTURING CO., LTD." H 2675 2275 50  0001 C CNN "Manufacturer4"
F 16 "GRM155R71C104KA88D" H 2675 2275 50  0001 C CNN "Manufacturer_No4"
F 17 "MONOLITHIC CERAMIC CAPACITOR" H 2675 2275 50  0001 C CNN "Manufacturer_Desc4"
	1    2675 2275
	0    1    -1   0   
$EndComp
$Comp
L cpu-board:GND #U$416
U 1 1 D741E609
P 1700 4125
AR Path="/D741E609" Ref="#U$416"  Part="1" 
AR Path="/5E924756/D741E609" Ref="#U$0416"  Part="1" 
F 0 "#U$0416" H 1700 4125 50  0001 C CNN
F 1 "GND" H 1625 4050 59  0000 L BNN
F 2 "" H 1700 4125 50  0001 C CNN
F 3 "" H 1700 4125 50  0001 C CNN
	1    1700 4125
	1    0    0    -1  
$EndComp
$Comp
L cpu-board:R0805 R17
U 1 1 73F99271
P 1700 3325
AR Path="/73F99271" Ref="R17"  Part="1" 
AR Path="/5E924756/73F99271" Ref="R17"  Part="1" 
F 0 "R17" V 1775 3375 64  0000 L BNN
F 1 "15k" V 1675 3350 42  0000 L BNN
F 2 "AllModules:R0603_1" H 1700 3325 50  0001 C CNN
F 3 "" H 1700 3325 50  0001 C CNN
F 4 "RESISTOR, 15K OHM, 0603, +/-1%" H 1700 3325 50  0001 C CNN "Description"
F 5 "10023238" H 1700 3325 50  0001 C CNN "Item Number"
F 6 "ASJ" H 1700 3325 50  0001 C CNN "Manufacturer"
F 7 "CR16153FL" H 1700 3325 50  0001 C CNN "Manufacturer_No"
F 8 "" H 1700 3325 50  0001 C CNN "Manufacturer_Desc"
F 9 "VISHAY_RMS1" H 1700 3325 50  0001 C CNN "Manufacturer2"
F 10 "CRCW060315K0FKEA" H 1700 3325 50  0001 C CNN "Manufacturer_No2"
F 11 "THICK FILM RECTANGULAR CHIP RESISTOR" H 1700 3325 50  0001 C CNN "Manufacturer_Desc2"
F 12 "YAGEO_RMS1" H 1700 3325 50  0001 C CNN "Manufacturer3"
F 13 "232270461503L" H 1700 3325 50  0001 C CNN "Manufacturer_No3"
F 14 "RESISTOR, METAL GLAZE/THICK FILM, 0.1 W, 1 %, 100 PPM, 15000 OHM, SURFACE MOUNT, 0603" H 1700 3325 50  0001 C CNN "Manufacturer_Desc3"
F 15 "YAGEO_RMS1" H 1700 3325 50  0001 C CNN "Manufacturer4"
F 16 "RC0603FR-0715KL" H 1700 3325 50  0001 C CNN "Manufacturer_No4"
F 17 "RESISTOR, METAL GLAZE/THICK FILM, 0.1 W, 1 %, 100 PPM, 15000 OHM, SURFACE MOUNT, 0603" H 1700 3325 50  0001 C CNN "Manufacturer_Desc4"
F 18 "YAGEO_RMS1" H 1700 3325 50  0001 C CNN "Manufacturer5"
F 19 "232270461503" H 1700 3325 50  0001 C CNN "Manufacturer_No5"
F 20 "RESISTOR, METAL GLAZE/THICK FILM, 0.1 W, 1 %, 100 PPM, 15000 OHM, SURFACE MOUNT, 0603" H 1700 3325 50  0001 C CNN "Manufacturer_Desc5"
	1    1700 3325
	0    -1   -1   0   
$EndComp
$Comp
L cpu-board:R0805 R18
U 1 1 2BB405CC
P 1700 3775
AR Path="/2BB405CC" Ref="R18"  Part="1" 
AR Path="/5E924756/2BB405CC" Ref="R18"  Part="1" 
F 0 "R18" V 1775 3838 64  0000 L BNN
F 1 "1.5k" V 1700 3850 42  0000 L BNN
F 2 "AllModules:R0603_1" H 1700 3775 50  0001 C CNN
F 3 "" H 1700 3775 50  0001 C CNN
F 4 "RESISTOR,1.5K OHM,0.063W,+/-1%,0603" H 1700 3775 50  0001 C CNN "Description"
F 5 "10022700" H 1700 3775 50  0001 C CNN "Item Number"
F 6 "YAGEO_RMS1" H 1700 3775 50  0001 C CNN "Manufacturer"
F 7 "232270461502" H 1700 3775 50  0001 C CNN "Manufacturer_No"
F 8 "RESISTOR, METAL GLAZE/THICK FILM, 0.1 W, 1 %, 100 PPM, 1500 OHM, SURFACE MOUNT, 0603" H 1700 3775 50  0001 C CNN "Manufacturer_Desc"
F 9 "YAGEO_RMS1" H 1700 3775 50  0001 C CNN "Manufacturer2"
F 10 "232270461502L" H 1700 3775 50  0001 C CNN "Manufacturer_No2"
F 11 "RESISTOR, METAL GLAZE/THICK FILM, 0.1 W, 1 %, 100 PPM, 1500 OHM, SURFACE MOUNT, 0603" H 1700 3775 50  0001 C CNN "Manufacturer_Desc2"
F 12 "KOA SPEER" H 1700 3775 50  0001 C CNN "Manufacturer3"
F 13 "RK73H1JTTD1501F" H 1700 3775 50  0001 C CNN "Manufacturer_No3"
F 14 "THICK FILM CHIP RESISTOR" H 1700 3775 50  0001 C CNN "Manufacturer_Desc3"
F 15 "YAGEO_RMS1" H 1700 3775 50  0001 C CNN "Manufacturer4"
F 16 "RC0603FR-071K5L" H 1700 3775 50  0001 C CNN "Manufacturer_No4"
F 17 "RESISTOR, METAL GLAZE/THICK FILM, 0.1 W, 1 %, 100 PPM, 1500 OHM, SURFACE MOUNT, 0603" H 1700 3775 50  0001 C CNN "Manufacturer_Desc4"
	1    1700 3775
	0    -1   -1   0   
$EndComp
$Comp
L cpu-board:+24V #U$417
U 1 1 BC8B8B46
P 1700 2975
AR Path="/BC8B8B46" Ref="#U$417"  Part="1" 
AR Path="/5E924756/BC8B8B46" Ref="#U$0417"  Part="1" 
F 0 "#U$0417" H 1700 2975 50  0001 C CNN
F 1 "+24V" H 1588 2838 59  0000 L BNN
F 2 "" H 1700 2975 50  0001 C CNN
F 3 "" H 1700 2975 50  0001 C CNN
	1    1700 2975
	-1   0    0    1   
$EndComp
$Comp
L cpu-board:R0805 R19
U 1 1 9DB3FBAD
P 2625 3725
AR Path="/9DB3FBAD" Ref="R19"  Part="1" 
AR Path="/5E924756/9DB3FBAD" Ref="R19"  Part="1" 
F 0 "R19" H 2550 3575 64  0000 L BNN
F 1 "75k" H 2550 3500 42  0000 L BNN
F 2 "AllModules:R0603_1" H 2625 3725 50  0001 C CNN
F 3 "" H 2625 3725 50  0001 C CNN
F 4 "RESISTOR, 75K OHM, 0603, +/-1%" H 2625 3725 50  0001 C CNN "Description"
F 5 "10023239" H 2625 3725 50  0001 C CNN "Item Number"
F 6 "MULTICOMP                       (920630)" H 2625 3725 50  0001 C CNN "Manufacturer"
F 7 "MC 0.063W 0603 1% 75K" H 2625 3725 50  0001 C CNN "Manufacturer_No"
F 8 "THICK FILM CHIP RESISTOR" H 2625 3725 50  0001 C CNN "Manufacturer_Desc"
	1    2625 3725
	1    0    0    -1  
$EndComp
$Comp
L cpu-board:R0805 R28
U 1 1 29F9BCC2
P 3350 2475
AR Path="/29F9BCC2" Ref="R28"  Part="1" 
AR Path="/5E924756/29F9BCC2" Ref="R28"  Part="1" 
F 0 "R28" V 3362 2388 64  0000 R TNN
F 1 "10k" V 3287 2388 42  0000 R TNN
F 2 "AllModules:R0603_1" H 3350 2475 50  0001 C CNN
F 3 "" H 3350 2475 50  0001 C CNN
F 4 "RESISTOR,10K OHM, 0.063W,+/-5%,0603" H 3350 2475 50  0001 C CNN "Description"
F 5 "10097266" H 3350 2475 50  0001 C CNN "Item Number"
F 6 "YAGEO_RMS1" H 3350 2475 50  0001 C CNN "Manufacturer"
F 7 "232270260103L" H 3350 2475 50  0001 C CNN "Manufacturer_No"
F 8 "RESISTOR, METAL GLAZE/THICK FILM, 0.1 W, 5 %, 100 PPM, 10000 OHM, SURFACE MOUNT, 0603" H 3350 2475 50  0001 C CNN "Manufacturer_Desc"
F 9 "YAGEO_RMS1" H 3350 2475 50  0001 C CNN "Manufacturer2"
F 10 "232270260103" H 3350 2475 50  0001 C CNN "Manufacturer_No2"
F 11 "RESISTOR, METAL GLAZE/THICK FILM, 0.1 W, 5 %, 100 PPM, 10000 OHM, SURFACE MOUNT, 0603" H 3350 2475 50  0001 C CNN "Manufacturer_Desc2"
F 12 "VISHAY_RMS1" H 3350 2475 50  0001 C CNN "Manufacturer3"
F 13 "CRCW060310K0JNEA" H 3350 2475 50  0001 C CNN "Manufacturer_No3"
F 14 "THICK FILM RECTANGULAR CHIP RESISTOR" H 3350 2475 50  0001 C CNN "Manufacturer_Desc3"
F 15 "ASJ" H 3350 2475 50  0001 C CNN "Manufacturer4"
F 16 "CR16-103JL" H 3350 2475 50  0001 C CNN "Manufacturer_No4"
F 17 "THICK FILM CHIP RESISTOR" H 3350 2475 50  0001 C CNN "Manufacturer_Desc4"
F 18 "YAGEO_RMS1" H 3350 2475 50  0001 C CNN "Manufacturer5"
F 19 "RC0603JR-0710KL" H 3350 2475 50  0001 C CNN "Manufacturer_No5"
F 20 "RESISTOR, METAL GLAZE/THICK FILM, 0.1 W, 5 %, 100 PPM, 10000 OHM, SURFACE MOUNT, 0603" H 3350 2475 50  0001 C CNN "Manufacturer_Desc5"
	1    3350 2475
	0    -1   -1   0   
$EndComp
$Comp
L cpu-board:C0805 C49
U 1 1 36DDF578
P 1875 3775
AR Path="/36DDF578" Ref="C49"  Part="1" 
AR Path="/5E924756/36DDF578" Ref="C49"  Part="1" 
F 0 "C49" H 1950 3750 64  0000 L BNN
F 1 "100nF" H 1975 3700 42  0000 L BNN
F 2 "AllModules:C0402_1" H 1875 3775 50  0001 C CNN
F 3 "" H 1875 3775 50  0001 C CNN
F 4 "CAPACITOR,100NF,16V,+/-10%,X7R,0402" H 1875 3775 50  0001 C CNN "Description"
F 5 "10022607" H 1875 3775 50  0001 C CNN "Item Number"
F 6 "MURATA" H 1875 3775 50  0001 C CNN "Manufacturer"
F 7 "GRM155R71C104JA88J" H 1875 3775 50  0001 C CNN "Manufacturer_No"
F 8 "CAPACITOR, CERAMIC, MULTILAYER, 16V, X7R, 0.1UF, 0402" H 1875 3775 50  0001 C CNN "Manufacturer_Desc"
F 9 "YAGEO_RMS1" H 1875 3775 50  0001 C CNN "Manufacturer2"
F 10 "CC0402KRX7R7BB104" H 1875 3775 50  0001 C CNN "Manufacturer_No2"
F 11 "CAP CER 0.1uF 16V X7R 10% 0402" H 1875 3775 50  0001 C CNN "Manufacturer_Desc2"
F 12 "YAGEO_RMS1" H 1875 3775 50  0001 C CNN "Manufacturer3"
F 13 "223878715649" H 1875 3775 50  0001 C CNN "Manufacturer_No3"
F 14 "CAPACITOR, CERAMIC, MULTILAYER, 16 V, X7R, 0.1 UF, SURFACE MOUNT, 0402" H 1875 3775 50  0001 C CNN "Manufacturer_Desc3"
F 15 "MURATA MANUFACTURING CO., LTD." H 1875 3775 50  0001 C CNN "Manufacturer4"
F 16 "GRM155R71C104KA88D" H 1875 3775 50  0001 C CNN "Manufacturer_No4"
F 17 "MONOLITHIC CERAMIC CAPACITOR" H 1875 3775 50  0001 C CNN "Manufacturer_Desc4"
	1    1875 3775
	1    0    0    -1  
$EndComp
$Comp
L cpu-board:C0805 C50
U 1 1 38BC030E
P 3500 3775
AR Path="/38BC030E" Ref="C50"  Part="1" 
AR Path="/5E924756/38BC030E" Ref="C50"  Part="1" 
F 0 "C50" H 3275 3650 64  0000 L BNN
F 1 "10nF" H 3300 3575 42  0000 L BNN
F 2 "AllModules:C0603_1" H 3500 3775 50  0001 C CNN
F 3 "" H 3500 3775 50  0001 C CNN
F 4 "CAPACITOR CERAMIC,10NF,+/-10%,50V,0603" H 3500 3775 50  0001 C CNN "Description"
F 5 "10022508" H 3500 3775 50  0001 C CNN "Item Number"
F 6 "YAGEO_RMS1" H 3500 3775 50  0001 C CNN "Manufacturer"
F 7 "223858615636" H 3500 3775 50  0001 C CNN "Manufacturer_No"
F 8 "CAPACITOR, CERAMIC, MULTILAYER, 50 V, X7R, 0.01 UF, SURFACE MOUNT, 0603" H 3500 3775 50  0001 C CNN "Manufacturer_Desc"
F 9 "YAGEO_RMS1" H 3500 3775 50  0001 C CNN "Manufacturer2"
F 10 "223858615536" H 3500 3775 50  0001 C CNN "Manufacturer_No2"
F 11 "CAPACITOR, CERAMIC, MULTILAYER, 50 V, X7R, 0.01 UF, SURFACE MOUNT, 0603" H 3500 3775 50  0001 C CNN "Manufacturer_Desc2"
F 12 "KEMET_RMS1" H 3500 3775 50  0001 C CNN "Manufacturer3"
F 13 "C0603C103K5RACTU" H 3500 3775 50  0001 C CNN "Manufacturer_No3"
F 14 "CERAMIC CHIP CAPACITOR" H 3500 3775 50  0001 C CNN "Manufacturer_Desc3"
F 15 "YAGEO_RMS1" H 3500 3775 50  0001 C CNN "Manufacturer4"
F 16 "CC0603KRX7R9BB103" H 3500 3775 50  0001 C CNN "Manufacturer_No4"
F 17 "CAPACITOR, CERAMIC, MULTILAYER, 50 V, X7R, 0.01 UF, SURFACE MOUNT, 0603" H 3500 3775 50  0001 C CNN "Manufacturer_Desc4"
	1    3500 3775
	1    0    0    -1  
$EndComp
$Comp
L cpu-board:GND #U$422
U 1 1 3A460F9A
P 3500 4200
AR Path="/3A460F9A" Ref="#U$422"  Part="1" 
AR Path="/5E924756/3A460F9A" Ref="#U$0422"  Part="1" 
F 0 "#U$0422" H 3500 4200 50  0001 C CNN
F 1 "GND" H 3425 4125 59  0000 L BNN
F 2 "" H 3500 4200 50  0001 C CNN
F 3 "" H 3500 4200 50  0001 C CNN
	1    3500 4200
	1    0    0    -1  
$EndComp
$Comp
L cpu-board:IRLML5103 T3
U 1 1 22208D74
P 3750 3350
AR Path="/22208D74" Ref="T3"  Part="1" 
AR Path="/5E924756/22208D74" Ref="T3"  Part="1" 
F 0 "T3" H 3603 3050 59  0000 L BNN
F 1 "BSS84" H 3615 3143 42  0000 L BNN
F 2 "AllModules:SOT23-GSD_1" H 3750 3350 50  0001 C CNN
F 3 "" H 3750 3350 50  0001 C CNN
F 4 "TRANSISTOR, P CHANNEL, 50V, 0.13A,      5 OHM, SOT23" H 3750 3350 50  0001 C CNN "Description"
F 5 "10022157" H 3750 3350 50  0001 C CNN "Item Number"
F 6 "NXP SEMICONDUCTORS_RMS1" H 3750 3350 50  0001 C CNN "Manufacturer"
F 7 "BSS84" H 3750 3350 50  0001 C CNN "Manufacturer_No"
F 8 "MOSFET P CHANNEL" H 3750 3350 50  0001 C CNN "Manufacturer_Desc"
F 9 "ON SEMICONDUCTOR_RMS1" H 3750 3350 50  0001 C CNN "Manufacturer2"
F 10 "BSS84LT1G" H 3750 3350 50  0001 C CNN "Manufacturer_No2"
F 11 "POWER MOSFET" H 3750 3350 50  0001 C CNN "Manufacturer_Desc2"
F 12 "NXP SEMICONDUCTORS_RMS1" H 3750 3350 50  0001 C CNN "Manufacturer3"
F 13 "BSS84,215" H 3750 3350 50  0001 C CNN "Manufacturer_No3"
F 14 "" H 3750 3350 50  0001 C CNN "Manufacturer_Desc3"
	1    3750 3350
	1    0    0    1   
$EndComp
$Comp
L cpu-board:R0805 R29
U 1 1 437CF36C
P 3850 3825
AR Path="/437CF36C" Ref="R29"  Part="1" 
AR Path="/5E924756/437CF36C" Ref="R29"  Part="1" 
F 0 "R29" V 3775 4088 64  0000 R TNN
F 1 "10k" V 3863 4025 42  0000 R TNN
F 2 "AllModules:R0603_1" H 3850 3825 50  0001 C CNN
F 3 "" H 3850 3825 50  0001 C CNN
F 4 "RESISTOR,10K OHM, 0.063W,+/-5%,0603" H 3850 3825 50  0001 C CNN "Description"
F 5 "10097266" H 3850 3825 50  0001 C CNN "Item Number"
F 6 "YAGEO_RMS1" H 3850 3825 50  0001 C CNN "Manufacturer"
F 7 "232270260103L" H 3850 3825 50  0001 C CNN "Manufacturer_No"
F 8 "RESISTOR, METAL GLAZE/THICK FILM, 0.1 W, 5 %, 100 PPM, 10000 OHM, SURFACE MOUNT, 0603" H 3850 3825 50  0001 C CNN "Manufacturer_Desc"
F 9 "YAGEO_RMS1" H 3850 3825 50  0001 C CNN "Manufacturer2"
F 10 "232270260103" H 3850 3825 50  0001 C CNN "Manufacturer_No2"
F 11 "RESISTOR, METAL GLAZE/THICK FILM, 0.1 W, 5 %, 100 PPM, 10000 OHM, SURFACE MOUNT, 0603" H 3850 3825 50  0001 C CNN "Manufacturer_Desc2"
F 12 "VISHAY_RMS1" H 3850 3825 50  0001 C CNN "Manufacturer3"
F 13 "CRCW060310K0JNEA" H 3850 3825 50  0001 C CNN "Manufacturer_No3"
F 14 "THICK FILM RECTANGULAR CHIP RESISTOR" H 3850 3825 50  0001 C CNN "Manufacturer_Desc3"
F 15 "ASJ" H 3850 3825 50  0001 C CNN "Manufacturer4"
F 16 "CR16-103JL" H 3850 3825 50  0001 C CNN "Manufacturer_No4"
F 17 "THICK FILM CHIP RESISTOR" H 3850 3825 50  0001 C CNN "Manufacturer_Desc4"
F 18 "YAGEO_RMS1" H 3850 3825 50  0001 C CNN "Manufacturer5"
F 19 "RC0603JR-0710KL" H 3850 3825 50  0001 C CNN "Manufacturer_No5"
F 20 "RESISTOR, METAL GLAZE/THICK FILM, 0.1 W, 5 %, 100 PPM, 10000 OHM, SURFACE MOUNT, 0603" H 3850 3825 50  0001 C CNN "Manufacturer_Desc5"
	1    3850 3825
	0    1    1    0   
$EndComp
$Comp
L cpu-board:+5V #U$427
U 1 1 9B2D83E4
P 3350 2100
AR Path="/9B2D83E4" Ref="#U$427"  Part="1" 
AR Path="/5E924756/9B2D83E4" Ref="#U$0427"  Part="1" 
F 0 "#U$0427" H 3350 2100 50  0001 C CNN
F 1 "+5V" H 3300 2038 59  0000 L BNN
F 2 "" H 3350 2100 50  0001 C CNN
F 3 "" H 3350 2100 50  0001 C CNN
	1    3350 2100
	1    0    0    1   
$EndComp
$Comp
L cpu-board:+5V #U$428
U 1 1 05DF9F3B
P 2475 1975
AR Path="/05DF9F3B" Ref="#U$428"  Part="1" 
AR Path="/5E924756/05DF9F3B" Ref="#U$0428"  Part="1" 
F 0 "#U$0428" H 2475 1975 50  0001 C CNN
F 1 "+5V" H 2413 1900 59  0000 L BNN
F 2 "" H 2475 1975 50  0001 C CNN
F 3 "" H 2475 1975 50  0001 C CNN
	1    2475 1975
	-1   0    0    1   
$EndComp
$Comp
L cpu-board:+5V #U$429
U 1 1 CEC9B6D3
P 3850 2925
AR Path="/CEC9B6D3" Ref="#U$429"  Part="1" 
AR Path="/5E924756/CEC9B6D3" Ref="#U$0429"  Part="1" 
F 0 "#U$0429" H 3850 2925 50  0001 C CNN
F 1 "+5V" H 3787 2850 59  0000 L BNN
F 2 "" H 3850 2925 50  0001 C CNN
F 3 "" H 3850 2925 50  0001 C CNN
	1    3850 2925
	-1   0    0    1   
$EndComp
$Comp
L cpu-board:BZX84CXX D12
U 1 1 6864D7E9
P 11075 2475
AR Path="/6864D7E9" Ref="D12"  Part="1" 
AR Path="/5E924756/6864D7E9" Ref="D12"  Part="1" 
F 0 "D12" V 11150 2925 59  0000 R TNN
F 1 "BZV55-C12" V 11075 2925 42  0000 R TNN
F 2 "AllModules:SOD80_1" H 11075 2475 50  0001 C CNN
F 3 "" H 11075 2475 50  0001 C CNN
F 4 "DIODE ZENER, 500MW, 12V, SOD-80C" H 11075 2475 50  0001 C CNN "Description"
F 5 "10020994" H 11075 2475 50  0001 C CNN "Item Number"
F 6 "NXP SEMICONDUCTORS_RMS1" H 11075 2475 50  0001 C CNN "Manufacturer"
F 7 "BZV55-C12,115" H 11075 2475 50  0001 C CNN "Manufacturer_No"
F 8 "" H 11075 2475 50  0001 C CNN "Manufacturer_Desc"
F 9 "NXP SEMICONDUCTORS_RMS1" H 11075 2475 50  0001 C CNN "Manufacturer2"
F 10 "BZV55-C12" H 11075 2475 50  0001 C CNN "Manufacturer_No2"
F 11 "VOLTAGE REGULATOR DIODE" H 11075 2475 50  0001 C CNN "Manufacturer_Desc2"
	1    11075 2475
	0    -1   -1   0   
$EndComp
Wire Notes Line
	8898 7523 1373 7523
Wire Notes Line
	1375 4387 8887 4387
Wire Notes Line
	8887 4387 8887 7538
Wire Notes Line
	1375 7525 1375 4387
Wire Notes Line
	8948 1847 11736 1847
Wire Notes Line
	8948 4285 8948 1847
Wire Notes Line
	8948 4285 11736 4285
Wire Notes Line
	11737 4282 11737 1850
Wire Notes Line
	11800 1850 15887 1850
Wire Notes Line
	11800 4288 11800 1850
Wire Notes Line
	11800 4288 15887 4288
Wire Notes Line
	15887 4288 15887 1850
Wire Notes Line
	14525 2250 14575 2250
Wire Notes Line
	14575 2250 14612 2288
Wire Notes Line
	14612 2288 14612 2463
Wire Notes Line
	14612 2463 14650 2500
Wire Notes Line
	14650 2500 14612 2538
Wire Notes Line
	14612 2538 14612 2738
Wire Notes Line
	14612 2738 14575 2775
Wire Notes Line
	14575 2775 14525 2775
Wire Notes Line
	8950 4375 8950 7525
Wire Notes Line
	15900 4375 15900 7525
Wire Notes Line
	8950 7525 15900 7525
Wire Notes Line
	8950 4375 15900 4375
Wire Notes Line
	4837 4288 8877 4288
Wire Notes Line
	4837 4288 4837 1850
Wire Notes Line
	8875 4282 8875 1850
Wire Notes Line
	4787 4288 1375 4288
Wire Notes Line
	1375 4288 1375 1850
Wire Notes Line
	1375 1850 4787 1850
Wire Notes Line
	4787 1850 4787 4288
Text Notes 1427 4542 0    59   ~ 0
CLOCK
Text Notes 9011 1972 0    59   ~ 0
SECURITY BUZZER
Text Notes 11862 1975 0    59   ~ 0
O2 VALVE COMMAND (1)
Text Notes 14675 2538 0    59   ~ 0
To FiO2 VALVE
Text Notes 10312 4525 0    59   ~ 0
VALVE COMMAND
Text Notes 4887 1975 0    59   ~ 0
FIO2
Text Notes 4925 2713 0    59   ~ 0
From FiO2 connector
Text Notes 8475 10638 0    59   ~ 0
A
Text Notes 15937 10763 0    59   ~ 0
05/03/14
Text Notes 16487 10775 0    59   ~ 0
JR
Text Notes 1400 1950 0    59   ~ 0
WATCHDOG
Text Notes 1400 2050 0    59   ~ 0
RESET
Text Notes 1400 2150 0    59   ~ 0
POWER SUPERVISOR
Wire Notes Line
	4837 1850 8877 1850
Wire Wire Line
	1700 3075 1700 3125
Wire Wire Line
	1700 3525 1700 3550
Wire Wire Line
	1700 3975 1700 4000
Wire Wire Line
	1875 3675 1875 3550
Wire Wire Line
	1875 3550 1700 3550
Connection ~ 1700 3550
Wire Wire Line
	1700 3550 1700 3575
Wire Wire Line
	1875 3875 1875 4000
Wire Wire Line
	1875 4000 1700 4000
Connection ~ 1700 4000
Wire Wire Line
	1700 4000 1700 4025
Wire Wire Line
	2025 2675 1925 2675
Connection ~ 1875 3550
Wire Wire Line
	1425 3550 1425 2425
Wire Wire Line
	1425 2425 1675 2425
Wire Wire Line
	1425 3550 1700 3550
Wire Wire Line
	1875 3550 2200 3550
Wire Wire Line
	2200 3550 2200 3725
Wire Wire Line
	2200 3725 2425 3725
Wire Wire Line
	2825 3725 3350 3725
Connection ~ 3500 3300
Wire Wire Line
	3350 2200 3350 2275
Wire Wire Line
	4150 2800 3500 2800
Wire Wire Line
	3500 2800 3500 3300
Wire Wire Line
	3350 2675 4150 2675
Wire Wire Line
	3500 3300 3500 3625
Wire Wire Line
	3850 4075 3500 4075
Wire Wire Line
	3500 4100 3500 4075
Connection ~ 3500 4075
Wire Wire Line
	4150 3625 3850 3625
Wire Wire Line
	3850 3625 3500 3625
Connection ~ 3850 3625
Connection ~ 3500 3625
Wire Wire Line
	3500 3625 3500 3675
NoConn ~ 3225 2850
NoConn ~ 2125 3350
$Comp
L cpu-board:LM358 IC11
U 1 1 D9B46210
P 7375 2700
AR Path="/D9B46210" Ref="IC11"  Part="1" 
AR Path="/5E924756/D9B46210" Ref="IC11"  Part="1" 
F 0 "IC11" H 7425 2950 64  0000 L BNN
F 1 "OP295" H 7450 2863 42  0000 L BNN
F 2 "AllModules:MX.A8_COMPOSANT_1" H 7375 2700 50  0001 C CNN
F 3 "" H 7375 2700 50  0001 C CNN
F 4 "DOUBLE AMPLIFIER RAIL TO RAIL, SO8" H 7325 2700 50  0001 C CNN "Description"
F 5 "10022969" H 7325 2700 50  0001 C CNN "Item Number"
F 6 "ANALOG DEVICES, INC." H 7325 2700 50  0001 C CNN "Manufacturer"
F 7 "OP295GSZ-REEL7" H 7325 2700 50  0001 C CNN "Manufacturer_No"
F 8 "IC OPAMP GP R-R 85KHZ DUAL 8SOIC" H 7325 2700 50  0001 C CNN "Manufacturer_Desc"
F 9 "ANALOG DEVICES, INC." H 7325 2700 50  0001 C CNN "Manufacturer2"
F 10 "OP295GSZ" H 7325 2700 50  0001 C CNN "Manufacturer_No2"
F 11 "IC OPAMP DUAL RAIL-RAIL 8SOIC" H 7325 2700 50  0001 C CNN "Manufacturer_Desc2"
	1    7375 2700
	1    0    0    -1  
$EndComp
Wire Wire Line
	3850 3025 3850 3100
Wire Wire Line
	3850 3625 3850 3600
Wire Wire Line
	3550 3300 3500 3300
Wire Wire Line
	7325 3200 7325 3150
Wire Wire Line
	7325 2250 7325 2200
Wire Wire Line
	5725 2550 6375 2550
Wire Wire Line
	6175 3075 6375 3075
Wire Wire Line
	6375 3075 6375 3150
Wire Wire Line
	6375 3075 6375 2550
Connection ~ 6375 3075
Connection ~ 6375 2550
Wire Wire Line
	6375 2550 6975 2550
Wire Wire Line
	6375 3350 6375 3475
Wire Wire Line
	6425 3925 6375 3925
Connection ~ 6375 3925
Wire Wire Line
	6375 3925 6375 4025
Wire Wire Line
	6175 3475 6375 3475
Connection ~ 6375 3475
Wire Wire Line
	6375 3475 6375 3925
Wire Wire Line
	6825 3925 6900 3925
Wire Wire Line
	6900 3925 6900 3725
Wire Wire Line
	6900 2900 6975 2900
Connection ~ 6900 3925
Wire Wire Line
	7450 3925 7900 3925
Wire Wire Line
	7900 3925 7900 3725
Wire Wire Line
	7900 2700 7825 2700
Wire Wire Line
	7550 3725 7900 3725
Connection ~ 7900 3725
Wire Wire Line
	7900 3725 7900 2700
Wire Wire Line
	7150 3725 6900 3725
Connection ~ 6900 3725
Wire Wire Line
	6900 3725 6900 2900
Wire Wire Line
	6900 3925 7250 3925
Wire Wire Line
	7925 2200 7700 2200
Wire Wire Line
	7500 2200 7325 2200
Connection ~ 7325 2200
Wire Wire Line
	7325 2200 7325 2075
Wire Wire Line
	8150 2700 8050 2700
Connection ~ 7900 2700
Wire Wire Line
	8050 2925 8050 2700
Connection ~ 8050 2700
Wire Wire Line
	8050 2700 7900 2700
Wire Wire Line
	8050 3125 8050 3225
Wire Wire Line
	9650 2750 10050 2750
Wire Wire Line
	10050 2750 10050 2925
Wire Wire Line
	10050 3625 10050 3750
Wire Wire Line
	10050 3750 9675 3750
Wire Wire Line
	11075 3775 11075 3700
Wire Wire Line
	10250 3275 10550 3275
Wire Wire Line
	10550 3300 10550 3275
Connection ~ 10550 3275
Wire Wire Line
	10550 3275 10775 3275
Wire Wire Line
	10550 3700 11075 3700
Connection ~ 11075 3700
Wire Wire Line
	11075 3700 11075 3425
Wire Wire Line
	11075 2950 11075 3025
Wire Wire Line
	11075 2575 11075 2650
Wire Wire Line
	11075 2275 11075 2175
$Comp
L cpu-board:MTD3055 T20
U 1 1 71F1869B
P 13525 2975
AR Path="/71F1869B" Ref="T20"  Part="1" 
AR Path="/5E924756/71F1869B" Ref="T20"  Part="1" 
F 0 "T20" H 13702 2975 64  0000 L BNN
F 1 "BS170F" H 13702 2880 42  0000 L BNN
F 2 "AllModules:SOT23-GSD_1" H 13525 2975 50  0001 C CNN
F 3 "" H 13525 2975 50  0001 C CNN
F 4 "TRANSISTOR, MOSFET, N-CHANNEL, 60V, 0.5A.SOT23" H 13525 2975 50  0001 C CNN "Description"
F 5 "10022956" H 13525 2975 50  0001 C CNN "Item Number"
F 6 "FAIRCHILD SEMICONDUCTOR_RMS1" H 13525 2975 50  0001 C CNN "Manufacturer"
F 7 "MMBF170" H 13525 2975 50  0001 C CNN "Manufacturer_No"
F 8 "MOSFET N-CH 60V 500MA SOT-23" H 13525 2975 50  0001 C CNN "Manufacturer_Desc"
F 9 "DIODES INC_RMS1" H 13525 2975 50  0001 C CNN "Manufacturer2"
F 10 "MMBF170-7-F" H 13525 2975 50  0001 C CNN "Manufacturer_No2"
F 11 "N-CHANNEL MOSFET" H 13525 2975 50  0001 C CNN "Manufacturer_Desc2"
	1    13525 2975
	1    0    0    -1  
$EndComp
Wire Wire Line
	12575 3025 13225 3025
Wire Wire Line
	13225 3125 13225 3025
Connection ~ 13225 3025
Wire Wire Line
	13225 3025 13275 3025
Wire Wire Line
	13225 3525 13575 3525
Wire Wire Line
	13575 3525 13575 3600
Wire Wire Line
	13575 3525 13575 3175
Connection ~ 13575 3525
Wire Wire Line
	13575 2775 13575 2725
Wire Wire Line
	13575 2375 13575 2300
Wire Wire Line
	14200 2300 13575 2300
Connection ~ 13575 2300
Wire Wire Line
	13575 2300 13575 2200
Wire Wire Line
	13975 2725 13575 2725
Connection ~ 13575 2725
Wire Wire Line
	13575 2725 13575 2675
Wire Wire Line
	4075 5625 4300 5625
Wire Wire Line
	4300 5625 4300 5675
Wire Wire Line
	4300 5875 4300 5925
Wire Wire Line
	4300 5925 4075 5925
Wire Wire Line
	4150 6525 4075 6525
Wire Wire Line
	4625 6525 4625 6375
Wire Wire Line
	4625 6375 4525 6375
Wire Wire Line
	4525 6375 4525 6525
Wire Wire Line
	4525 6375 4525 6225
Wire Wire Line
	4525 6225 4675 6225
Connection ~ 4525 6375
Wire Wire Line
	4525 6225 4075 6225
Connection ~ 4525 6225
Wire Wire Line
	2875 4675 2875 4925
Wire Wire Line
	2950 4925 2875 4925
Connection ~ 2875 4925
Wire Wire Line
	2875 4925 2875 5075
Wire Wire Line
	3150 4925 3225 4925
Wire Wire Line
	3225 4925 3225 4650
Wire Wire Line
	3225 5075 3225 4925
Connection ~ 3225 4925
Wire Wire Line
	3825 4925 3825 5075
Wire Wire Line
	2525 6525 2625 6525
Text HLabel 2525 6375 0    70   Output ~ 0
MRST-SPI-0_E
Wire Wire Line
	2525 6075 2625 6075
Wire Wire Line
	2525 6225 2625 6225
Wire Wire Line
	2525 6375 2625 6375
NoConn ~ 2625 5925
NoConn ~ 2625 5775
NoConn ~ 2625 5625
Wire Wire Line
	6425 6350 6525 6350
Wire Wire Line
	6525 6150 6425 6150
Wire Wire Line
	6425 5950 6525 5950
Wire Wire Line
	6525 5750 6375 5750
Wire Wire Line
	6375 5750 6375 5650
Wire Wire Line
	6375 5450 6375 5350
Wire Wire Line
	6375 5350 6525 5350
Wire Wire Line
	7025 5050 7025 4950
Wire Wire Line
	7225 4950 7025 4950
Connection ~ 7025 4950
Wire Wire Line
	7025 4950 7025 4700
Wire Wire Line
	7425 4950 7625 4950
Wire Wire Line
	7625 4950 7625 4725
Wire Wire Line
	7625 4950 7625 5050
Connection ~ 7625 4950
NoConn ~ 6525 6550
NoConn ~ 6525 6750
NoConn ~ 6525 6950
NoConn ~ 6525 7150
NoConn ~ 8025 6050
NoConn ~ 8025 6250
NoConn ~ 8025 6450
Text HLabel 8125 6650 2    56   Output ~ 0
MRST-SPI-0_E
Wire Wire Line
	8125 6650 8025 6650
Wire Wire Line
	8025 6950 8125 6950
$Comp
L cpu-board:LM358 IC11
U 2 1 D9B4621C
P 13875 6275
AR Path="/D9B4621C" Ref="IC11"  Part="2" 
AR Path="/5E924756/D9B4621C" Ref="IC11"  Part="2" 
F 0 "IC11" H 13900 6550 73  0000 L BNN
F 1 "OP295" H 13925 6475 42  0000 L BNN
F 2 "AllModules:MX.A8_COMPOSANT_1" H 13875 6275 50  0001 C CNN
F 3 "" H 13875 6275 50  0001 C CNN
F 4 "DOUBLE AMPLIFIER RAIL TO RAIL, SO8" H 7325 2700 50  0001 C CNN "Description"
F 5 "10022969" H 7325 2700 50  0001 C CNN "Item Number"
F 6 "ANALOG DEVICES, INC." H 7325 2700 50  0001 C CNN "Manufacturer"
F 7 "OP295GSZ-REEL7" H 7325 2700 50  0001 C CNN "Manufacturer_No"
F 8 "IC OPAMP GP R-R 85KHZ DUAL 8SOIC" H 7325 2700 50  0001 C CNN "Manufacturer_Desc"
F 9 "ANALOG DEVICES, INC." H 7325 2700 50  0001 C CNN "Manufacturer2"
F 10 "OP295GSZ" H 7325 2700 50  0001 C CNN "Manufacturer_No2"
F 11 "IC OPAMP DUAL RAIL-RAIL 8SOIC" H 7325 2700 50  0001 C CNN "Manufacturer_Desc2"
	2    13875 6275
	1    0    0    -1  
$EndComp
$Comp
L cpu-board:+24V #U$227
U 1 1 CA42F55C
P 11900 4550
AR Path="/CA42F55C" Ref="#U$227"  Part="1" 
AR Path="/5E924756/CA42F55C" Ref="#U$0227"  Part="1" 
F 0 "#U$0227" H 11900 4550 50  0001 C CNN
F 1 "+24V" H 11812 4425 59  0000 L BNN
F 2 "" H 11900 4550 50  0001 C CNN
F 3 "" H 11900 4550 50  0001 C CNN
	1    11900 4550
	-1   0    0    1   
$EndComp
Wire Wire Line
	11900 4650 11900 4725
Wire Wire Line
	11900 5175 11900 5300
Wire Wire Line
	11600 5800 11375 5800
Wire Wire Line
	11375 5800 11375 5850
Wire Wire Line
	11125 5800 11375 5800
Connection ~ 11375 5800
Wire Wire Line
	11375 6250 11375 6300
Wire Wire Line
	11900 5950 11900 6125
Wire Wire Line
	12225 6125 11900 6125
Connection ~ 11900 6125
Wire Wire Line
	11900 6125 11900 6300
Wire Wire Line
	12625 6125 12825 6125
Wire Wire Line
	12975 6125 12975 6150
Wire Wire Line
	12825 6250 12825 6125
Connection ~ 12825 6125
Wire Wire Line
	12825 6125 12975 6125
Wire Wire Line
	12825 6450 12825 6600
Wire Wire Line
	12825 6600 12975 6600
Wire Wire Line
	12975 6600 12975 6550
Wire Wire Line
	12975 6625 12975 6600
Connection ~ 12975 6600
Wire Wire Line
	13475 6125 12975 6125
Connection ~ 12975 6125
Wire Wire Line
	14325 6275 14375 6275
Wire Wire Line
	14525 6675 14525 6275
Connection ~ 14525 6275
Wire Wire Line
	14525 6275 14775 6275
Wire Wire Line
	14525 6875 14525 7275
Wire Wire Line
	14100 6925 14375 6925
Wire Wire Line
	14375 6925 14375 6275
Connection ~ 14375 6275
Wire Wire Line
	14375 6275 14525 6275
Wire Wire Line
	14000 7250 14375 7250
Wire Wire Line
	14375 7250 14375 6925
Connection ~ 14375 6925
Wire Wire Line
	13700 6925 13425 6925
Wire Wire Line
	13425 6925 13425 6475
Wire Wire Line
	13425 6475 13475 6475
Wire Wire Line
	13800 7250 13425 7250
Wire Wire Line
	13425 7250 13425 6925
Connection ~ 13425 6925
Wire Wire Line
	12600 6925 13425 6925
Wire Wire Line
	11900 6700 11900 6925
Wire Wire Line
	12200 6925 11900 6925
Connection ~ 11900 6925
Wire Wire Line
	11900 6925 11900 7225
Wire Wire Line
	14225 5500 11900 5500
Connection ~ 11900 5500
Wire Wire Line
	11900 5500 11900 5550
Wire Wire Line
	12225 4750 12225 4725
Wire Wire Line
	12225 4725 11900 4725
Connection ~ 11900 4725
Wire Wire Line
	11900 4725 11900 4875
Wire Wire Line
	12225 5250 12225 5300
Wire Wire Line
	12225 5300 11900 5300
Connection ~ 11900 5300
Wire Wire Line
	11900 5300 11900 5500
Wire Wire Line
	4525 6925 4525 7175
$Comp
L cpu-board:MAX690ACSA IC12
U 1 1 EEDDF45D
P 2625 3000
AR Path="/EEDDF45D" Ref="IC12"  Part="1" 
AR Path="/5E924756/EEDDF45D" Ref="IC12"  Part="1" 
F 0 "IC12" H 2887 3600 59  0000 L BNN
F 1 "MAX690ACSA" H 2875 3525 42  0000 L BNN
F 2 "AllModules:MX.A8_COMPOSANT_1" H 2625 3000 50  0001 C CNN
F 3 "" H 2625 3000 50  0001 C CNN
F 4 "IC,MICROPROCESSOR SUPERVISOR CIRCUIT,SO8" H 2625 3000 50  0001 C CNN "Description"
F 5 "10022970" H 2625 3000 50  0001 C CNN "Item Number"
F 6 "MAXIM_RMS1" H 2625 3000 50  0001 C CNN "Manufacturer"
F 7 "MAX690ACSA+T" H 2625 3000 50  0001 C CNN "Manufacturer_No"
F 8 "" H 2625 3000 50  0001 C CNN "Manufacturer_Desc"
F 9 "MAXIM_RMS1" H 2625 3000 50  0001 C CNN "Manufacturer2"
F 10 "MAX690ACSA+" H 2625 3000 50  0001 C CNN "Manufacturer_No2"
F 11 "MICROPROCESSOR SUPERVISORY CIRCUIT" H 2625 3000 50  0001 C CNN "Manufacturer_Desc2"
	1    2625 3000
	1    0    0    -1  
$EndComp
Wire Wire Line
	2475 2075 2475 2275
Wire Wire Line
	2575 2275 2475 2275
Wire Wire Line
	2775 2275 2875 2275
Wire Wire Line
	2875 2275 2875 2075
$Comp
L cpu-board:BAT54C D14
U 1 1 DDBEAB72
P 10050 3275
AR Path="/DDBEAB72" Ref="D14"  Part="1" 
AR Path="/5E924756/DDBEAB72" Ref="D14"  Part="1" 
F 0 "D14" H 10275 3250 64  0000 L BNN
F 1 "BAT54C" H 10223 3348 42  0000 L BNN
F 2 "AllModules:SOT23-1G_1" H 10062 3275 50  0001 C CNN
F 3 "" H 10062 3275 50  0001 C CNN
F 4 "DIODE SCHOTTKY DOUBLE,30V, 200MA,SOT23" H 10050 3275 50  0001 C CNN "Description"
F 5 "10022653" H 10050 3275 50  0001 C CNN "Item Number"
F 6 "NXP SEMICONDUCTORS_RMS1" H 10050 3275 50  0001 C CNN "Manufacturer"
F 7 "BAT54C,215" H 10050 3275 50  0001 C CNN "Manufacturer_No"
F 8 "" H 10050 3275 50  0001 C CNN "Manufacturer_Desc"
F 9 "NXP SEMICONDUCTORS_RMS1" H 10050 3275 50  0001 C CNN "Manufacturer2"
F 10 "BAT54C" H 10050 3275 50  0001 C CNN "Manufacturer_No2"
F 11 "SCHOTTKY BARRIER DOUBLE DIODE" H 10050 3275 50  0001 C CNN "Manufacturer_Desc2"
	1    10050 3275
	-1   0    0    1   
$EndComp
Connection ~ 3350 2675
Wire Wire Line
	3350 2675 3350 3100
Wire Wire Line
	3225 3300 3500 3300
Wire Wire Line
	3225 3100 3350 3100
Connection ~ 3350 3100
Wire Wire Line
	3350 3100 3350 3725
Wire Wire Line
	2125 3100 1875 3100
Wire Wire Line
	1875 3100 1875 3550
Wire Wire Line
	2125 2850 2025 2850
Wire Wire Line
	2025 2850 2025 2675
Wire Wire Line
	3500 3875 3500 4075
Wire Wire Line
	3850 4025 3850 4075
Wire Wire Line
	2475 2300 2475 2275
Connection ~ 2475 2275
Wire Wire Line
	2875 2300 2875 2275
Connection ~ 2875 2275
Text HLabel 4150 2800 2    56   Output ~ 0
RESET\
Text Label 4675 6225 0    50   ~ 0
V-BATTERY
Text Label 8125 6950 0    50   ~ 0
V-BATTERY
$Comp
L cpu-board:+24V #U$?
U 1 1 5EA7FA28
P 14300 2300
AR Path="/5EA7FA28" Ref="#U$?"  Part="1" 
AR Path="/5E924756/5EA7FA28" Ref="#U$0101"  Part="1" 
F 0 "#U$0101" H 14300 2300 50  0001 C CNN
F 1 "+24V" H 14187 2162 59  0000 L BNN
F 2 "" H 14300 2300 50  0001 C CNN
F 3 "" H 14300 2300 50  0001 C CNN
	1    14300 2300
	0    -1   -1   0   
$EndComp
Wire Wire Line
	3225 4925 3825 4925
NoConn ~ 3525 5075
$EndSCHEMATC
