(module TSOP2-44_1 (layer F.Cu) (tedit 5E952D0E)
  (attr smd)
  (fp_text reference IC16 (at 0.4826 1.016 90 unlocked) (layer F.SilkS)
    (effects (font (size 1.033069 1.086612) (thickness 0.1778)))
  )
  (fp_text value L-BC-TSOP2-44 (at 0.7874 5.1181 90 unlocked) (layer F.SilkS) hide
    (effects (font (size 1.033069 1.086612) (thickness 0.1778)))
  )
  (fp_line (start -5.1816 -5.715) (end -5.1816 -5.08) (layer B.Fab) (width 0.0762))
  (fp_line (start -2.794 -5.715) (end -2.794 -5.08) (layer B.Fab) (width 0.0762))
  (fp_line (start 8.382 5.08) (end 8.382 5.715) (layer B.Fab) (width 0.0762))
  (fp_line (start 3.5814 5.08) (end 3.5814 5.715) (layer B.Fab) (width 0.0762))
  (fp_line (start -7.5946 -5.715) (end -7.5946 -5.08) (layer B.Fab) (width 0.0762))
  (fp_line (start 9.525 -5.08) (end -9.525 -5.08) (layer B.Fab) (width 0.0762))
  (fp_line (start -1.9812 -5.715) (end -1.9812 -5.08) (layer B.Fab) (width 0.0762))
  (fp_line (start 2.794 5.08) (end 2.794 5.715) (layer B.Fab) (width 0.0762))
  (fp_line (start -8.382 -5.715) (end -8.382 -5.08) (layer B.Fab) (width 0.0762))
  (fp_line (start -1.1938 -5.715) (end -1.1938 -5.08) (layer B.Fab) (width 0.0762))
  (fp_line (start 1.9812 5.08) (end 1.9812 5.715) (layer B.Fab) (width 0.0762))
  (fp_line (start -0.381 -5.715) (end -0.381 -5.08) (layer B.Fab) (width 0.0762))
  (fp_line (start 1.1938 5.08) (end 1.1938 5.715) (layer B.Fab) (width 0.0762))
  (fp_line (start 9.525 -5.08) (end 9.525 5.08) (layer B.Fab) (width 0.0762))
  (fp_line (start 0.381 -5.715) (end 0.381 -5.08) (layer B.Fab) (width 0.0762))
  (fp_line (start 0.381 5.08) (end 0.381 5.715) (layer B.Fab) (width 0.0762))
  (fp_line (start -4.3942 -5.715) (end -4.3942 -5.08) (layer B.Fab) (width 0.0762))
  (fp_line (start 1.1938 -5.715) (end 1.1938 -5.08) (layer B.Fab) (width 0.0762))
  (fp_line (start -0.381 5.08) (end -0.381 5.715) (layer B.Fab) (width 0.0762))
  (fp_line (start 6.7818 5.08) (end 6.7818 5.715) (layer B.Fab) (width 0.0762))
  (fp_line (start 1.9812 -5.715) (end 1.9812 -5.08) (layer B.Fab) (width 0.0762))
  (fp_line (start -1.1938 5.08) (end -1.1938 5.715) (layer B.Fab) (width 0.0762))
  (fp_line (start 2.794 -5.715) (end 2.794 -5.08) (layer B.Fab) (width 0.0762))
  (fp_line (start -1.9812 5.08) (end -1.9812 5.715) (layer B.Fab) (width 0.0762))
  (fp_line (start 3.5814 -5.715) (end 3.5814 -5.08) (layer B.Fab) (width 0.0762))
  (fp_line (start -2.794 5.08) (end -2.794 5.715) (layer B.Fab) (width 0.0762))
  (fp_line (start 4.3942 -5.715) (end 4.3942 -5.08) (layer B.Fab) (width 0.0762))
  (fp_line (start 5.1816 5.08) (end 5.1816 5.715) (layer B.Fab) (width 0.0762))
  (fp_line (start -3.5814 5.08) (end -3.5814 5.715) (layer B.Fab) (width 0.0762))
  (fp_line (start -5.9944 -5.715) (end -5.9944 -5.08) (layer B.Fab) (width 0.0762))
  (fp_line (start 5.1816 -5.715) (end 5.1816 -5.08) (layer B.Fab) (width 0.0762))
  (fp_line (start -4.3942 5.08) (end -4.3942 5.715) (layer B.Fab) (width 0.0762))
  (fp_line (start 5.9944 -5.715) (end 5.9944 -5.08) (layer B.Fab) (width 0.0762))
  (fp_line (start -5.1816 5.08) (end -5.1816 5.715) (layer B.Fab) (width 0.0762))
  (fp_line (start 6.7818 -5.715) (end 6.7818 -5.08) (layer B.Fab) (width 0.0762))
  (fp_line (start -5.9944 5.08) (end -5.9944 5.715) (layer B.Fab) (width 0.0762))
  (fp_line (start 7.5946 -5.715) (end 7.5946 -5.08) (layer B.Fab) (width 0.0762))
  (fp_line (start -6.7818 5.08) (end -6.7818 5.715) (layer B.Fab) (width 0.0762))
  (fp_line (start 9.525 5.08) (end -9.525 5.08) (layer B.Fab) (width 0.0762))
  (fp_line (start 8.382 -5.715) (end 8.382 -5.08) (layer B.Fab) (width 0.0762))
  (fp_line (start -7.5946 5.08) (end -7.5946 5.715) (layer B.Fab) (width 0.0762))
  (fp_line (start -9.525 -5.08) (end -9.525 5.08) (layer B.Fab) (width 0.0762))
  (fp_line (start -3.5814 -5.715) (end -3.5814 -5.08) (layer B.Fab) (width 0.0762))
  (fp_line (start 5.9944 5.08) (end 5.9944 5.715) (layer B.Fab) (width 0.0762))
  (fp_line (start -8.382 5.08) (end -8.382 5.715) (layer B.Fab) (width 0.0762))
  (fp_line (start 7.5946 5.08) (end 7.5946 5.715) (layer B.Fab) (width 0.0762))
  (fp_line (start 4.3942 5.08) (end 4.3942 5.715) (layer B.Fab) (width 0.0762))
  (fp_line (start -6.7818 -5.715) (end -6.7818 -5.08) (layer B.Fab) (width 0.0762))
  (fp_line (start 9.525 4.7498) (end 8.9154 4.7498) (layer F.SilkS) (width 0.1778))
  (fp_line (start -8.9154 -4.7498) (end -9.525 -4.7498) (layer F.SilkS) (width 0.1778))
  (fp_line (start 9.525 -4.7498) (end 9.525 4.7498) (layer F.SilkS) (width 0.1778))
  (fp_line (start -9.525 -4.7498) (end -9.525 0.5334) (layer F.SilkS) (width 0.1778))
  (fp_line (start 9.525 -4.7498) (end 8.9154 -4.7498) (layer F.SilkS) (width 0.1778))
  (fp_line (start -9.525 1.8796) (end -9.525 3.5814) (layer F.SilkS) (width 0.1778))
  (fp_line (start -8.9154 4.7498) (end -9.525 4.7498) (layer F.SilkS) (width 0.1778))
  (fp_line (start -9.525 4.6482) (end -9.525 4.7498) (layer F.SilkS) (width 0.1778))
  (fp_arc (start 8.255 -4.1148) (end 7.874 -4.1148) (angle -360) (layer B.Fab) (width 0.1))
  (pad 1 smd rect (at 8.382 -5.715) (size 0.508 1.524) (layers F.Cu F.Paste F.Mask))
  (pad 2 smd rect (at 7.5946 -5.715) (size 0.508 1.524) (layers F.Cu F.Paste F.Mask))
  (pad 3 smd rect (at 6.7818 -5.715) (size 0.508 1.524) (layers F.Cu F.Paste F.Mask))
  (pad 4 smd rect (at 5.9944 -5.715) (size 0.508 1.524) (layers F.Cu F.Paste F.Mask))
  (pad 5 smd rect (at 5.1816 -5.715) (size 0.508 1.524) (layers F.Cu F.Paste F.Mask))
  (pad 6 smd rect (at 4.3942 -5.715) (size 0.508 1.524) (layers F.Cu F.Paste F.Mask))
  (pad 7 smd rect (at 3.5814 -5.715) (size 0.508 1.524) (layers F.Cu F.Paste F.Mask))
  (pad 8 smd rect (at 2.794 -5.715) (size 0.508 1.524) (layers F.Cu F.Paste F.Mask))
  (pad 9 smd rect (at 1.9812 -5.715) (size 0.508 1.524) (layers F.Cu F.Paste F.Mask))
  (pad 10 smd rect (at 1.1938 -5.715) (size 0.508 1.524) (layers F.Cu F.Paste F.Mask))
  (pad 11 smd rect (at 0.381 -5.715) (size 0.508 1.524) (layers F.Cu F.Paste F.Mask))
  (pad 12 smd rect (at -0.381 -5.715) (size 0.508 1.524) (layers F.Cu F.Paste F.Mask))
  (pad 13 smd rect (at -1.1938 -5.715) (size 0.508 1.524) (layers F.Cu F.Paste F.Mask))
  (pad 14 smd rect (at -1.9812 -5.715) (size 0.508 1.524) (layers F.Cu F.Paste F.Mask))
  (pad 15 smd rect (at -2.794 -5.715) (size 0.508 1.524) (layers F.Cu F.Paste F.Mask))
  (pad 16 smd rect (at -3.5814 -5.715) (size 0.508 1.524) (layers F.Cu F.Paste F.Mask))
  (pad 17 smd rect (at -4.3942 -5.715) (size 0.508 1.524) (layers F.Cu F.Paste F.Mask))
  (pad 18 smd rect (at -5.1816 -5.715) (size 0.508 1.524) (layers F.Cu F.Paste F.Mask))
  (pad 19 smd rect (at -5.9944 -5.715) (size 0.508 1.524) (layers F.Cu F.Paste F.Mask))
  (pad 20 smd rect (at -6.7818 -5.715) (size 0.508 1.524) (layers F.Cu F.Paste F.Mask))
  (pad 21 smd rect (at -7.5946 -5.715) (size 0.508 1.524) (layers F.Cu F.Paste F.Mask))
  (pad 22 smd rect (at -8.382 -5.715) (size 0.508 1.524) (layers F.Cu F.Paste F.Mask))
  (pad 23 smd rect (at -8.382 5.715) (size 0.508 1.524) (layers F.Cu F.Paste F.Mask))
  (pad 24 smd rect (at -7.5946 5.715) (size 0.508 1.524) (layers F.Cu F.Paste F.Mask))
  (pad 25 smd rect (at -6.7818 5.715) (size 0.508 1.524) (layers F.Cu F.Paste F.Mask))
  (pad 26 smd rect (at -5.9944 5.715) (size 0.508 1.524) (layers F.Cu F.Paste F.Mask))
  (pad 27 smd rect (at -5.1816 5.715) (size 0.508 1.524) (layers F.Cu F.Paste F.Mask))
  (pad 28 smd rect (at -4.3942 5.715) (size 0.508 1.524) (layers F.Cu F.Paste F.Mask))
  (pad 29 smd rect (at -3.5814 5.715) (size 0.508 1.524) (layers F.Cu F.Paste F.Mask))
  (pad 30 smd rect (at -2.794 5.715) (size 0.508 1.524) (layers F.Cu F.Paste F.Mask))
  (pad 31 smd rect (at -1.9812 5.715) (size 0.508 1.524) (layers F.Cu F.Paste F.Mask))
  (pad 32 smd rect (at -1.1938 5.715) (size 0.508 1.524) (layers F.Cu F.Paste F.Mask))
  (pad 33 smd rect (at -0.381 5.715) (size 0.508 1.524) (layers F.Cu F.Paste F.Mask))
  (pad 34 smd rect (at 0.381 5.715) (size 0.508 1.524) (layers F.Cu F.Paste F.Mask))
  (pad 35 smd rect (at 1.1938 5.715) (size 0.508 1.524) (layers F.Cu F.Paste F.Mask))
  (pad 36 smd rect (at 1.9812 5.715) (size 0.508 1.524) (layers F.Cu F.Paste F.Mask))
  (pad 37 smd rect (at 2.794 5.715) (size 0.508 1.524) (layers F.Cu F.Paste F.Mask))
  (pad 38 smd rect (at 3.5814 5.715) (size 0.508 1.524) (layers F.Cu F.Paste F.Mask))
  (pad 39 smd rect (at 4.3942 5.715) (size 0.508 1.524) (layers F.Cu F.Paste F.Mask))
  (pad 40 smd rect (at 5.1816 5.715) (size 0.508 1.524) (layers F.Cu F.Paste F.Mask))
  (pad 41 smd rect (at 5.9944 5.715) (size 0.508 1.524) (layers F.Cu F.Paste F.Mask))
  (pad 42 smd rect (at 6.7818 5.715) (size 0.508 1.524) (layers F.Cu F.Paste F.Mask))
  (pad 43 smd rect (at 7.5946 5.715) (size 0.508 1.524) (layers F.Cu F.Paste F.Mask))
  (pad 44 smd rect (at 8.382 5.715) (size 0.508 1.524) (layers F.Cu F.Paste F.Mask))
  (model ${KISYS3DMOD}/Package_SO.3dshapes/TSOP-II-44_10.16x18.41mm_P0.8mm.wrl
    (at (xyz 0 0 0))
    (scale (xyz 1 1 1))
    (rotate (xyz 0 0 -90))
  )
)
