(module SOT23-GSD_1 (layer F.Cu) (tedit 0)
  (attr smd)
  (fp_text reference REF** (at 0.6985 -0.4826 unlocked) (layer F.SilkS)
    (effects (font (size 1.033069 1.086612) (thickness 0.127)))
  )
  (fp_text value Q-SOT23-IRLML2803 (at -6.6929 0.7874 -180 unlocked) (layer F.SilkS) hide
    (effects (font (size 1.033069 1.086612) (thickness 0.127)))
  )
  (fp_line (start -0.9398 -0.9398) (end -0.9398 -1.905) (layer F.SilkS) (width 0.1778))
  (fp_line (start -1.7272 -0.9398) (end -0.9398 -0.9398) (layer F.SilkS) (width 0.1778))
  (fp_line (start -1.7272 1.905) (end -1.7272 -0.9398) (layer F.SilkS) (width 0.1778))
  (fp_line (start 0.9398 -0.9398) (end 0.9398 -1.905) (layer F.SilkS) (width 0.1778))
  (fp_line (start -0.9398 -1.905) (end 0.9398 -1.905) (layer F.SilkS) (width 0.1778))
  (fp_line (start 0.9398 -0.9398) (end 1.7272 -0.9398) (layer F.SilkS) (width 0.1778))
  (fp_line (start -1.7272 1.905) (end 1.7272 1.905) (layer F.SilkS) (width 0.1778))
  (fp_line (start 1.7272 1.905) (end 1.7272 -0.9398) (layer F.SilkS) (width 0.1778))
  (fp_line (start -0.9398 -0.9398) (end -0.9398 -1.905) (layer Dwgs.User) (width 0.1778))
  (fp_line (start -1.7272 -0.9398) (end -0.9398 -0.9398) (layer Dwgs.User) (width 0.1778))
  (fp_line (start -1.7272 1.905) (end -1.7272 -0.9398) (layer Dwgs.User) (width 0.1778))
  (fp_line (start 0.9398 -0.9398) (end 0.9398 -1.905) (layer Dwgs.User) (width 0.1778))
  (fp_line (start -0.9398 -1.905) (end 0.9398 -1.905) (layer Dwgs.User) (width 0.1778))
  (fp_line (start 0.9398 -0.9398) (end 1.7272 -0.9398) (layer Dwgs.User) (width 0.1778))
  (fp_line (start -1.7272 1.905) (end 1.7272 1.905) (layer Dwgs.User) (width 0.1778))
  (fp_line (start 1.7272 1.905) (end 1.7272 -0.9398) (layer Dwgs.User) (width 0.1778))
  (fp_line (start -0.2032 -1.2446) (end 0.2032 -1.2446) (layer F.Fab) (width 0.0762))
  (fp_line (start 0.762 1.2446) (end 1.1684 1.2446) (layer F.Fab) (width 0.0762))
  (fp_line (start -1.1684 1.2446) (end -0.762 1.2446) (layer F.Fab) (width 0.0762))
  (fp_line (start 0.2032 -0.6604) (end 0.2032 -1.2446) (layer F.Fab) (width 0.0762))
  (fp_line (start -1.1684 1.2446) (end -1.1684 0.6604) (layer F.Fab) (width 0.0762))
  (fp_line (start -0.2032 -0.6604) (end -0.2032 -1.2446) (layer F.Fab) (width 0.0762))
  (fp_line (start -0.762 1.2446) (end -0.762 0.6604) (layer F.Fab) (width 0.0762))
  (fp_line (start -1.4478 0.6604) (end 1.4478 0.6604) (layer F.Fab) (width 0.0762))
  (fp_line (start 1.1684 1.2446) (end 1.1684 0.6604) (layer F.Fab) (width 0.0762))
  (fp_line (start -1.4478 0.6604) (end -1.4478 -0.6604) (layer F.Fab) (width 0.0762))
  (fp_line (start 0.762 1.2446) (end 0.762 0.6604) (layer F.Fab) (width 0.0762))
  (fp_line (start 1.4478 0.6604) (end 1.4478 -0.6604) (layer F.Fab) (width 0.0762))
  (fp_line (start -1.4478 -0.6604) (end 1.4478 -0.6604) (layer F.Fab) (width 0.0762))
  (pad S smd rect (at 0.9652 1.0414) (size 0.9144 1.1176) (layers F.Cu F.Paste F.Mask))
  (pad G smd rect (at -0.9652 1.0414) (size 0.9144 1.1176) (layers F.Cu F.Paste F.Mask))
  (pad D smd rect (at 0 -1.0414) (size 0.9144 1.1176) (layers F.Cu F.Paste F.Mask))
  (model ${KISYS3DMOD}/Diode_SMD.3dshapes/D_SOT-23.wrl
    (at (xyz 0 0 0))
    (scale (xyz 1 1 1))
    (rotate (xyz 0 0 -90))
  )
)
