(module RC1206_1 (layer F.Cu) (tedit 0)
  (attr smd)
  (fp_text reference REF** (at -0.6985 0.4826 -180 unlocked) (layer F.SilkS)
    (effects (font (size 1.033069 1.086612) (thickness 0.127)))
  )
  (fp_text value C-BC-C1206 (at 3.937 -0.7874 unlocked) (layer F.SilkS) hide
    (effects (font (size 1.033069 1.086612) (thickness 0.127)))
  )
  (fp_line (start -2.54 1.27) (end 2.54 1.27) (layer F.SilkS) (width 0.1778))
  (fp_line (start -2.54 1.27) (end -2.54 -1.27) (layer F.SilkS) (width 0.1778))
  (fp_line (start 2.54 1.27) (end 2.54 -1.27) (layer F.SilkS) (width 0.1778))
  (fp_line (start -2.54 -1.27) (end 2.54 -1.27) (layer F.SilkS) (width 0.1778))
  (fp_line (start -2.54 1.27) (end 2.54 1.27) (layer Dwgs.User) (width 0.1778))
  (fp_line (start -2.54 1.27) (end -2.54 -1.27) (layer Dwgs.User) (width 0.1778))
  (fp_line (start 2.54 1.27) (end 2.54 -1.27) (layer Dwgs.User) (width 0.1778))
  (fp_line (start -2.54 -1.27) (end 2.54 -1.27) (layer Dwgs.User) (width 0.1778))
  (fp_line (start -1.6764 0.9398) (end 1.6764 0.9398) (layer F.Fab) (width 0.0762))
  (fp_line (start -1.6764 0.9398) (end -1.6764 -0.9398) (layer F.Fab) (width 0.0762))
  (fp_line (start 1.6764 0.9398) (end 1.6764 -0.9398) (layer F.Fab) (width 0.0762))
  (fp_line (start -1.6764 -0.9398) (end 1.6764 -0.9398) (layer F.Fab) (width 0.0762))
  (pad 2 smd rect (at 1.4224 0) (size 1.5748 1.905) (layers F.Cu F.Paste F.Mask))
  (pad 1 smd rect (at -1.4224 0) (size 1.5748 1.905) (layers F.Cu F.Paste F.Mask))
  (model ${KISYS3DMOD}/Capacitor_SMD.3dshapes/C_1206_3216Metric.wrl
    (at (xyz 0 0 0))
    (scale (xyz 1 1 1))
    (rotate (xyz 0 0 0))
  )
)
