EESchema Schematic File Version 4
EELAYER 30 0
EELAYER END
$Descr A3 16535 11693
encoding utf-8
Sheet 5 8
Title ""
Date ""
Rev ""
Comp ""
Comment1 ""
Comment2 ""
Comment3 ""
Comment4 ""
$EndDescr
Wire Wire Line
	13400 4800 13400 4900
Wire Wire Line
	15650 5625 15650 5550
$Comp
L power:GND #PWR0181
U 1 1 5FDD6127
P 12100 5650
F 0 "#PWR0181" H 12100 5400 50  0001 C CNN
F 1 "GND" H 12150 5425 50  0000 C CNN
F 2 "" H 12100 5650 50  0001 C CNN
F 3 "" H 12100 5650 50  0001 C CNN
	1    12100 5650
	1    0    0    -1  
$EndComp
$Comp
L power:GND #PWR0182
U 1 1 5E96F757
P 13400 4900
F 0 "#PWR0182" H 13400 4650 50  0001 C CNN
F 1 "GND" H 13525 4800 50  0000 C CNN
F 2 "" H 13400 4900 50  0001 C CNN
F 3 "" H 13400 4900 50  0001 C CNN
	1    13400 4900
	1    0    0    -1  
$EndComp
$Comp
L power:GND #PWR0183
U 1 1 5FDD6133
P 15650 5625
F 0 "#PWR0183" H 15650 5375 50  0001 C CNN
F 1 "GND" H 15775 5525 50  0000 C CNN
F 2 "" H 15650 5625 50  0001 C CNN
F 3 "" H 15650 5625 50  0001 C CNN
	1    15650 5625
	1    0    0    -1  
$EndComp
$Comp
L Device:L L2
U 1 1 5FDD612A
P 13650 4300
F 0 "L2" V 13840 4300 50  0000 C CNN
F 1 "33uH" V 13749 4300 50  0000 C CNN
F 2 "10005011 Power Management:WE-PD4_1" H 13650 4300 50  0001 C CNN
F 3 "https://katalog.we-online.com/pbs/datasheet/74456133.pdf" H 13650 4300 50  0001 C CNN
F 4 "Wurth" V 13650 4300 50  0001 C CNN "Mnf"
F 5 "74456133" V 13650 4300 50  0001 C CNN "Mnf PN"
	1    13650 4300
	0    1    -1   0   
$EndComp
$Comp
L Device:R R71
U 1 1 5E973040
P 13900 4950
F 0 "R71" H 13970 4996 50  0000 L CNN
F 1 "10k" H 13970 4905 50  0000 L CNN
F 2 "10005011 Power Management:R0603_1" V 13830 4950 50  0001 C CNN
F 3 "https://www.yageo.com/upload/media/product/productsearch/datasheet/rchip/PYu-RT_1-to-0.01_RoHS_L_11.pdf" H 13900 4950 50  0001 C CNN
F 4 "Yageo" H 13900 4950 50  0001 C CNN "Mnf"
F 5 "RT0603BRB0710KL" H 13900 4950 50  0001 C CNN "Mnf PN"
	1    13900 4950
	1    0    0    -1  
$EndComp
$Comp
L Device:R R73
U 1 1 5FDD612C
P 13900 5450
F 0 "R73" H 13830 5404 50  0000 R CNN
F 1 "3K24" H 13830 5495 50  0000 R CNN
F 2 "10005011 Power Management:R0603_1" V 13830 5450 50  0001 C CNN
F 3 "https://www.yageo.com/upload/media/product/productsearch/datasheet/rchip/PYu-RT_1-to-0.01_RoHS_L_11.pdf" H 13900 5450 50  0001 C CNN
F 4 "Yageo" H 13900 5450 50  0001 C CNN "Mnf"
F 5 "RT0603BRD073K24L" H 13900 5450 50  0001 C CNN "Mnf PN"
	1    13900 5450
	-1   0    0    1   
$EndComp
$Comp
L Device:R R70
U 1 1 5FDD6131
P 15650 4550
F 0 "R70" H 15720 4596 50  0000 L CNN
F 1 "10k" H 15720 4505 50  0000 L CNN
F 2 "10005011 Power Management:R0603_1" V 15580 4550 50  0001 C CNN
F 3 "https://www.yageo.com/upload/media/product/productsearch/datasheet/rchip/PYu-RT_1-to-0.01_RoHS_L_11.pdf" H 15650 4550 50  0001 C CNN
F 4 "Yageo" H 15650 4550 50  0001 C CNN "Mnf"
F 5 "RT0603BRB0710KL" H 15650 4550 50  0001 C CNN "Mnf PN"
	1    15650 4550
	1    0    0    -1  
$EndComp
$Comp
L Device:R R72
U 1 1 5FDD6132
P 15650 5400
F 0 "R72" H 15720 5446 50  0000 L CNN
F 1 "10k" H 15720 5355 50  0000 L CNN
F 2 "10005011 Power Management:R0603_1" V 15580 5400 50  0001 C CNN
F 3 "https://www.yageo.com/upload/media/product/productsearch/datasheet/rchip/PYu-RT_1-to-0.01_RoHS_L_11.pdf" H 15650 5400 50  0001 C CNN
F 4 "Yageo" H 15650 5400 50  0001 C CNN "Mnf"
F 5 "RT0603BRB0710KL" H 15650 5400 50  0001 C CNN "Mnf PN"
	1    15650 5400
	1    0    0    -1  
$EndComp
$Comp
L Device:C C55
U 1 1 5E9651FC
P 10150 5050
F 0 "C55" H 10035 5004 50  0000 R CNN
F 1 "100nF" H 10035 5095 50  0000 R CNN
F 2 "10005011 Power Management:C0805_1" H 10188 4900 50  0001 C CNN
F 3 "~" H 10150 5050 50  0001 C CNN
F 4 "Yageo" H 10150 5050 50  0001 C CNN "Mnf"
F 5 "223858055649" H 10150 5050 50  0001 C CNN "Mnf PN"
F 6 "CAPACITOR CERAMIC, 100NF, +/-10%, 50V, X7R,0805" H 10150 5050 50  0001 C CNN "Description"
F 7 "10022135" H 10150 5050 50  0001 C CNN "Item Number"
	1    10150 5050
	-1   0    0    1   
$EndComp
$Comp
L Device:C C45
U 1 1 5E978E52
P 14700 4550
F 0 "C45" H 14815 4504 50  0000 L CNN
F 1 "10uF" H 14815 4595 50  0000 L CNN
F 2 "10005011 Power Management:C0805-AIROX-KEMET-C0805C106KA3" H 14738 4400 50  0001 C CNN
F 3 "https://api.kemet.com/component-edge/download/datasheet/C0805C106K4PACTU.pdf" H 14700 4550 50  0001 C CNN
F 4 "Kemet" H 14700 4550 50  0001 C CNN "Mnf"
F 5 "C0805C106K4PAC" H 14700 4550 50  0001 C CNN "Mnf PN"
	1    14700 4550
	1    0    0    1   
$EndComp
$Comp
L Device:C C46
U 1 1 5FDD6122
P 15150 4550
F 0 "C46" H 15265 4504 50  0000 L CNN
F 1 "100nF" H 15265 4595 50  0000 L CNN
F 2 "10005011 Power Management:C0402_1" H 15188 4400 50  0001 C CNN
F 3 "~" H 15150 4550 50  0001 C CNN
F 4 "Murata" H 15150 4550 50  0001 C CNN "Mnf"
F 5 "GRM155R71C104JA88J" H 15150 4550 50  0001 C CNN "Mnf PN"
F 6 "CAPACITOR,100NF,16V,+/-10%,X7R,0402" H 15150 4550 50  0001 C CNN "Description"
F 7 "10022607" H 15150 4550 50  0001 C CNN "Item Number"
F 8 "MURATA" H 15150 4550 50  0001 C CNN "Manufacturer"
F 9 "GRM155R71C104JA88J" H 15150 4550 50  0001 C CNN "Manufacturer_No"
	1    15150 4550
	1    0    0    1   
$EndComp
$Comp
L 10005011_Power_Management:VALIM_PERM #PWR0184
U 1 1 5FDD6120
P 10150 4600
F 0 "#PWR0184" H 10150 4450 50  0001 C CNN
F 1 "VALIM_PERM" H 10165 4799 50  0000 C CNN
F 2 "" H 10150 4600 50  0001 C CNN
F 3 "" H 10150 4600 50  0001 C CNN
	1    10150 4600
	1    0    0    -1  
$EndComp
Connection ~ 11850 8700
Connection ~ 11850 8150
Connection ~ 13150 8150
Connection ~ 13850 8600
Connection ~ 11400 8150
Connection ~ 13850 8150
Wire Wire Line
	11400 7800 11400 8150
Wire Wire Line
	11400 8150 11400 8350
Wire Wire Line
	11400 8650 11400 8700
Wire Wire Line
	11400 8700 11850 8700
Wire Wire Line
	11850 8150 11400 8150
Wire Wire Line
	11850 8150 11975 8150
Wire Wire Line
	11850 8350 11850 8150
Wire Wire Line
	11850 8550 11850 8700
Wire Wire Line
	11850 8700 11850 8800
Wire Wire Line
	11975 8350 11850 8350
Wire Wire Line
	11975 8550 11850 8550
Wire Wire Line
	12775 8150 13150 8150
Wire Wire Line
	13150 8150 13150 8250
Wire Wire Line
	13150 8150 13850 8150
Wire Wire Line
	13150 8550 13150 8600
Wire Wire Line
	13150 8600 13850 8600
Wire Wire Line
	13850 8150 13850 8250
Wire Wire Line
	13850 8150 14400 8150
Wire Wire Line
	13850 8600 13850 8550
Wire Wire Line
	13850 8600 13850 8750
$Comp
L power:+5V #PWR0101
U 1 1 5FDE688B
P 11400 7800
AR Path="/5E88D608/5FDE688B" Ref="#PWR0101"  Part="1" 
AR Path="/5E8E2802/5FDE688B" Ref="#PWR?"  Part="1" 
AR Path="/5E8F17C0/5FDE688B" Ref="#PWR?"  Part="1" 
AR Path="/5FDBA600/5FDE688B" Ref="#PWR0185"  Part="1" 
F 0 "#PWR0185" H 11400 7650 50  0001 C CNN
F 1 "+5V" H 11450 8000 50  0000 C CNN
F 2 "" H 11400 7800 50  0001 C CNN
F 3 "" H 11400 7800 50  0001 C CNN
	1    11400 7800
	1    0    0    -1  
$EndComp
$Comp
L Device:C C?
U 1 1 5FDE688F
P 11400 8500
AR Path="/5E88D608/5FDE688F" Ref="C?"  Part="1" 
AR Path="/5E8E2802/5FDE688F" Ref="C?"  Part="1" 
AR Path="/5E8F17C0/5FDE688F" Ref="C?"  Part="1" 
AR Path="/5FDBA600/5FDE688F" Ref="C59"  Part="1" 
F 0 "C59" H 11286 8454 50  0000 R CNN
F 1 "100nF" H 11286 8545 50  0000 R CNN
F 2 "10005011 Power Management:C0402_1" H 11438 8350 50  0001 C CNN
F 3 "~" H 11400 8500 50  0001 C CNN
F 4 "Murata" H 11400 8500 50  0001 C CNN "Mnf"
F 5 "GRM155R71C104JA88J" H 11400 8500 50  0001 C CNN "Mnf PN"
F 6 "CAPACITOR,100NF,16V,+/-10%,X7R,0402" H 11400 8500 50  0001 C CNN "Description"
F 7 "10022607" H 11400 8500 50  0001 C CNN "Item Number"
F 8 "MURATA" H 11400 8500 50  0001 C CNN "Manufacturer"
F 9 "GRM155R71C104JA88J" H 11400 8500 50  0001 C CNN "Manufacturer_No"
	1    11400 8500
	1    0    0    1   
$EndComp
$Comp
L Device:C C?
U 1 1 5FDE688A
P 13150 8400
AR Path="/5E88D608/5FDE688A" Ref="C?"  Part="1" 
AR Path="/5E8E2802/5FDE688A" Ref="C?"  Part="1" 
AR Path="/5E8F17C0/5FDE688A" Ref="C?"  Part="1" 
AR Path="/5FDBA600/5FDE688A" Ref="C57"  Part="1" 
F 0 "C57" H 13265 8446 50  0000 L CNN
F 1 "1uF" H 13265 8355 50  0000 L CNN
F 2 "10005011 Power Management:C0805_1" H 13188 8250 50  0001 C CNN
F 3 "~" H 13150 8400 50  0001 C CNN
F 4 "AVX" H 13150 8400 50  0001 C CNN "Mnf"
F 5 "0805YC105KAT2A" H 13150 8400 50  0001 C CNN "Mnf PN"
	1    13150 8400
	1    0    0    -1  
$EndComp
$Comp
L Device:C C?
U 1 1 5FDE688E
P 13850 8400
AR Path="/5E88D608/5FDE688E" Ref="C?"  Part="1" 
AR Path="/5E8E2802/5FDE688E" Ref="C?"  Part="1" 
AR Path="/5E8F17C0/5FDE688E" Ref="C?"  Part="1" 
AR Path="/5FDBA600/5FDE688E" Ref="C58"  Part="1" 
F 0 "C58" H 13965 8446 50  0000 L CNN
F 1 "100nF" H 13965 8355 50  0000 L CNN
F 2 "10005011 Power Management:C0402_1" H 13888 8250 50  0001 C CNN
F 3 "~" H 13850 8400 50  0001 C CNN
F 4 "Murata" H 13850 8400 50  0001 C CNN "Mnf"
F 5 "GRM155R71C104JA88J" H 13850 8400 50  0001 C CNN "Mnf PN"
F 6 "CAPACITOR,100NF,16V,+/-10%,X7R,0402" H 13850 8400 50  0001 C CNN "Description"
F 7 "10022607" H 13850 8400 50  0001 C CNN "Item Number"
F 8 "MURATA" H 13850 8400 50  0001 C CNN "Manufacturer"
F 9 "GRM155R71C104JA88J" H 13850 8400 50  0001 C CNN "Manufacturer_No"
	1    13850 8400
	1    0    0    -1  
$EndComp
$Comp
L power:+5V #PWR0188
U 1 1 5FE6DCAC
P 15650 4200
F 0 "#PWR0188" H 15650 4050 50  0001 C CNN
F 1 "+5V" H 15665 4373 50  0000 C CNN
F 2 "" H 15650 4200 50  0001 C CNN
F 3 "" H 15650 4200 50  0001 C CNN
	1    15650 4200
	1    0    0    -1  
$EndComp
$Comp
L Interface_USB:FT2232D IC4
U 1 1 5F152242
P 6000 4050
F 0 "IC4" H 5350 5800 50  0000 C CNN
F 1 "FT2232" H 6550 5800 50  0000 C CNN
F 2 "10005011 Power Management:LQFP48-PAD0.28X1.2_1" H 7000 2400 50  0001 C CNN
F 3 "http://www.ftdichip.com/Support/Documents/DataSheets/ICs/DS_FT2232D.pdf" H 6000 4050 50  0001 C CNN
	1    6000 4050
	1    0    0    -1  
$EndComp
Wire Wire Line
	1750 3550 1850 3550
Wire Wire Line
	1850 3550 1850 3850
Wire Wire Line
	1850 3850 1450 3850
Wire Wire Line
	1250 3850 1250 3750
Wire Wire Line
	1350 3750 1350 3850
Connection ~ 1350 3850
Wire Wire Line
	1350 3850 1250 3850
Wire Wire Line
	1450 3850 1450 4050
Wire Wire Line
	1450 4050 1550 4050
Connection ~ 1450 3850
Wire Wire Line
	1450 3850 1350 3850
NoConn ~ 1750 3450
Wire Wire Line
	1750 3350 2000 3350
Wire Wire Line
	1750 4050 2000 4050
Wire Wire Line
	2000 3850 2000 4050
Connection ~ 2000 4050
Wire Wire Line
	2200 3850 2200 4050
Wire Wire Line
	2850 3850 2850 4050
Wire Wire Line
	3300 3850 3300 4050
$Comp
L power:GND #PWR0189
U 1 1 5EC37C76
P 3550 4150
F 0 "#PWR0189" H 3550 3900 50  0001 C CNN
F 1 "GND" H 3550 4000 50  0000 C CNN
F 2 "" H 3550 4150 50  0001 C CNN
F 3 "" H 3550 4150 50  0001 C CNN
	1    3550 4150
	1    0    0    -1  
$EndComp
Wire Wire Line
	3550 3550 3550 3450
Wire Wire Line
	3550 3450 3300 3450
Wire Wire Line
	2000 3450 2200 3450
Wire Wire Line
	2200 3450 2200 3550
Wire Wire Line
	2850 3450 2850 3550
Connection ~ 2650 3450
Wire Wire Line
	2650 3450 2650 3250
Wire Wire Line
	3300 4050 3550 4050
Connection ~ 2850 4050
Wire Wire Line
	2850 4050 3300 4050
Wire Wire Line
	1750 3250 2650 3250
Wire Wire Line
	2650 3450 2850 3450
Wire Wire Line
	3300 3150 3300 3450
Wire Wire Line
	2000 3350 2000 3450
Connection ~ 2000 3450
Wire Wire Line
	2000 3450 2000 3550
Connection ~ 3300 3450
Wire Wire Line
	3300 3450 3300 3550
Wire Wire Line
	2650 4050 2850 4050
Connection ~ 2200 4050
Wire Wire Line
	2000 4050 2200 4050
$Comp
L Device:R R3
U 1 1 5EC37C9E
P 4150 1700
F 0 "R3" V 4250 1700 50  0000 C CNN
F 1 "470" V 4325 1700 50  0000 C CNN
F 2 "10005011 Power Management:R0805_1" V 4080 1700 50  0001 C CNN
F 3 "~" H 4150 1700 50  0001 C CNN
	1    4150 1700
	0    1    1    0   
$EndComp
$Comp
L power:GND #PWR0190
U 1 1 5EC37CAA
P 4400 2250
F 0 "#PWR0190" H 4400 2000 50  0001 C CNN
F 1 "GND" H 4400 2100 50  0000 C CNN
F 2 "" H 4400 2250 50  0001 C CNN
F 3 "" H 4400 2250 50  0001 C CNN
	1    4400 2250
	1    0    0    -1  
$EndComp
$Comp
L Device:R R5
U 1 1 5EC37CB0
P 4750 3150
F 0 "R5" V 4650 3150 50  0000 C CNN
F 1 "27" V 4750 3150 50  0000 C CNN
F 2 "10005011 Power Management:R0603_1" V 4680 3150 50  0001 C CNN
F 3 "~" H 4750 3150 50  0001 C CNN
	1    4750 3150
	0    -1   1    0   
$EndComp
$Comp
L Device:R R6
U 1 1 5EC37CB6
P 4750 3350
F 0 "R6" V 4850 3350 50  0000 C CNN
F 1 "27" V 4750 3350 50  0000 C CNN
F 2 "10005011 Power Management:R0603_1" V 4680 3350 50  0001 C CNN
F 3 "~" H 4750 3350 50  0001 C CNN
	1    4750 3350
	0    -1   1    0   
$EndComp
Wire Wire Line
	4150 3350 4600 3350
Wire Wire Line
	4900 3350 5000 3350
Wire Wire Line
	5100 3150 4900 3150
Wire Wire Line
	4600 3150 4150 3150
$Comp
L Device:R R7
U 1 1 5EC37CC6
P 5000 3600
F 0 "R7" H 4930 3554 50  0000 R CNN
F 1 "1.5k" H 4930 3645 50  0000 R CNN
F 2 "10005011 Power Management:R0603_1" V 4930 3600 50  0001 C CNN
F 3 "~" H 5000 3600 50  0001 C CNN
	1    5000 3600
	1    0    0    1   
$EndComp
Wire Wire Line
	5000 3750 5100 3750
Wire Wire Line
	5000 3450 5000 3350
Connection ~ 5000 3350
Wire Wire Line
	5000 3350 5100 3350
Wire Wire Line
	4700 3950 5100 3950
Wire Wire Line
	5700 5850 5700 5950
Wire Wire Line
	5700 5950 5900 5950
Wire Wire Line
	6200 5950 6200 5850
Wire Wire Line
	5900 5850 5900 5950
Connection ~ 5900 5950
Wire Wire Line
	5900 5950 6000 5950
Wire Wire Line
	6000 5850 6000 5950
Connection ~ 6000 5950
Wire Wire Line
	6000 5950 6100 5950
Wire Wire Line
	6100 5850 6100 5950
Connection ~ 6100 5950
Wire Wire Line
	6100 5950 6200 5950
Wire Wire Line
	6200 5950 6200 6050
Connection ~ 6200 5950
$Comp
L power:GND #PWR0191
U 1 1 5F152249
P 6200 6050
F 0 "#PWR0191" H 6200 5800 50  0001 C CNN
F 1 "GND" H 6200 5900 50  0000 C CNN
F 2 "" H 6200 6050 50  0001 C CNN
F 3 "" H 6200 6050 50  0001 C CNN
	1    6200 6050
	1    0    0    -1  
$EndComp
$Comp
L power:GND #PWR0192
U 1 1 5F15224A
P 5000 5550
F 0 "#PWR0192" H 5000 5300 50  0001 C CNN
F 1 "GND" H 5000 5400 50  0000 C CNN
F 2 "" H 5000 5550 50  0001 C CNN
F 3 "" H 5000 5550 50  0001 C CNN
	1    5000 5550
	1    0    0    -1  
$EndComp
Wire Wire Line
	5100 5350 5000 5350
Wire Wire Line
	5000 5350 5000 5550
NoConn ~ 5100 5150
NoConn ~ 5100 5050
NoConn ~ 5100 4950
NoConn ~ 6900 4350
NoConn ~ 6900 4450
NoConn ~ 6900 4550
NoConn ~ 6900 4650
NoConn ~ 6900 4750
NoConn ~ 6900 4950
NoConn ~ 6900 5050
NoConn ~ 6900 5150
NoConn ~ 6900 5250
NoConn ~ 6900 5350
NoConn ~ 6900 5550
$Comp
L Device:Crystal_GND2 Q1
U 1 1 5EC37D14
P 4400 4550
F 0 "Q1" V 4350 4200 50  0000 L CNN
F 1 "6 MHz" V 4450 4050 50  0000 L CNN
F 2 "10005011 Power Management:CSTCR_1" H 4400 4550 50  0001 C CNN
F 3 "https://www.murata.com/products/productdata/8801051869214/SPEC-CSTCR6M00G53-R0.pdf" H 4400 4550 50  0001 C CNN
	1    4400 4550
	0    1    -1   0   
$EndComp
$Comp
L Device:R R113
U 1 1 5F15224C
P 4700 4550
F 0 "R113" H 4770 4596 50  0000 L CNN
F 1 "1M" H 4770 4505 50  0000 L CNN
F 2 "10005011 Power Management:R0603_1" V 4630 4550 50  0001 C CNN
F 3 "~" H 4700 4550 50  0001 C CNN
	1    4700 4550
	1    0    0    -1  
$EndComp
$Comp
L power:GND #PWR0193
U 1 1 5F15224D
P 3950 4700
F 0 "#PWR0193" H 3950 4450 50  0001 C CNN
F 1 "GND" H 3950 4550 50  0000 C CNN
F 2 "" H 3950 4700 50  0001 C CNN
F 3 "" H 3950 4700 50  0001 C CNN
	1    3950 4700
	1    0    0    -1  
$EndComp
Wire Wire Line
	4400 4400 4400 4300
Wire Wire Line
	4400 4300 4700 4300
Wire Wire Line
	4700 4300 4700 4400
Wire Wire Line
	4400 4700 4400 4800
Wire Wire Line
	4400 4800 4700 4800
Wire Wire Line
	4700 4800 4700 4700
Wire Wire Line
	4200 4550 3950 4550
Wire Wire Line
	3950 4550 3950 4700
Wire Wire Line
	5100 4450 5000 4450
Wire Wire Line
	5000 4450 5000 4300
Wire Wire Line
	5000 4300 4700 4300
Connection ~ 4700 4300
Wire Wire Line
	5100 4650 5000 4650
Wire Wire Line
	5000 4650 5000 4800
Wire Wire Line
	5000 4800 4700 4800
Connection ~ 4700 4800
Wire Wire Line
	2450 3150 2450 1700
Wire Wire Line
	3000 2200 3000 2300
Wire Wire Line
	3000 2300 3200 2300
Wire Wire Line
	3800 2300 3800 2200
Wire Wire Line
	4300 1700 4400 1700
Wire Wire Line
	4400 1700 4400 1900
Wire Wire Line
	1750 3150 2450 3150
Connection ~ 2450 3150
Wire Wire Line
	2450 3150 3300 3150
Wire Wire Line
	3000 1700 3000 1900
Wire Wire Line
	3000 1700 3300 1700
Wire Wire Line
	3300 1700 3300 1900
Connection ~ 3300 1700
Wire Wire Line
	3300 1700 3600 1700
Wire Wire Line
	3800 1700 3800 1900
Connection ~ 3800 1700
Wire Wire Line
	3800 1700 4000 1700
$Comp
L power:GND #PWR0194
U 1 1 5F15224E
P 3200 2350
F 0 "#PWR0194" H 3200 2100 50  0001 C CNN
F 1 "GND" H 3200 2200 50  0000 C CNN
F 2 "" H 3200 2350 50  0001 C CNN
F 3 "" H 3200 2350 50  0001 C CNN
	1    3200 2350
	1    0    0    -1  
$EndComp
Wire Wire Line
	3200 2300 3200 2350
Connection ~ 3200 2300
Wire Wire Line
	3200 2300 3300 2300
Wire Wire Line
	3300 2200 3300 2300
Connection ~ 3300 2300
Wire Wire Line
	3300 2300 3800 2300
Wire Wire Line
	3600 1700 3600 1600
Wire Wire Line
	5900 2050 5900 2150
Connection ~ 3600 1700
Wire Wire Line
	3600 1700 3800 1700
Wire Wire Line
	5800 1600 5800 2050
Wire Wire Line
	3600 1600 5800 1600
Wire Wire Line
	3600 1500 3600 1600
Connection ~ 3600 1600
$Comp
L Device:C C7
U 1 1 5EC37D5F
P 4800 2500
F 0 "C7" H 4686 2546 50  0000 R CNN
F 1 "33pF" H 4686 2455 50  0000 R CNN
F 2 "10005011 Power Management:C0603_1" H 4838 2350 50  0001 C CNN
F 3 "~" H 4800 2500 50  0001 C CNN
	1    4800 2500
	1    0    0    -1  
$EndComp
Wire Wire Line
	5100 2750 5100 2300
Wire Wire Line
	5100 2300 4800 2300
Wire Wire Line
	4800 2300 4800 2350
$Comp
L power:GND #PWR0195
U 1 1 5EC37D6A
P 4800 2750
F 0 "#PWR0195" H 4800 2500 50  0001 C CNN
F 1 "GND" H 4800 2600 50  0000 C CNN
F 2 "" H 4800 2750 50  0001 C CNN
F 3 "" H 4800 2750 50  0001 C CNN
	1    4800 2750
	1    0    0    -1  
$EndComp
Wire Wire Line
	4400 2200 4400 2250
Wire Wire Line
	4800 2650 4800 2750
NoConn ~ 6900 2750
NoConn ~ 6900 2850
NoConn ~ 6900 2950
NoConn ~ 6900 3050
NoConn ~ 6900 3150
NoConn ~ 6900 3250
NoConn ~ 6900 3450
NoConn ~ 6900 3550
NoConn ~ 6900 3650
NoConn ~ 6900 3750
NoConn ~ 6900 3850
Wire Wire Line
	2450 1700 2600 1700
Wire Wire Line
	2800 1700 3000 1700
Connection ~ 3000 1700
Connection ~ 2650 3250
Wire Wire Line
	2000 3350 3750 3350
Connection ~ 2000 3350
Wire Wire Line
	3550 3250 3550 3150
Wire Wire Line
	3550 3150 3750 3150
Wire Wire Line
	2650 3250 3550 3250
Text Label 2100 3250 0    50   ~ 0
D-
Text Label 2100 3350 0    50   ~ 0
D+
Text Label 4450 3150 0    50   ~ 0
DMF
Text Label 4450 3350 0    50   ~ 0
DPF
Text Label 4950 3350 0    50   ~ 0
DPR
Text Label 4950 3150 0    50   ~ 0
DMR
Text Label 4500 4300 0    50   ~ 0
FTDI-XTIN
Text Label 4500 4800 0    50   ~ 0
FTDI-XTOUT
Wire Wire Line
	6900 2650 7000 2650
Wire Wire Line
	6900 4050 7000 4050
Wire Wire Line
	7000 4050 7000 3950
Text Label 2650 3150 0    50   ~ 0
V-USB-IN
Text Label 4800 1700 0    50   ~ 0
FTDI-AVCC
Text Label 4800 2300 0    50   ~ 0
FTDI-3V3
Text Label 4700 3950 0    50   ~ 0
V-USB
Text Label 4000 1500 0    50   ~ 0
V-USB
Wire Wire Line
	4000 1500 3600 1500
$Comp
L power:+5V #PWR0199
U 1 1 5EC52E27
P 6500 1950
F 0 "#PWR0199" H 6500 1800 50  0001 C CNN
F 1 "+5V" H 6500 2090 50  0000 C CNN
F 2 "" H 6500 1950 50  0001 C CNN
F 3 "" H 6500 1950 50  0001 C CNN
	1    6500 1950
	1    0    0    -1  
$EndComp
Wire Wire Line
	6500 2050 6500 1950
Wire Wire Line
	6500 2050 6200 2050
Wire Wire Line
	6100 2050 6100 2150
Wire Wire Line
	6200 2150 6200 2050
Connection ~ 6200 2050
Wire Wire Line
	6200 2050 6100 2050
$Comp
L Device:D_TVS PG2
U 1 1 5F152259
P 2000 3700
F 0 "PG2" V 2150 3700 50  0000 L CNN
F 1 "82356050050" V 1955 3779 50  0001 L CNN
F 2 "10005011 Power Management:R0603_1" H 2000 3700 50  0001 C CNN
F 3 "https://katalog.we-online.de/pbs/datasheet/82356050050.pdf" H 2000 3700 50  0001 C CNN
F 4 "Würth Elektronik" H 2000 3700 50  0001 C CNN "Mfgr"
F 5 "82356050050" H 2000 3700 50  0001 C CNN "Mfgr_PN"
F 6 "Digi-Key" H 2000 3700 50  0001 C CNN "Source"
F 7 "732-13295-1-ND" H 2000 3700 50  0001 C CNN "Source_PN"
F 8 "VARISTOR, CMS PROTECTION ESD SURGE SUPPRESSOR,C0603" H 2000 3700 50  0001 C CNN "Description"
F 9 "10022946" H 2000 3700 50  0001 C CNN "Item Number"
	1    2000 3700
	0    1    -1   0   
$EndComp
$Comp
L Device:C C127
U 1 1 5F15225B
P 2200 3700
F 0 "C127" H 2315 3654 50  0000 L CNN
F 1 "47pF" H 2315 3745 50  0000 L CNN
F 2 "10005011 Power Management:C0402_1" H 2238 3550 50  0001 C CNN
F 3 "https://www.murata.com/~/media/webrenewal/support/library/catalog/products/capacitor/mlcc/c03e.ashx?la=en-us" H 2200 3700 50  0001 C CNN
F 4 "Murata Electronics" H 2200 3700 50  0001 C CNN "Mfgr"
F 5 "GCM1555C1H470JA16D" H 2200 3700 50  0001 C CNN "Mfgr_PN"
F 6 "Digi-Key" H 2200 3700 50  0001 C CNN "Source"
F 7 "490-10670-1-ND" H 2200 3700 50  0001 C CNN "Source_PN"
F 8 "0402" H 2315 3791 50  0001 L CNN "Bom_Footprint"
F 9 "CAP CER 47PF 50V C0G/NP0 0402" H 2200 3700 50  0001 C CNN "Description"
F 10 "C0G/NPO" H 2200 3700 50  0001 C CNN "Dielectric"
F 11 "50V" H 2200 3700 50  0001 C CNN "Voltage"
	1    2200 3700
	1    0    0    1   
$EndComp
$Comp
L Device:C C128
U 1 1 5F15225C
P 2850 3700
F 0 "C128" H 2965 3654 50  0000 L CNN
F 1 "47pF" H 2965 3745 50  0000 L CNN
F 2 "10005011 Power Management:C0402_1" H 2888 3550 50  0001 C CNN
F 3 "https://www.murata.com/~/media/webrenewal/support/library/catalog/products/capacitor/mlcc/c03e.ashx?la=en-us" H 2850 3700 50  0001 C CNN
F 4 "Murata Electronics" H 2850 3700 50  0001 C CNN "Mfgr"
F 5 "GCM1555C1H470JA16D" H 2850 3700 50  0001 C CNN "Mfgr_PN"
F 6 "Digi-Key" H 2850 3700 50  0001 C CNN "Source"
F 7 "490-10670-1-ND" H 2850 3700 50  0001 C CNN "Source_PN"
F 8 "0402" H 2965 3791 50  0001 L CNN "Bom_Footprint"
F 9 "CAP CER 47PF 50V C0G/NP0 0402" H 2850 3700 50  0001 C CNN "Description"
F 10 "C0G/NPO" H 2850 3700 50  0001 C CNN "Dielectric"
F 11 "50V" H 2850 3700 50  0001 C CNN "Voltage"
	1    2850 3700
	1    0    0    1   
$EndComp
$Comp
L 10005011_Power_Management:USB_B_Mini_2shield J1
U 1 1 5F15225D
P 1350 3350
F 0 "J1" H 1150 3700 50  0000 L CNN
F 1 "USB Mini B" V 1100 3100 50  0000 L CNN
F 2 "10005011 Power Management:MOL54819-0511_1" H 1600 3500 50  0001 C CNN
F 3 "~" H 1600 3500 50  0001 C CNN
F 4 "USB MINI B" H 1350 3350 50  0001 C CNN "Description"
F 5 "10022867" H 1350 3350 50  0001 C CNN "Item Number"
F 6 "MOLEX" H 1350 3350 50  0001 C CNN "Manufacturer"
F 7 "54819-0519" H 1350 3350 50  0001 C CNN "Manufacturer_No"
	1    1350 3350
	1    0    0    -1  
$EndComp
$Comp
L Device:Ferrite_Bead_Small L7
U 1 1 5EC7397A
P 1650 4050
F 0 "L7" V 1795 4050 50  0000 C CNN
F 1 "MH2029-221Y" V 1886 4050 50  0000 C CNN
F 2 "10005011 Power Management:C0805-AIROX-MURATA-BLM21PG221D" V 1580 4050 50  0001 C CNN
F 3 "https://www.bourns.com/docs/Product-Datasheets/mh.pdf" H 1650 4050 50  0001 C CNN
F 4 "Bourns Inc." H 1650 4050 50  0001 C CNN "Mfgr"
F 5 "MH2029-221Y" H 1650 4050 50  0001 C CNN "Mfgr_PN"
F 6 "FERRITE BEAD 220 OHM 0805 1LN" H 1650 4050 50  0001 C CNN "Description"
F 7 "Digi-Key" H 1650 4050 50  0001 C CNN "Source"
F 8 "MH2029-221YTR-ND" H 1650 4050 50  0001 C CNN "Source_PN"
F 9 "10039587" V 1650 4050 50  0001 C CNN "Item Number"
	1    1650 4050
	0    -1   1    0   
$EndComp
$Comp
L Device:Ferrite_Bead_Small L1
U 1 1 5F15225F
P 2700 1700
F 0 "L1" V 2463 1700 50  0000 C CNN
F 1 "MH2029-221Y" V 2554 1700 50  0000 C CNN
F 2 "10005011 Power Management:C0805-AIROX-MURATA-BLM21PG221D" V 2630 1700 50  0001 C CNN
F 3 "https://www.bourns.com/docs/Product-Datasheets/mh.pdf" H 2700 1700 50  0001 C CNN
F 4 "Bourns Inc." H 2700 1700 50  0001 C CNN "Mfgr"
F 5 "MH2029-221Y" H 2700 1700 50  0001 C CNN "Mfgr_PN"
F 6 "FERRITE BEAD 220 OHM 0805 1LN" H 2700 1700 50  0001 C CNN "Description"
F 7 "Digi-Key" H 2700 1700 50  0001 C CNN "Source"
F 8 "MH2029-221YTR-ND" H 2700 1700 50  0001 C CNN "Source_PN"
F 9 "0805" V 2546 1700 62  0001 C CNN "Bom_Footprint"
	1    2700 1700
	0    -1   1    0   
$EndComp
$Comp
L Device:Varistor ML1
U 1 1 5F152260
P 3300 3700
F 0 "ML1" H 3300 3550 50  0000 R CNN
F 1 "B72500T0040M060" H 3179 3700 50  0001 R CNN
F 2 "10005011 Power Management:R0603_1" V 3230 3700 50  0001 C CNN
F 3 "https://www.tdk-electronics.tdk.com/inf/75/db/CTVS_14/Standard_series.pdf" H 3300 3700 50  0001 C CNN
F 4 "Digi-Key" H 3300 3700 50  0001 C CNN "Source"
F 5 "495-2595-1-ND" H 3300 3700 50  0001 C CNN "Source_PN"
F 6 "TDK Electronics Inc." H 3300 3700 50  0001 C CNN "Mfgr"
F 7 "B72500T0040M060" H 3300 3700 50  0001 C CNN "Mfgr_PN"
F 8 "SMD VARISTOR, 5.5V,C0603" H 3300 3700 50  0001 C CNN "Description"
F 9 "" H 3179 3791 50  0001 R CNN "Bom_Footprint"
F 10 "10022926" H 3300 3700 50  0001 C CNN "Item Number"
	1    3300 3700
	-1   0    0    1   
$EndComp
Wire Wire Line
	2650 3550 2650 3450
$Comp
L Device:D_TVS PG1
U 1 1 5EC6C643
P 2650 3700
F 0 "PG1" V 2800 3700 50  0000 L CNN
F 1 "82356050050" V 2605 3779 50  0001 L CNN
F 2 "10005011 Power Management:R0603_1" H 2650 3700 50  0001 C CNN
F 3 "https://katalog.we-online.de/pbs/datasheet/82356050050.pdf" H 2650 3700 50  0001 C CNN
F 4 "Würth Elektronik" H 2650 3700 50  0001 C CNN "Mfgr"
F 5 "82356050050" H 2650 3700 50  0001 C CNN "Mfgr_PN"
F 6 "Digi-Key" H 2650 3700 50  0001 C CNN "Source"
F 7 "732-13295-1-ND" H 2650 3700 50  0001 C CNN "Source_PN"
F 8 "VARISTOR, CMS PROTECTION ESD SURGE SUPPRESSOR,C0603" H 2650 3700 50  0001 C CNN "Description"
F 9 "10022946" H 2650 3700 50  0001 C CNN "Item Number"
	1    2650 3700
	0    1    -1   0   
$EndComp
Wire Wire Line
	2650 4050 2650 3850
Wire Wire Line
	2200 4050 2650 4050
Connection ~ 2650 4050
Connection ~ 3300 4050
Wire Wire Line
	3550 3850 3550 4050
Connection ~ 3550 4050
Wire Wire Line
	3550 4050 3550 4150
Text Label 1350 3850 0    50   ~ 0
J1SHGND
$Comp
L Device:C C1
U 1 1 5F152261
P 3000 2050
F 0 "C1" H 3114 2004 50  0000 L CNN
F 1 "100nF" H 3114 2095 50  0000 L CNN
F 2 "10005011 Power Management:C0402_1" H 3038 1900 50  0001 C CNN
F 3 "https://psearch.en.murata.com/capacitor/product/GCM155R71C104KA55%23.pdf" H 3000 2050 50  0001 C CNN
F 4 "Murata Electronics" H 3000 2050 50  0001 C CNN "Mfgr"
F 5 "GCM155R71C104KA55J" H 3000 2050 50  0001 C CNN "Mfgr_PN"
F 6 "Digi-Key" H 3000 2050 50  0001 C CNN "Source"
F 7 "490-7998-1-ND" H 3000 2050 50  0001 C CNN "Source_PN"
F 8 "" H 2885 2095 50  0001 R CNN "Bom_Footprint"
F 9 "CAPACITOR,100NF,16V,+/-10%,X7R,0402" H 3000 2050 50  0001 C CNN "Description"
F 10 "X7R" H 3000 2050 50  0001 C CNN "Dielectric"
F 11 "16V" H 2885 2186 50  0001 R CNN "Voltage"
F 12 "10022607" H 3000 2050 50  0001 C CNN "Item Number"
F 13 "MURATA" H 3000 2050 50  0001 C CNN "Manufacturer"
F 14 "GRM155R71C104JA88J" H 3000 2050 50  0001 C CNN "Manufacturer_No"
	1    3000 2050
	-1   0    0    1   
$EndComp
$Comp
L Device:C C3
U 1 1 5F152262
P 3800 2050
F 0 "C3" H 3685 2004 50  0000 R CNN
F 1 "100nF" H 3685 2095 50  0000 R CNN
F 2 "10005011 Power Management:C0402_1" H 3838 1900 50  0001 C CNN
F 3 "https://psearch.en.murata.com/capacitor/product/GCM155R71C104KA55%23.pdf" H 3800 2050 50  0001 C CNN
F 4 "Murata Electronics" H 3800 2050 50  0001 C CNN "Mfgr"
F 5 "GCM155R71C104KA55J" H 3800 2050 50  0001 C CNN "Mfgr_PN"
F 6 "Digi-Key" H 3800 2050 50  0001 C CNN "Source"
F 7 "490-7998-1-ND" H 3800 2050 50  0001 C CNN "Source_PN"
F 8 "" H 3685 2095 50  0001 R CNN "Bom_Footprint"
F 9 "CAPACITOR,100NF,16V,+/-10%,X7R,0402" H 3800 2050 50  0001 C CNN "Description"
F 10 "X7R" H 3800 2050 50  0001 C CNN "Dielectric"
F 11 "16V" H 3685 2186 50  0001 R CNN "Voltage"
F 12 "10022607" H 3800 2050 50  0001 C CNN "Item Number"
F 13 "MURATA" H 3800 2050 50  0001 C CNN "Manufacturer"
F 14 "GRM155R71C104JA88J" H 3800 2050 50  0001 C CNN "Manufacturer_No"
	1    3800 2050
	-1   0    0    1   
$EndComp
$Comp
L Device:C C124
U 1 1 5ECD42AC
P 3550 3700
F 0 "C124" H 3665 3746 50  0000 L CNN
F 1 "100nF" H 3665 3655 50  0000 L CNN
F 2 "10005011 Power Management:C0402_1" H 3588 3550 50  0001 C CNN
F 3 "https://psearch.en.murata.com/capacitor/product/GCM155R71C104KA55%23.pdf" H 3550 3700 50  0001 C CNN
F 4 "Murata Electronics" H 3550 3700 50  0001 C CNN "Mfgr"
F 5 "GCM155R71C104KA55J" H 3550 3700 50  0001 C CNN "Mfgr_PN"
F 6 "Digi-Key" H 3550 3700 50  0001 C CNN "Source"
F 7 "490-7998-1-ND" H 3550 3700 50  0001 C CNN "Source_PN"
F 8 "" H 3665 3655 50  0001 L CNN "Bom_Footprint"
F 9 "CAPACITOR,100NF,16V,+/-10%,X7R,0402" H 3550 3700 50  0001 C CNN "Description"
F 10 "X7R" H 3550 3700 50  0001 C CNN "Dielectric"
F 11 "16V" H 3665 3564 50  0001 L CNN "Voltage"
F 12 "10022607" H 3550 3700 50  0001 C CNN "Item Number"
F 13 "MURATA" H 3550 3700 50  0001 C CNN "Manufacturer"
F 14 "GRM155R71C104JA88J" H 3550 3700 50  0001 C CNN "Manufacturer_No"
	1    3550 3700
	1    0    0    -1  
$EndComp
$Comp
L Device:C C5
U 1 1 5ECD5E01
P 4400 2050
F 0 "C5" H 4515 2096 50  0000 L CNN
F 1 "100nF" H 4515 2005 50  0000 L CNN
F 2 "10005011 Power Management:C0402_1" H 4438 1900 50  0001 C CNN
F 3 "https://psearch.en.murata.com/capacitor/product/GCM155R71C104KA55%23.pdf" H 4400 2050 50  0001 C CNN
F 4 "Murata Electronics" H 4400 2050 50  0001 C CNN "Mfgr"
F 5 "GCM155R71C104KA55J" H 4400 2050 50  0001 C CNN "Mfgr_PN"
F 6 "Digi-Key" H 4400 2050 50  0001 C CNN "Source"
F 7 "490-7998-1-ND" H 4400 2050 50  0001 C CNN "Source_PN"
F 8 "" H 4515 2005 50  0001 L CNN "Bom_Footprint"
F 9 "CAPACITOR,100NF,16V,+/-10%,X7R,0402" H 4400 2050 50  0001 C CNN "Description"
F 10 "X7R" H 4400 2050 50  0001 C CNN "Dielectric"
F 11 "16V" H 4515 1914 50  0001 L CNN "Voltage"
F 12 "10022607" H 4400 2050 50  0001 C CNN "Item Number"
F 13 "MURATA" H 4400 2050 50  0001 C CNN "Manufacturer"
F 14 "GRM155R71C104JA88J" H 4400 2050 50  0001 C CNN "Manufacturer_No"
	1    4400 2050
	1    0    0    -1  
$EndComp
$Comp
L Device:C C2
U 1 1 5F152265
P 3300 2050
F 0 "C2" H 3185 2004 50  0000 R CNN
F 1 "0.01uF" H 3185 2095 50  0000 R CNN
F 2 "10005011 Power Management:C0805-AIROX-KEMET-C0805C106KA3" H 3338 1900 50  0001 C CNN
F 3 "https://www.yageo.com/upload/media/product/productsearch/datasheet/mlcc/UPY-GPHC_X7R_6.3V-to-50V_18.pdf" H 3300 2050 50  0001 C CNN
F 4 "Yageo" H 3300 2050 50  0001 C CNN "Mfgr"
F 5 "CC0603KRX7R9BB103" H 3300 2050 50  0001 C CNN "Mfgr_PN"
F 6 "Digi-Key" H 3300 2050 50  0001 C CNN "Source"
F 7 "311-1085-1-ND" H 3300 2050 50  0001 C CNN "Source_PN"
F 8 "0603" H 3185 2141 50  0001 R CNN "Bom_Footprint"
F 9 "CAP CER 10000PF 50V X7R 0603" H 3300 2050 50  0001 C CNN "Description"
F 10 "X7R" H 3300 2050 50  0001 C CNN "Dielectric"
F 11 "50V" H 3300 2050 50  0001 C CNN "Voltage"
	1    3300 2050
	-1   0    0    1   
$EndComp
$Comp
L 10005011_Power_Management:DLP31SN551ML2L L8
U 1 1 5ECE0914
P 3950 3250
F 0 "L8" H 3950 3531 50  0000 C CNN
F 1 "DLP31SN551ML2L" H 3950 3440 50  0000 C CNN
F 2 "10005011 Power Management:DLP31S-AIROX_1" H 3950 3290 50  0001 C CNN
F 3 "https://www.murata.com/en-eu/products/productdata/8796756410398/EFLE0007.pdf" H 3950 3290 50  0001 C CNN
F 4 "COMMON MODE CHOKE COIL 550OHM" H 3950 3250 50  0001 C CNN "Description"
F 5 "10039588" H 3950 3250 50  0001 C CNN "Item Number"
F 6 "MURATA" H 3950 3250 50  0001 C CNN "Manufacturer"
F 7 "DLP31SN551ML2L" H 3950 3250 50  0001 C CNN "Manufacturer_No"
	1    3950 3250
	1    0    0    -1  
$EndComp
Text GLabel 11500 5200 0    50   Input ~ 0
START-5V
Text GLabel 15450 5200 0    50   Output ~ 0
MES-5V
Connection ~ 6500 2050
$Comp
L Regulator_Switching:TPS5430DDA IC11
U 1 1 5ED82DF0
P 12100 5000
F 0 "IC11" H 12100 5467 50  0000 C CNN
F 1 "TPS5430DDA" H 12100 5376 50  0000 C CNN
F 2 "10005011 Power Management:SO08-PPAD_COMPOSANT_1" H 12150 4650 50  0001 L CIN
F 3 "http://www.ti.com/lit/ds/symlink/tps5430.pdf" H 12100 5000 50  0001 C CNN
	1    12100 5000
	1    0    0    -1  
$EndComp
Wire Wire Line
	11500 5200 11600 5200
Wire Wire Line
	10150 4600 10150 4800
Wire Wire Line
	11600 4800 10650 4800
Connection ~ 10150 4800
Wire Wire Line
	10150 4800 10150 4900
Connection ~ 10650 4800
Wire Wire Line
	10650 4800 10150 4800
Wire Wire Line
	12100 5650 12100 5500
Wire Wire Line
	12000 5400 12000 5500
Wire Wire Line
	12000 5500 12100 5500
Connection ~ 12100 5500
Wire Wire Line
	12100 5500 12100 5400
Wire Wire Line
	12000 5500 10650 5500
Wire Wire Line
	10650 5500 10650 5200
Connection ~ 12000 5500
Wire Wire Line
	10650 5500 10150 5500
Wire Wire Line
	10150 5500 10150 5200
Connection ~ 10650 5500
$Comp
L Device:C C47
U 1 1 5EE61C58
P 12800 4550
F 0 "C47" H 12685 4596 50  0000 R CNN
F 1 "10nF" H 12685 4505 50  0000 R CNN
F 2 "10005011 Power Management:C0603_1" H 12838 4400 50  0001 C CNN
F 3 "http://datasheet.octopart.com/223858615636-Yageo-datasheet-500777.pdf" H 12800 4550 50  0001 C CNN
F 4 "Yageo" H 12800 4550 50  0001 C CNN "Mnf"
F 5 "" H 12800 4550 50  0001 C CNN "Mnf PN"
	1    12800 4550
	-1   0    0    -1  
$EndComp
Wire Wire Line
	12600 4800 12800 4800
Wire Wire Line
	12800 4800 12800 4700
Wire Wire Line
	12600 5000 13200 5000
Wire Wire Line
	13200 5000 13200 4300
Wire Wire Line
	13200 4300 12800 4300
Wire Wire Line
	12800 4300 12800 4400
$Comp
L 10005011_Power_Management:STPS340U D11
U 1 1 5EE9F24C
P 13400 4650
F 0 "D11" V 13354 4729 50  0000 L CNN
F 1 "STPS340U" V 13445 4729 50  0000 L CNN
F 2 "10005011 Power Management:SMB_1" H 13400 4650 50  0001 C CNN
F 3 "http://www.st.com/content/ccc/resource/technical/document/datasheet/bb/db/21/0c/04/d9/41/a5/CD00000844.pdf/files/CD00000844.pdf/jcr:content/translations/en.CD00000844.pdf" H 13400 4650 50  0001 C CNN
F 4 "Digi-Key" H 13400 4650 50  0001 C CNN "Source"
F 5 "497-2465-1-ND" H 13400 4650 50  0001 C CNN "Source_PN"
F 6 "DIODE SCHOTTKY, 3A, 40V" H 13400 4650 50  0001 C CNN "Description"
F 7 "10022656" H 13400 4650 50  0001 C CNN "Item Number"
F 8 "STMICROELECTRONICS" H 13400 4650 50  0001 C CNN "Manufacturer"
F 9 "STPS340U" H 13400 4650 50  0001 C CNN "Manufacturer_No"
	1    13400 4650
	0    1    1    0   
$EndComp
Wire Wire Line
	13200 4300 13400 4300
Wire Wire Line
	13400 4300 13400 4500
Connection ~ 13200 4300
Wire Wire Line
	13400 4300 13500 4300
Connection ~ 13400 4300
Wire Wire Line
	13800 4300 13900 4300
Wire Wire Line
	13900 4300 13900 4800
Wire Wire Line
	13900 5100 13900 5200
Wire Wire Line
	12600 5200 13900 5200
Connection ~ 13900 5200
Wire Wire Line
	13900 5200 13900 5300
Text Label 12800 4800 0    50   ~ 0
5VBOOT
Text Label 12700 5000 0    50   ~ 0
5VPH
Text Label 12700 5200 0    50   ~ 0
5V-VSENSE
Wire Wire Line
	15650 4200 15650 4300
$Comp
L 10005011_Power_Management:CP C44
U 1 1 5EFB991E
P 14200 4550
F 0 "C44" H 14318 4596 50  0000 L CNN
F 1 "220uF" H 14318 4505 50  0000 L CNN
F 2 "10005011 Power Management:C-SC8_1" H 14238 4400 50  0001 C CNN
F 3 "" H 14200 4550 50  0001 C CNN
F 4 "Panasonic" H 14200 4550 50  0001 C CNN "Mnf"
F 5 "EEEFK1C221P" H 14200 4550 50  0001 C CNN "Mnf PN"
	1    14200 4550
	1    0    0    -1  
$EndComp
Wire Wire Line
	13900 4300 14200 4300
Wire Wire Line
	15150 4300 15150 4400
Connection ~ 13900 4300
Wire Wire Line
	14700 4300 14700 4400
Connection ~ 14700 4300
Wire Wire Line
	14700 4300 15150 4300
Wire Wire Line
	14200 4300 14200 4400
Connection ~ 14200 4300
Wire Wire Line
	14200 4300 14700 4300
Wire Wire Line
	15150 4300 15650 4300
Connection ~ 15150 4300
Connection ~ 15650 4300
Wire Wire Line
	15650 4300 15650 4400
Wire Wire Line
	15650 4700 15650 5200
Wire Wire Line
	10650 4800 10650 4900
$Comp
L 10005011_Power_Management:CP C54
U 1 1 5FDD612E
P 10650 5050
F 0 "C54" H 10768 5096 50  0000 L CNN
F 1 "100uF" H 10768 5005 50  0000 L CNN
F 2 "10005011 Power Management:C-SC8_1" H 10688 4900 50  0001 C CNN
F 3 "" H 10650 5050 50  0001 C CNN
F 4 "Panasonic" H 10650 5050 50  0001 C CNN "Mnf"
F 5 "EEEFK1C221P" H 10650 5050 50  0001 C CNN "Mnf PN"
	1    10650 5050
	1    0    0    -1  
$EndComp
Wire Wire Line
	13900 5675 13900 5600
$Comp
L power:GND #PWR0200
U 1 1 5F06C4DB
P 13900 5675
F 0 "#PWR0200" H 13900 5425 50  0001 C CNN
F 1 "GND" H 14025 5575 50  0000 C CNN
F 2 "" H 13900 5675 50  0001 C CNN
F 3 "" H 13900 5675 50  0001 C CNN
	1    13900 5675
	1    0    0    -1  
$EndComp
Wire Wire Line
	15450 5200 15650 5200
Connection ~ 15650 5200
Wire Wire Line
	15650 5200 15650 5250
Wire Wire Line
	14200 4700 14200 4900
Wire Wire Line
	14200 4900 14400 4900
Wire Wire Line
	15150 4900 15150 4700
Wire Wire Line
	14700 4700 14700 4900
Connection ~ 14700 4900
Wire Wire Line
	14700 4900 15150 4900
Wire Wire Line
	14400 4975 14400 4900
$Comp
L power:GND #PWR0201
U 1 1 5F096BBE
P 14400 4975
F 0 "#PWR0201" H 14400 4725 50  0001 C CNN
F 1 "GND" H 14525 4875 50  0000 C CNN
F 2 "" H 14400 4975 50  0001 C CNN
F 3 "" H 14400 4975 50  0001 C CNN
	1    14400 4975
	1    0    0    -1  
$EndComp
Connection ~ 14400 4900
Wire Wire Line
	14400 4900 14700 4900
Text Notes 11750 7350 0    118  ~ 0
3V REFERENCE\n
Text Notes 11800 3800 0    118  ~ 0
5V REGULATOR
$Comp
L 10005011_Power_Management:LM4120AIM5-3.0 IC12
U 1 1 5F0C731D
P 12375 8350
F 0 "IC12" H 12375 8817 50  0000 C CNN
F 1 "LM4120AIM5-3.0" H 12375 8726 50  0000 C CNN
F 2 "10005011 Power Management:SOT23-5_1" H 12075 7850 50  0001 L CIN
F 3 "http://www.ti.com/lit/ds/symlink/lm4120.pdf" H 12975 7750 50  0001 C CIN
F 4 "IC,VOLTAGE REFERENCE,5MA,3V +/-2%,SOT23" H 12375 7775 50  0001 C CNN "Description"
F 5 "10022896" H 12400 7925 50  0001 C CNN "Item Number"
F 6 "NATIONAL SEMICONDUCTOR" H 12375 8350 50  0001 C CNN "Manufacturer"
F 7 "LM4120AIM5-3.0/NOPB" H 12375 8350 50  0001 C CNN "Manufacturer_No"
	1    12375 8350
	1    0    0    -1  
$EndComp
NoConn ~ 12775 8550
Text Notes 12000 1300 0    118  ~ 0
3.3V REGULATOR
Text Notes 4250 1050 0    118  ~ 0
USB/2UARTS CONVERTER
$Comp
L Regulator_Linear:LF33_TO252 IC8
U 1 1 5F102093
P 12100 1850
F 0 "IC8" H 12100 2092 50  0000 C CNN
F 1 "LF33CDT" H 12100 2001 50  0000 C CNN
F 2 "10005011 Power Management:DPAK_1" H 12100 2075 50  0001 C CIN
F 3 "http://www.st.com/content/ccc/resource/technical/document/datasheet/c4/0e/7e/2a/be/bc/4c/bd/CD00000546.pdf/files/CD00000546.pdf/jcr:content/translations/en.CD00000546.pdf" H 12100 1800 50  0001 C CNN
	1    12100 1850
	1    0    0    -1  
$EndComp
$Comp
L Device:C C34
U 1 1 5F10411B
P 13150 2100
F 0 "C34" H 13265 2054 50  0000 L CNN
F 1 "22uF" H 13265 2145 50  0000 L CNN
F 2 "10005011 Power Management:C1210_1" H 13188 1950 50  0001 C CNN
F 3 "~" H 13150 2100 50  0001 C CNN
	1    13150 2100
	1    0    0    1   
$EndComp
$Comp
L Device:C C36
U 1 1 5F107D35
P 12600 2100
F 0 "C36" H 12715 2054 50  0000 L CNN
F 1 "100nF" H 12715 2145 50  0000 L CNN
F 2 "10005011 Power Management:C0402_1" H 12638 1950 50  0001 C CNN
F 3 "~" H 12600 2100 50  0001 C CNN
F 4 "CAPACITOR,100NF,16V,+/-10%,X7R,0402" H 12600 2100 50  0001 C CNN "Description"
F 5 "10022607" H 12600 2100 50  0001 C CNN "Item Number"
F 6 "MURATA" H 12600 2100 50  0001 C CNN "Manufacturer"
F 7 "GRM155R71C104JA88J" H 12600 2100 50  0001 C CNN "Manufacturer_No"
	1    12600 2100
	1    0    0    1   
$EndComp
$Comp
L Device:C C35
U 1 1 5F1097B4
P 11600 2100
F 0 "C35" H 11486 2054 50  0000 R CNN
F 1 "100nF" H 11486 2145 50  0000 R CNN
F 2 "10005011 Power Management:C0402_1" H 11638 1950 50  0001 C CNN
F 3 "~" H 11600 2100 50  0001 C CNN
F 4 "CAPACITOR,100NF,16V,+/-10%,X7R,0402" H 11600 2100 50  0001 C CNN "Description"
F 5 "10022607" H 11600 2100 50  0001 C CNN "Item Number"
F 6 "MURATA" H 11600 2100 50  0001 C CNN "Manufacturer"
F 7 "GRM155R71C104JA88J" H 11600 2100 50  0001 C CNN "Manufacturer_No"
	1    11600 2100
	1    0    0    1   
$EndComp
Wire Wire Line
	11800 1850 11600 1850
Wire Wire Line
	11600 1850 11600 1950
$Comp
L power:+5V #PWR?
U 1 1 5F115341
P 11400 1750
AR Path="/5E88D608/5F115341" Ref="#PWR?"  Part="1" 
AR Path="/5E8E2802/5F115341" Ref="#PWR?"  Part="1" 
AR Path="/5E8F17C0/5F115341" Ref="#PWR?"  Part="1" 
AR Path="/5FDBA600/5F115341" Ref="#PWR0202"  Part="1" 
F 0 "#PWR0202" H 11400 1600 50  0001 C CNN
F 1 "+5V" H 11450 1950 50  0000 C CNN
F 2 "" H 11400 1750 50  0001 C CNN
F 3 "" H 11400 1750 50  0001 C CNN
	1    11400 1750
	1    0    0    -1  
$EndComp
$Comp
L 10005011_Power_Management:+3.3V #PWR0203
U 1 1 5F11788F
P 12800 1750
F 0 "#PWR0203" H 12800 1600 50  0001 C CNN
F 1 "+3.3V" H 12800 1890 50  0000 C CNN
F 2 "" H 12800 1750 50  0001 C CNN
F 3 "" H 12800 1750 50  0001 C CNN
	1    12800 1750
	1    0    0    -1  
$EndComp
Wire Wire Line
	12400 1850 12600 1850
Wire Wire Line
	13150 1850 13150 1950
Connection ~ 13150 1850
Wire Wire Line
	13150 1850 13350 1850
Wire Wire Line
	12600 1850 12600 1950
Connection ~ 12600 1850
Wire Wire Line
	12600 1850 12800 1850
Wire Wire Line
	11400 1750 11400 1850
Wire Wire Line
	11400 1850 11600 1850
Connection ~ 11600 1850
$Comp
L power:GND #PWR0204
U 1 1 5F145A0C
P 12300 2450
F 0 "#PWR0204" H 12300 2200 50  0001 C CNN
F 1 "GND" H 12350 2225 50  0000 C CNN
F 2 "" H 12300 2450 50  0001 C CNN
F 3 "" H 12300 2450 50  0001 C CNN
	1    12300 2450
	1    0    0    -1  
$EndComp
Wire Wire Line
	11600 2250 11600 2350
Wire Wire Line
	11600 2350 12100 2350
Wire Wire Line
	13150 2350 13150 2250
Wire Wire Line
	12600 2250 12600 2350
Connection ~ 12600 2350
Wire Wire Line
	12600 2350 13150 2350
Wire Wire Line
	12300 2350 12300 2450
Connection ~ 12300 2350
Wire Wire Line
	12300 2350 12600 2350
Wire Wire Line
	12100 2150 12100 2350
Connection ~ 12100 2350
Wire Wire Line
	12100 2350 12300 2350
$Comp
L Device:R R56
U 1 1 5F179002
P 13500 1850
F 0 "R56" V 13293 1850 50  0000 C CNN
F 1 "10k" V 13384 1850 50  0000 C CNN
F 2 "10005011 Power Management:R0603_1" V 13430 1850 50  0001 C CNN
F 3 "https://industrial.panasonic.com/cdbs/www-data/pdf/RDM0000/AOA0000C307.pdf" H 13500 1850 50  0001 C CNN
F 4 "Panasonic Electronic Components" H 13500 1850 50  0001 C CNN "Mfgr"
F 5 "ERA-3AEB103V" H 13500 1850 50  0001 C CNN "Mfgr_PN"
F 6 "Digi-Key" H 13500 1850 50  0001 C CNN "Source"
F 7 "P10KDBCT-ND" H 13500 1850 50  0001 C CNN "Source_PN"
F 8 "0603" V 13293 1850 50  0001 C CNN "Bom_Footprint"
F 9 "RES SMD 10K OHM 0.1% 1/10W 0603" H 13500 1850 50  0001 C CNN "Description"
F 10 "0.1%" V 13384 1850 50  0001 C CNN "Tolerance"
F 11 "1/10W" H 13500 1850 50  0001 C CNN "Wattage"
	1    13500 1850
	0    1    1    0   
$EndComp
Wire Wire Line
	12800 1750 12800 1850
Connection ~ 12800 1850
Wire Wire Line
	12800 1850 13150 1850
$Comp
L Device:R R57
U 1 1 5F18950E
P 13850 2100
F 0 "R57" H 13920 2146 50  0000 L CNN
F 1 "10k" H 13920 2055 50  0000 L CNN
F 2 "10005011 Power Management:R0603_1" V 13780 2100 50  0001 C CNN
F 3 "https://industrial.panasonic.com/cdbs/www-data/pdf/RDM0000/AOA0000C307.pdf" H 13850 2100 50  0001 C CNN
F 4 "Panasonic Electronic Components" H 13850 2100 50  0001 C CNN "Mfgr"
F 5 "ERA-3AEB103V" H 13850 2100 50  0001 C CNN "Mfgr_PN"
F 6 "Digi-Key" H 13850 2100 50  0001 C CNN "Source"
F 7 "P10KDBCT-ND" H 13850 2100 50  0001 C CNN "Source_PN"
F 8 "0603" H 13920 2055 50  0001 L CNN "Bom_Footprint"
F 9 "RES SMD 10K OHM 0.1% 1/10W 0603" H 13850 2100 50  0001 C CNN "Description"
F 10 "0.1%" H 13920 1964 50  0001 L CNN "Tolerance"
F 11 "1/10W" H 13850 2100 50  0001 C CNN "Wattage"
	1    13850 2100
	1    0    0    -1  
$EndComp
Wire Wire Line
	13650 1850 13850 1850
Wire Wire Line
	13850 1850 13850 1950
Wire Wire Line
	13150 2350 13850 2350
Wire Wire Line
	13850 2350 13850 2250
Connection ~ 13150 2350
Text GLabel 14050 1850 2    50   Output ~ 0
MES-3.3V
Wire Wire Line
	13850 1850 14050 1850
Connection ~ 13850 1850
$Comp
L 10005011_Power_Management:0VANA #PWR0186
U 1 1 5EA51CD6
P 11850 8800
F 0 "#PWR0186" H 11850 8550 50  0001 C CNN
F 1 "0VANA" H 11855 8627 50  0000 C CNN
F 2 "" H 11850 8800 50  0001 C CNN
F 3 "" H 11850 8800 50  0001 C CNN
	1    11850 8800
	1    0    0    -1  
$EndComp
$Comp
L 10005011_Power_Management:0VANA #PWR0187
U 1 1 5EA54662
P 13850 8750
F 0 "#PWR0187" H 13850 8500 50  0001 C CNN
F 1 "0VANA" H 13855 8577 50  0000 C CNN
F 2 "" H 13850 8750 50  0001 C CNN
F 3 "" H 13850 8750 50  0001 C CNN
	1    13850 8750
	1    0    0    -1  
$EndComp
Wire Wire Line
	7000 2650 7000 2950
Connection ~ 7750 2150
Wire Wire Line
	7700 2150 7750 2150
Wire Wire Line
	6500 2050 7200 2050
$Comp
L 10005011_Power_Management:BAT54C D16
U 1 1 5ED0D7D1
P 7500 2150
F 0 "D16" H 7450 2475 50  0000 C CNN
F 1 "BAT54C" H 7450 2384 50  0000 C CNN
F 2 "10005011 Power Management:SOT23-1G_1" H 7225 1675 50  0001 L CNN
F 3 "https://media.digikey.com/pdf/Data%20Sheets/ON%20Semiconductor%20PDFs/BAT54(A,C,S).pdf" H 7420 2250 50  0001 C CNN
F 4 "DIODE ARRAY SCHOTTKY 30V SOT23-3" H 7825 1975 60  0001 C CNN "Description"
F 5 "ON Semiconductor" H 7825 1975 60  0001 C CNN "Mfgr"
F 6 "BAT54C" H 7825 1975 60  0001 C CNN "Mfgr_PN"
F 7 "Digi-Key" H 7675 1975 60  0001 C CNN "Source"
F 8 "BAT54CFSCT-ND" H 7650 1975 60  0001 C CNN "Source_PN"
F 9 "10022653" H 7500 2150 50  0001 C CNN "Item Number"
	1    7500 2150
	1    0    0    -1  
$EndComp
Text GLabel 7100 2550 2    50   Output ~ 0
RX-UART-PIC
Text GLabel 8100 2950 2    50   Input ~ 0
TX-UART-PIC
Text GLabel 7100 4250 2    50   Output ~ 0
RTS-UART-ST
Text GLabel 8450 4150 2    50   Input ~ 0
TX-UART-ST
Text GLabel 7100 3950 2    50   Output ~ 0
RX-UART-ST
Text Label 6900 2250 0    50   ~ 0
V-USB
Text Label 7250 4450 0    50   ~ 0
V-USB
Wire Wire Line
	7250 4450 7650 4450
Text Label 7100 3150 0    50   ~ 0
V-USB
$Comp
L 10005011_Power_Management:NC7SZ66 IC26
U 1 1 5F152257
P 8000 4250
F 0 "IC26" H 7750 4500 50  0000 L CNN
F 1 "NC7SZ66" H 8050 4500 50  0000 L CNN
F 2 "10005011 Power Management:SC70-5_1" H 8000 4050 50  0001 C CNN
F 3 "https://www.onsemi.com/pub/Collateral/NC7SZ66-D.pdf" H 7350 4850 50  0001 C CNN
F 4 "IC,BUS SWITCH,SC70" H 8000 4250 50  0001 C CNN "Description"
F 5 "10039588" H 8000 4250 50  0001 C CNN "Item Number"
F 6 "FAIRCHILD SEMICONDUCTOR" H 8000 4250 50  0001 C CNN "Manufacturer"
F 7 "NC7SZ66P5X" H 8000 4250 50  0001 C CNN "Manufacturer_No"
	1    8000 4250
	1    0    0    -1  
$EndComp
$Comp
L 10005011_Power_Management:NC7SZ66 IC27
U 1 1 5F152256
P 7750 3050
F 0 "IC27" H 7500 3300 50  0000 L CNN
F 1 "NC7SZ66" H 7800 3300 50  0000 L CNN
F 2 "10005011 Power Management:SC70-5_1" H 7750 2850 50  0001 C CNN
F 3 "https://www.onsemi.com/pub/Collateral/NC7SZ66-D.pdf" H 7100 3650 50  0001 C CNN
F 4 "IC,BUS SWITCH,SC70" H 7750 3050 50  0001 C CNN "Description"
F 5 "10039588" H 7750 3050 50  0001 C CNN "Item Number"
F 6 "FAIRCHILD SEMICONDUCTOR" H 7750 3050 50  0001 C CNN "Manufacturer"
F 7 "NC7SZ66P5X" H 7750 3050 50  0001 C CNN "Manufacturer_No"
	1    7750 3050
	1    0    0    -1  
$EndComp
Text Label 8000 2150 0    50   ~ 0
TX-SW-PWR
Wire Wire Line
	7000 3950 7100 3950
Text Label 7000 2950 0    50   ~ 0
TX-PIC-SW
Wire Wire Line
	7000 2950 7500 2950
Text Label 7000 4150 0    50   ~ 0
TX-ST-SW
Wire Wire Line
	6900 4150 7750 4150
Wire Wire Line
	7650 4350 7750 4350
Wire Wire Line
	7650 4450 7650 4350
Wire Wire Line
	8000 2950 8100 2950
Connection ~ 8750 3300
Wire Wire Line
	8750 2150 8750 3300
Wire Wire Line
	7750 2150 8750 2150
Wire Wire Line
	7750 2150 7750 2750
Wire Wire Line
	8750 3300 8750 3350
Wire Wire Line
	8000 3300 8000 3950
Wire Wire Line
	8000 3300 8750 3300
Wire Wire Line
	6900 2550 7100 2550
Wire Wire Line
	8750 3650 8750 3750
$Comp
L power:GND #PWR0198
U 1 1 5F152255
P 8750 3750
F 0 "#PWR0198" H 8750 3500 50  0001 C CNN
F 1 "GND" H 8750 3600 50  0000 C CNN
F 2 "" H 8750 3750 50  0001 C CNN
F 3 "" H 8750 3750 50  0001 C CNN
	1    8750 3750
	1    0    0    -1  
$EndComp
$Comp
L Device:C C126
U 1 1 5F152254
P 8750 3500
F 0 "C126" H 8635 3454 50  0000 R CNN
F 1 "100nF" H 8635 3545 50  0000 R CNN
F 2 "10005011 Power Management:C0402_1" H 8788 3350 50  0001 C CNN
F 3 "~" H 8750 3500 50  0001 C CNN
F 4 "CAPACITOR,100NF,16V,+/-10%,X7R,0402" H 8750 3500 50  0001 C CNN "Description"
F 5 "10022607" H 8750 3500 50  0001 C CNN "Item Number"
F 6 "MURATA" H 8750 3500 50  0001 C CNN "Manufacturer"
F 7 "GRM155R71C104JA88J" H 8750 3500 50  0001 C CNN "Manufacturer_No"
	1    8750 3500
	-1   0    0    1   
$EndComp
Wire Wire Line
	7750 3350 7750 3450
$Comp
L power:GND #PWR0197
U 1 1 5EC37D9C
P 7750 3450
F 0 "#PWR0197" H 7750 3200 50  0001 C CNN
F 1 "GND" H 7750 3300 50  0000 C CNN
F 2 "" H 7750 3450 50  0001 C CNN
F 3 "" H 7750 3450 50  0001 C CNN
	1    7750 3450
	1    0    0    -1  
$EndComp
Wire Wire Line
	8000 4550 8000 4650
$Comp
L power:GND #PWR0196
U 1 1 5F152252
P 8000 4650
F 0 "#PWR0196" H 8000 4400 50  0001 C CNN
F 1 "GND" H 8000 4500 50  0000 C CNN
F 2 "" H 8000 4650 50  0001 C CNN
F 3 "" H 8000 4650 50  0001 C CNN
	1    8000 4650
	1    0    0    -1  
$EndComp
Wire Wire Line
	6900 4250 7100 4250
Wire Wire Line
	8250 4150 8450 4150
Wire Wire Line
	7100 3150 7500 3150
Wire Wire Line
	6900 2250 7200 2250
Wire Notes Line width 39
	9750 550  9750 11200
Wire Notes Line width 39
	9750 6650 16050 6650
Wire Notes Line width 39
	9750 3200 16050 3200
Wire Wire Line
	5900 2050 5800 2050
Connection ~ 5800 2050
Wire Wire Line
	5800 2050 5800 2150
Wire Wire Line
	5600 2150 5600 1700
Wire Wire Line
	5600 1700 4400 1700
Connection ~ 4400 1700
$Comp
L 10005011_Power_Management:+3.0VREF #PWR0287
U 1 1 5EA5BF85
P 14400 8100
F 0 "#PWR0287" H 14400 7950 50  0001 C CNN
F 1 "+3.0VREF" H 14415 8273 50  0000 C CNN
F 2 "" H 14400 8100 50  0001 C CNN
F 3 "" H 14400 8100 50  0001 C CNN
	1    14400 8100
	1    0    0    -1  
$EndComp
Wire Wire Line
	14400 8100 14400 8150
$EndSCHEMATC
