(module FILM18_HORIZONTAL_1 (layer F.Cu) (tedit 0)
  (attr smd)
  (fp_text reference CAM1 (at 2.032 -1.016 unlocked) (layer F.SilkS) hide
    (effects (font (size 1.332992 1.40208) (thickness 0.254)))
  )
  (fp_text value FILM18_HORIZONTAL (at 8.636 -1.016 unlocked) (layer F.SilkS) hide
    (effects (font (size 1.332992 1.40208) (thickness 0.254)))
  )
  (fp_arc (start -94.99362 75.02711) (end -95.145314 75.740776) (angle -188) (layer Dwgs.User) (width 0.2032))
  (fp_arc (start -95.26797 76.82604) (end -95.406163 77.594087) (angle -184.3) (layer Dwgs.User) (width 0.2032))
  (fp_arc (start -94.51767 73.51883) (end -91.222949 73.981873) (angle -90) (layer Dwgs.User) (width 0.00003))
  (fp_arc (start -95.1668 75.89527) (end -95.145093 75.740818) (angle -180) (layer Dwgs.User) (width 0.2032))
  (fp_arc (start -93.93915 75.753) (end -94.723524 79.475121) (angle -90) (layer Dwgs.User) (width 0.00003))
  (fp_arc (start -95.50374 78.63039) (end -95.651645 79.344596) (angle -187.4) (layer Dwgs.User) (width 0.2032))
  (fp_arc (start -95.42724 77.74864) (end -95.405535 77.594198) (angle -180) (layer Dwgs.User) (width 0.2032))
  (fp_arc (start -96.96715 75.64226) (end -96.990473 75.796476) (angle -181.2) (layer Dwgs.User) (width 0.2032))
  (fp_arc (start -95.39286 72.39454) (end -94.823789 72.426356) (angle -80.3) (layer Dwgs.User) (width 0.00003))
  (fp_arc (start -95.03478 75.03529) (end -94.343639 76.011423) (angle -122.1) (layer Dwgs.User) (width 0.00003))
  (fp_arc (start -97.2276 77.49564) (end -97.250923 77.649856) (angle -181.2) (layer Dwgs.User) (width 0.2032))
  (fp_arc (start -97.51929 70.25705) (end -98.760548 70.087019) (angle -89.5) (layer Dwgs.User) (width 0.00003))
  (fp_arc (start -95.17929 76.8385) (end -94.603571 77.86442) (angle -105.4) (layer Dwgs.User) (width 0.00003))
  (fp_arc (start -99.68359 74.36804) (end -99.627641 73.640919) (angle -172.8) (layer Dwgs.User) (width 0.2032))
  (fp_arc (start -98.15919 70.27508) (end -98.173482 69.645292) (angle -71.4) (layer Dwgs.User) (width 0.00003))
  (fp_arc (start -95.25099 78.62542) (end -94.724472 79.474607) (angle -107.8) (layer Dwgs.User) (width 0.00003))
  (fp_arc (start -100.97625 74.36801) (end -100.829612 75.082375) (angle -172.9) (layer Dwgs.User) (width 0.2032))
  (fp_arc (start -98.65555 72.1519) (end -98.568094 72.874598) (angle -182.1) (layer Dwgs.User) (width 0.00003))
  (fp_arc (start -99.99319 76.16201) (end -99.873875 75.391281) (angle -181.7) (layer Dwgs.User) (width 0.2032))
  (fp_arc (start -100.66681 76.16201) (end -100.569061 76.93577) (angle -181.7) (layer Dwgs.User) (width 0.2032))
  (fp_arc (start -99.68292 78.0431) (end -99.567784 77.324282) (angle -182.2) (layer Dwgs.User) (width 0.2032))
  (fp_arc (start -100.97759 78.04317) (end -100.890134 78.765868) (angle -182.2) (layer Dwgs.User) (width 0.2032))
  (fp_arc (start -99.3416 75.18829) (end -99.244078 75.909577) (angle -180.5) (layer Dwgs.User) (width 0.00003))
  (fp_arc (start -99.02121 76.98076) (end -98.919418 77.753948) (angle -181) (layer Dwgs.User) (width 0.00003))
  (fp_arc (start -99.8234 74.45527) (end -100.655137 74.547095) (angle -51.8) (layer Dwgs.User) (width 0.00003))
  (fp_arc (start -98.03282 79.37631) (end -98.059146 80.318782) (angle -89.8) (layer Dwgs.User) (width 0.00003))
  (fp_arc (start -100.8366 74.45527) (end -100.394408 75.165681) (angle -51.8) (layer Dwgs.User) (width 0.00003))
  (fp_arc (start -100.41564 75.93554) (end -99.64615 75.966446) (angle -90.7) (layer Dwgs.User) (width 0.00003))
  (fp_arc (start -99.94345 76.13206) (end -101.057298 76.274747) (angle -71.8) (layer Dwgs.User) (width 0.00003))
  (fp_arc (start -103.14071 70.25705) (end -102.962017 71.497091) (angle -89.5) (layer Dwgs.User) (width 0.00003))
  (fp_arc (start -99.24086 78.98034) (end -98.997547 79.812405) (angle -163.4) (layer Dwgs.User) (width 0.00003))
  (fp_arc (start -102.00497 72.15183) (end -101.889834 71.433012) (angle -182.2) (layer Dwgs.User) (width 0.00003))
  (fp_arc (start -103.68973 75.64182) (end -103.713053 75.487604) (angle -178.8) (layer Dwgs.User) (width 0.2032))
  (fp_arc (start -100.71655 76.13206) (end -100.504205 77.234751) (angle -71.8) (layer Dwgs.User) (width 0.00003))
  (fp_arc (start -102.50079 70.27505) (end -101.899367 70.087728) (angle -71.4) (layer Dwgs.User) (width 0.00003))
  (fp_arc (start -100.24435 75.93556) (end -100.265853 75.16574) (angle -90.7) (layer Dwgs.User) (width 0.00003))
  (fp_arc (start -99.86209 78.16462) (end -100.703127 78.214587) (angle -79) (layer Dwgs.User) (width 0.00003))
  (fp_arc (start -103.42928 77.4952) (end -103.452603 77.340984) (angle -178.8) (layer Dwgs.User) (width 0.2032))
  (fp_arc (start -101.31839 75.18829) (end -101.21332 74.468064) (angle -180.5) (layer Dwgs.User) (width 0.00003))
  (fp_arc (start -99.86186 77.97993) (end -100.156831 77.234919) (angle -63.1) (layer Dwgs.User) (width 0.00003))
  (fp_arc (start -100.79789 78.16464) (end -100.686464 78.999739) (angle -79) (layer Dwgs.User) (width 0.00003))
  (fp_arc (start -105.4932 75.89527) (end -105.471493 76.049722) (angle -180) (layer Dwgs.User) (width 0.2032))
  (fp_arc (start -105.66643 75.02711) (end -105.717325 74.299277) (angle -188) (layer Dwgs.User) (width 0.2032))
  (fp_arc (start -101.63879 76.98076) (end -101.523519 76.209466) (angle -181) (layer Dwgs.User) (width 0.00003))
  (fp_arc (start -105.23273 77.74864) (end -105.211025 77.903082) (angle -180) (layer Dwgs.User) (width 0.2032))
  (fp_arc (start -105.39203 76.82604) (end -105.470892 76.049655) (angle -184.3) (layer Dwgs.User) (width 0.2032))
  (fp_arc (start -100.79812 77.97992) (end -100.000286 77.905907) (angle -63.1) (layer Dwgs.User) (width 0.00003))
  (fp_arc (start -101.41912 78.98034) (end -101.423659 78.113442) (angle -163.4) (layer Dwgs.User) (width 0.00003))
  (fp_arc (start -105.15626 78.63039) (end -105.210946 77.903083) (angle -187.4) (layer Dwgs.User) (width 0.2032))
  (fp_arc (start -105.26712 72.39456) (end -105.393398 71.838744) (angle -80.3) (layer Dwgs.User) (width 0.00003))
  (fp_arc (start -102.62715 79.37628) (end -103.569605 79.404251) (angle -89.8) (layer Dwgs.User) (width 0.00003))
  (fp_arc (start -106.14234 73.51883) (end -106.605383 70.224109) (angle -90) (layer Dwgs.User) (width 0.00003))
  (fp_arc (start -105.62518 75.03529) (end -106.08482 73.931075) (angle -122.1) (layer Dwgs.User) (width 0.00003))
  (fp_arc (start -106.72084 75.75297) (end -110.44299 76.53735) (angle -90) (layer Dwgs.User) (width 0.00003))
  (fp_arc (start -105.48071 76.8385) (end -106.316909 76.011012) (angle -105.4) (layer Dwgs.User) (width 0.00003))
  (fp_arc (start -105.40902 78.62542) (end -106.056602 77.864514) (angle -107.8) (layer Dwgs.User) (width 0.00003))
  (fp_arc (start 106.73009 -76.14991) (end 106.681115 -77.800033) (angle -86.5) (layer Dwgs.User) (width 0.00003))
  (fp_arc (start 106.62991 -76.25009) (end 106.678885 -74.599967) (angle -86.5) (layer Dwgs.User) (width 0.00003))
  (fp_circle (center 106.68 -76.2) (end 108.28 -76.2) (layer Dwgs.User) (width 0.1016))
  (fp_circle (center 106.68 76.19999) (end 108.28 76.19999) (layer Dwgs.User) (width 0.1016))
  (fp_arc (start 106.62991 76.14991) (end 106.678885 77.800033) (angle -86.5) (layer Dwgs.User) (width 0.00003))
  (fp_arc (start 106.73009 76.25008) (end 106.681115 74.599957) (angle -86.5) (layer Dwgs.User) (width 0.00003))
  (fp_arc (start -106.6299 -76.14991) (end -106.678875 -77.800043) (angle -86.5) (layer Dwgs.User) (width 0.00003))
  (fp_arc (start -106.73008 -76.25009) (end -106.681106 -74.599977) (angle -86.5) (layer Dwgs.User) (width 0.00003))
  (fp_circle (center -106.67999 -76.2) (end -105.08 -76.2) (layer Dwgs.User) (width 0.1016))
  (fp_line (start 106.68 -76.2) (end 108.28 -76.2) (layer Dwgs.User) (width 0.00003))
  (fp_line (start -110.77558 74.17011) (end -109.43704 73.982) (layer Dwgs.User) (width 0.00003))
  (fp_line (start -106.299 82.296) (end -100.711 82.296) (layer Dwgs.User) (width 0.254))
  (fp_line (start 105.08 -76.2) (end 106.68 -76.2) (layer Dwgs.User) (width 0.00003))
  (fp_line (start 106.68 -74.6) (end 106.68 -76.2) (layer Dwgs.User) (width 0.00003))
  (fp_line (start 19.5 85) (end 20 85) (layer Dwgs.User) (width 0.2))
  (fp_line (start -97.6987 71.49699) (end -95.26625 71.83882) (layer Dwgs.User) (width 0.00003))
  (fp_line (start -103.56959 79.4049) (end -100.68655 78.99975) (layer Dwgs.User) (width 0.00003))
  (fp_line (start -105.00847 79.34462) (end -100.88984 78.76583) (layer Dwgs.User) (width 0.2032))
  (fp_line (start -20 85) (end -20 75) (layer Dwgs.User) (width 0.2))
  (fp_line (start 64 85) (end 64 75) (layer Dwgs.User) (width 0.2))
  (fp_line (start -91.22296 73.982) (end -89.88444 74.17011) (layer Dwgs.User) (width 0.00003))
  (fp_line (start -102.60116 80.31879) (end -98.99737 79.81235) (layer Dwgs.User) (width 0.00003))
  (fp_line (start -101.42387 78.11344) (end -100.70312 78.21472) (layer Dwgs.User) (width 0.00003))
  (fp_line (start 115 85) (end 115 -85) (layer Dwgs.User) (width 0.254))
  (fp_line (start -101.66261 79.81235) (end -98.05882 80.31879) (layer Dwgs.User) (width 0.00003))
  (fp_line (start -101.74084 77.75391) (end -100.65971 77.90583) (layer Dwgs.User) (width 0.00003))
  (fp_line (start -115 -85) (end 115 -85) (layer Dwgs.User) (width 0.254))
  (fp_line (start -103.40914 77.64987) (end -101.09241 77.32431) (layer Dwgs.User) (width 0.2032))
  (fp_line (start -99.95688 78.21472) (end -99.23613 78.11344) (layer Dwgs.User) (width 0.00003))
  (fp_line (start -101.5238 76.20942) (end -101.05727 76.27498) (layer Dwgs.User) (width 0.00003))
  (fp_line (start -103.45254 77.34098) (end -100.56951 76.93583) (layer Dwgs.User) (width 0.2032))
  (fp_line (start -90.21723 76.53832) (end -89.88444 74.17011) (layer Dwgs.User) (width 0.00003))
  (fp_line (start -101.41625 75.90953) (end -101.01386 75.96608) (layer Dwgs.User) (width 0.00003))
  (fp_line (start -100.00029 77.90583) (end -98.91916 77.75391) (layer Dwgs.User) (width 0.00003))
  (fp_line (start -99.97345 78.99975) (end -97.09041 79.4049) (layer Dwgs.User) (width 0.00003))
  (fp_line (start -100.076 82.296) (end -94.361 82.296) (layer Dwgs.User) (width 0.254))
  (fp_line (start -98.17347 69.64529) (end -94.05483 70.22408) (layer Dwgs.User) (width 0.00003))
  (fp_line (start -103.66959 75.79649) (end -100.78655 75.39135) (layer Dwgs.User) (width 0.2032))
  (fp_line (start -103.71299 75.4876) (end -100.82996 75.08245) (layer Dwgs.User) (width 0.2032))
  (fp_line (start -99.60273 76.27498) (end -99.1362 76.20942) (layer Dwgs.User) (width 0.00003))
  (fp_line (start -101.21368 74.46801) (end -100.6552 74.5465) (layer Dwgs.User) (width 0.00003))
  (fp_line (start -99.64614 75.96608) (end -99.24375 75.90953) (layer Dwgs.User) (width 0.00003))
  (fp_line (start -99.77016 78.76583) (end -95.65153 79.34462) (layer Dwgs.User) (width 0.2032))
  (fp_line (start -105.39375 71.83882) (end -102.9613 71.49699) (layer Dwgs.User) (width 0.00003))
  (fp_line (start -105.71748 74.29929) (end -101.03254 73.64093) (layer Dwgs.User) (width 0.2032))
  (fp_line (start -99.56759 77.32431) (end -97.25086 77.64987) (layer Dwgs.User) (width 0.2032))
  (fp_line (start -100.09049 76.93583) (end -97.20746 77.34098) (layer Dwgs.User) (width 0.2032))
  (fp_line (start -100.0048 74.5465) (end -99.44632 74.46801) (layer Dwgs.User) (width 0.00003))
  (fp_line (start 5.5 85) (end 5.5 80) (layer Dwgs.User) (width 0.2))
  (fp_line (start -106.60517 70.22408) (end -102.48653 69.64529) (layer Dwgs.User) (width 0.00003))
  (fp_line (start -99.87345 75.39135) (end -96.99041 75.79649) (layer Dwgs.User) (width 0.2032))
  (fp_line (start -106.08425 73.93084) (end -98.56775 72.87456) (layer Dwgs.User) (width 0.00003))
  (fp_line (start -99.83004 75.08245) (end -96.94701 75.4876) (layer Dwgs.User) (width 0.2032))
  (fp_line (start -105.83623 72.42599) (end -98.77033 71.43304) (layer Dwgs.User) (width 0.00003))
  (fp_line (start -115 85) (end 115 85) (layer Dwgs.User) (width 0.254))
  (fp_line (start -49 80) (end -49 75) (layer Dwgs.User) (width 0.2))
  (fp_line (start -5.5 85) (end -5.5 80) (layer Dwgs.User) (width 0.2))
  (fp_line (start 32 85) (end 32 75) (layer Dwgs.User) (width 0.2))
  (fp_line (start -64 85) (end 64 85) (layer Dwgs.User) (width 0.2))
  (fp_line (start -102.09225 72.87456) (end -94.57575 73.93084) (layer Dwgs.User) (width 0.00003))
  (fp_line (start -115 85) (end -115 -85) (layer Dwgs.User) (width 0.254))
  (fp_line (start -99.62746 73.64093) (end -94.94252 74.29929) (layer Dwgs.User) (width 0.2032))
  (fp_line (start -64 80) (end 64 80) (layer Dwgs.User) (width 0.2))
  (fp_line (start 106.68 76.2) (end 108.28 76.2) (layer Dwgs.User) (width 0.00003))
  (fp_line (start -106.68 -74.6) (end -106.68 -76.2) (layer Dwgs.User) (width 0.00003))
  (fp_line (start 49 80) (end 49 75) (layer Dwgs.User) (width 0.2))
  (fp_line (start -108.28 -76.2) (end -106.68 -76.2) (layer Dwgs.User) (width 0.00003))
  (fp_line (start 105.08 76.2) (end 106.68 76.2) (layer Dwgs.User) (width 0.00003))
  (fp_line (start 106.68 77.8) (end 106.68 76.2) (layer Dwgs.User) (width 0.00003))
  (fp_line (start -106.68 -76.2) (end -105.08 -76.2) (layer Dwgs.User) (width 0.00003))
  (fp_line (start -32 85) (end -32 75) (layer Dwgs.User) (width 0.2))
  (fp_line (start 20 85) (end 20 75) (layer Dwgs.User) (width 0.2))
  (fp_line (start -64 85) (end -64 75) (layer Dwgs.User) (width 0.2))
  (fp_line (start -64 75) (end 64 75) (layer Dwgs.User) (width 0.2))
  (fp_line (start -20 85) (end -19.5 85) (layer Dwgs.User) (width 0.2))
  (fp_line (start -101.88967 71.43304) (end -94.82377 72.42599) (layer Dwgs.User) (width 0.00003))
  (fp_line (start -110.77558 74.17011) (end -110.44279 76.53832) (layer Dwgs.User) (width 0.00003))
)
