(module PERCAGE-MC_TABLEAU_1 (layer F.Cu) (tedit 0)
  (attr smd)
  (fp_text reference CAM14 (at 2.54 -1.016 unlocked) (layer F.SilkS) hide
    (effects (font (size 1.332992 1.40208) (thickness 0.254)))
  )
  (fp_text value PERCAGE-MC_TABLEAU (at 9.144 -1.016 unlocked) (layer F.SilkS) hide
    (effects (font (size 1.332992 1.40208) (thickness 0.254)))
  )
  (fp_line (start 38.1 36.83) (end 38.1 16.51) (layer Dwgs.User) (width 0.25))
  (fp_line (start 0 26.67) (end 50.8 26.67) (layer Dwgs.User) (width 0.25))
  (fp_line (start 0 36.83) (end 0 16.51) (layer Dwgs.User) (width 0.25))
  (fp_line (start 0 31.75) (end 50.8 31.75) (layer Dwgs.User) (width 0.25))
  (fp_line (start 0 16.51) (end 0 11.43) (layer Dwgs.User) (width 0.25))
  (fp_line (start 12.7 16.51) (end 12.7 11.43) (layer Dwgs.User) (width 0.25))
  (fp_line (start 0 36.83) (end 50.8 36.83) (layer Dwgs.User) (width 0.25))
  (fp_line (start 25.4 36.83) (end 25.4 16.51) (layer Dwgs.User) (width 0.25))
  (fp_line (start 12.7 36.83) (end 12.7 16.51) (layer Dwgs.User) (width 0.25))
  (fp_line (start 0 3.81) (end 50.8 3.81) (layer Dwgs.User) (width 0.25))
  (fp_line (start 0 11.43) (end 0 3.81) (layer Dwgs.User) (width 0.25))
  (fp_line (start 50.8 16.51) (end 50.8 11.43) (layer Dwgs.User) (width 0.25))
  (fp_line (start 50.8 11.43) (end 50.8 3.81) (layer Dwgs.User) (width 0.25))
  (fp_line (start 0 11.43) (end 50.8 11.43) (layer Dwgs.User) (width 0.25))
  (fp_line (start 0 -2.54) (end 50.8 -2.54) (layer Dwgs.User) (width 0.25))
  (fp_line (start 50.8 36.83) (end 50.8 16.51) (layer Dwgs.User) (width 0.25))
  (fp_line (start 50.8 3.81) (end 50.8 -2.54) (layer Dwgs.User) (width 0.25))
  (fp_line (start 0 16.51) (end 50.8 16.51) (layer Dwgs.User) (width 0.25))
  (fp_line (start 38.1 16.51) (end 38.1 11.43) (layer Dwgs.User) (width 0.25))
  (fp_line (start 0 3.81) (end 0 -2.54) (layer Dwgs.User) (width 0.25))
  (fp_line (start 0 21.59) (end 50.8 21.59) (layer Dwgs.User) (width 0.25))
  (fp_line (start 25.4 16.51) (end 25.4 3.81) (layer Dwgs.User) (width 0.25))
)
