ISO-10303-21;
HEADER;
FILE_DESCRIPTION(('FreeCAD Model'),'2;1');
FILE_NAME(
'/home/huba/pCloudDrive/_Engineering projects/026 - Electronic 
parts/NR4018T100M_cp.step','2020-04-17T18:50:22',('kicad StepUp'),(
    'ksu MCAD'),'Open CASCADE STEP processor 7.4','FreeCAD','Unknown');
FILE_SCHEMA(('AUTOMOTIVE_DESIGN { 1 0 10303 214 1 1 1 1 }'));
ENDSEC;
DATA;
#1 = APPLICATION_PROTOCOL_DEFINITION('international standard',
  'automotive_design',2000,#2);
#2 = APPLICATION_CONTEXT(
  'core data for automotive mechanical design processes');
#3 = SHAPE_DEFINITION_REPRESENTATION(#4,#10);
#4 = PRODUCT_DEFINITION_SHAPE('','',#5);
#5 = PRODUCT_DEFINITION('design','',#6,#9);
#6 = PRODUCT_DEFINITION_FORMATION('','',#7);
#7 = PRODUCT('NR4018T100M_cp','NR4018T100M_cp','',(#8));
#8 = PRODUCT_CONTEXT('',#2,'mechanical');
#9 = PRODUCT_DEFINITION_CONTEXT('part definition',#2,'design');
#10 = SHAPE_REPRESENTATION('',(#11,#15,#165,#513,#861,#1151),#1697);
#11 = AXIS2_PLACEMENT_3D('',#12,#13,#14);
#12 = CARTESIAN_POINT('',(0.,0.,0.));
#13 = DIRECTION('',(0.,0.,1.));
#14 = DIRECTION('',(1.,0.,-0.));
#15 = MANIFOLD_SOLID_BREP('',#16);
#16 = CLOSED_SHELL('',(#17,#57,#88,#119,#141,#153));
#17 = ADVANCED_FACE('',(#18),#52,.T.);
#18 = FACE_BOUND('',#19,.T.);
#19 = EDGE_LOOP('',(#20,#30,#38,#46));
#20 = ORIENTED_EDGE('',*,*,#21,.T.);
#21 = EDGE_CURVE('',#22,#24,#26,.T.);
#22 = VERTEX_POINT('',#23);
#23 = CARTESIAN_POINT('',(-2.,0.9,0.));
#24 = VERTEX_POINT('',#25);
#25 = CARTESIAN_POINT('',(-2.,0.9,0.25));
#26 = LINE('',#27,#28);
#27 = CARTESIAN_POINT('',(-2.,0.9,0.));
#28 = VECTOR('',#29,1.);
#29 = DIRECTION('',(0.,0.,1.));
#30 = ORIENTED_EDGE('',*,*,#31,.T.);
#31 = EDGE_CURVE('',#24,#32,#34,.T.);
#32 = VERTEX_POINT('',#33);
#33 = CARTESIAN_POINT('',(2.,0.9,0.25));
#34 = LINE('',#35,#36);
#35 = CARTESIAN_POINT('',(-2.,0.9,0.25));
#36 = VECTOR('',#37,1.);
#37 = DIRECTION('',(1.,0.,0.));
#38 = ORIENTED_EDGE('',*,*,#39,.F.);
#39 = EDGE_CURVE('',#40,#32,#42,.T.);
#40 = VERTEX_POINT('',#41);
#41 = CARTESIAN_POINT('',(2.,0.9,0.));
#42 = LINE('',#43,#44);
#43 = CARTESIAN_POINT('',(2.,0.9,0.));
#44 = VECTOR('',#45,1.);
#45 = DIRECTION('',(0.,0.,1.));
#46 = ORIENTED_EDGE('',*,*,#47,.F.);
#47 = EDGE_CURVE('',#22,#40,#48,.T.);
#48 = LINE('',#49,#50);
#49 = CARTESIAN_POINT('',(-2.,0.9,0.));
#50 = VECTOR('',#51,1.);
#51 = DIRECTION('',(1.,0.,0.));
#52 = PLANE('',#53);
#53 = AXIS2_PLACEMENT_3D('',#54,#55,#56);
#54 = CARTESIAN_POINT('',(-2.,0.9,0.));
#55 = DIRECTION('',(0.,1.,0.));
#56 = DIRECTION('',(1.,0.,0.));
#57 = ADVANCED_FACE('',(#58),#83,.T.);
#58 = FACE_BOUND('',#59,.T.);
#59 = EDGE_LOOP('',(#60,#61,#69,#77));
#60 = ORIENTED_EDGE('',*,*,#39,.T.);
#61 = ORIENTED_EDGE('',*,*,#62,.T.);
#62 = EDGE_CURVE('',#32,#63,#65,.T.);
#63 = VERTEX_POINT('',#64);
#64 = CARTESIAN_POINT('',(2.,-0.9,0.25));
#65 = LINE('',#66,#67);
#66 = CARTESIAN_POINT('',(2.,0.9,0.25));
#67 = VECTOR('',#68,1.);
#68 = DIRECTION('',(0.,-1.,0.));
#69 = ORIENTED_EDGE('',*,*,#70,.F.);
#70 = EDGE_CURVE('',#71,#63,#73,.T.);
#71 = VERTEX_POINT('',#72);
#72 = CARTESIAN_POINT('',(2.,-0.9,0.));
#73 = LINE('',#74,#75);
#74 = CARTESIAN_POINT('',(2.,-0.9,0.));
#75 = VECTOR('',#76,1.);
#76 = DIRECTION('',(0.,0.,1.));
#77 = ORIENTED_EDGE('',*,*,#78,.F.);
#78 = EDGE_CURVE('',#40,#71,#79,.T.);
#79 = LINE('',#80,#81);
#80 = CARTESIAN_POINT('',(2.,0.9,0.));
#81 = VECTOR('',#82,1.);
#82 = DIRECTION('',(0.,-1.,0.));
#83 = PLANE('',#84);
#84 = AXIS2_PLACEMENT_3D('',#85,#86,#87);
#85 = CARTESIAN_POINT('',(2.,0.9,0.));
#86 = DIRECTION('',(1.,0.,0.));
#87 = DIRECTION('',(0.,-1.,0.));
#88 = ADVANCED_FACE('',(#89),#114,.T.);
#89 = FACE_BOUND('',#90,.T.);
#90 = EDGE_LOOP('',(#91,#92,#100,#108));
#91 = ORIENTED_EDGE('',*,*,#70,.T.);
#92 = ORIENTED_EDGE('',*,*,#93,.T.);
#93 = EDGE_CURVE('',#63,#94,#96,.T.);
#94 = VERTEX_POINT('',#95);
#95 = CARTESIAN_POINT('',(-2.,-0.9,0.25));
#96 = LINE('',#97,#98);
#97 = CARTESIAN_POINT('',(2.,-0.9,0.25));
#98 = VECTOR('',#99,1.);
#99 = DIRECTION('',(-1.,0.,0.));
#100 = ORIENTED_EDGE('',*,*,#101,.F.);
#101 = EDGE_CURVE('',#102,#94,#104,.T.);
#102 = VERTEX_POINT('',#103);
#103 = CARTESIAN_POINT('',(-2.,-0.9,0.));
#104 = LINE('',#105,#106);
#105 = CARTESIAN_POINT('',(-2.,-0.9,0.));
#106 = VECTOR('',#107,1.);
#107 = DIRECTION('',(0.,0.,1.));
#108 = ORIENTED_EDGE('',*,*,#109,.F.);
#109 = EDGE_CURVE('',#71,#102,#110,.T.);
#110 = LINE('',#111,#112);
#111 = CARTESIAN_POINT('',(2.,-0.9,0.));
#112 = VECTOR('',#113,1.);
#113 = DIRECTION('',(-1.,0.,0.));
#114 = PLANE('',#115);
#115 = AXIS2_PLACEMENT_3D('',#116,#117,#118);
#116 = CARTESIAN_POINT('',(2.,-0.9,0.));
#117 = DIRECTION('',(0.,-1.,0.));
#118 = DIRECTION('',(-1.,0.,0.));
#119 = ADVANCED_FACE('',(#120),#136,.T.);
#120 = FACE_BOUND('',#121,.T.);
#121 = EDGE_LOOP('',(#122,#123,#129,#130));
#122 = ORIENTED_EDGE('',*,*,#101,.T.);
#123 = ORIENTED_EDGE('',*,*,#124,.T.);
#124 = EDGE_CURVE('',#94,#24,#125,.T.);
#125 = LINE('',#126,#127);
#126 = CARTESIAN_POINT('',(-2.,-0.9,0.25));
#127 = VECTOR('',#128,1.);
#128 = DIRECTION('',(0.,1.,0.));
#129 = ORIENTED_EDGE('',*,*,#21,.F.);
#130 = ORIENTED_EDGE('',*,*,#131,.F.);
#131 = EDGE_CURVE('',#102,#22,#132,.T.);
#132 = LINE('',#133,#134);
#133 = CARTESIAN_POINT('',(-2.,-0.9,0.));
#134 = VECTOR('',#135,1.);
#135 = DIRECTION('',(0.,1.,0.));
#136 = PLANE('',#137);
#137 = AXIS2_PLACEMENT_3D('',#138,#139,#140);
#138 = CARTESIAN_POINT('',(-2.,-0.9,0.));
#139 = DIRECTION('',(-1.,0.,0.));
#140 = DIRECTION('',(0.,1.,0.));
#141 = ADVANCED_FACE('',(#142),#148,.T.);
#142 = FACE_BOUND('',#143,.T.);
#143 = EDGE_LOOP('',(#144,#145,#146,#147));
#144 = ORIENTED_EDGE('',*,*,#47,.T.);
#145 = ORIENTED_EDGE('',*,*,#78,.T.);
#146 = ORIENTED_EDGE('',*,*,#109,.T.);
#147 = ORIENTED_EDGE('',*,*,#131,.T.);
#148 = PLANE('',#149);
#149 = AXIS2_PLACEMENT_3D('',#150,#151,#152);
#150 = CARTESIAN_POINT('',(-4.E-17,0.,0.));
#151 = DIRECTION('',(-0.,-0.,-1.));
#152 = DIRECTION('',(-1.,0.,0.));
#153 = ADVANCED_FACE('',(#154),#160,.F.);
#154 = FACE_BOUND('',#155,.F.);
#155 = EDGE_LOOP('',(#156,#157,#158,#159));
#156 = ORIENTED_EDGE('',*,*,#31,.T.);
#157 = ORIENTED_EDGE('',*,*,#62,.T.);
#158 = ORIENTED_EDGE('',*,*,#93,.T.);
#159 = ORIENTED_EDGE('',*,*,#124,.T.);
#160 = PLANE('',#161);
#161 = AXIS2_PLACEMENT_3D('',#162,#163,#164);
#162 = CARTESIAN_POINT('',(-4.E-17,0.,0.25));
#163 = DIRECTION('',(-0.,-0.,-1.));
#164 = DIRECTION('',(-1.,0.,0.));
#165 = MANIFOLD_SOLID_BREP('',#166);
#166 = CLOSED_SHELL('',(#167,#207,#286,#310,#334,#399,#416,#433,#450,
    #467,#484,#501));
#167 = ADVANCED_FACE('',(#168),#202,.T.);
#168 = FACE_BOUND('',#169,.T.);
#169 = EDGE_LOOP('',(#170,#180,#188,#196));
#170 = ORIENTED_EDGE('',*,*,#171,.F.);
#171 = EDGE_CURVE('',#172,#174,#176,.T.);
#172 = VERTEX_POINT('',#173);
#173 = CARTESIAN_POINT('',(1.85,-1.25,0.));
#174 = VERTEX_POINT('',#175);
#175 = CARTESIAN_POINT('',(1.85,-1.8,0.));
#176 = LINE('',#177,#178);
#177 = CARTESIAN_POINT('',(1.85,-1.25,0.));
#178 = VECTOR('',#179,1.);
#179 = DIRECTION('',(0.,-1.,0.));
#180 = ORIENTED_EDGE('',*,*,#181,.T.);
#181 = EDGE_CURVE('',#172,#182,#184,.T.);
#182 = VERTEX_POINT('',#183);
#183 = CARTESIAN_POINT('',(1.85,-1.25,0.25));
#184 = LINE('',#185,#186);
#185 = CARTESIAN_POINT('',(1.85,-1.25,0.));
#186 = VECTOR('',#187,1.);
#187 = DIRECTION('',(0.,0.,1.));
#188 = ORIENTED_EDGE('',*,*,#189,.T.);
#189 = EDGE_CURVE('',#182,#190,#192,.T.);
#190 = VERTEX_POINT('',#191);
#191 = CARTESIAN_POINT('',(1.85,-1.8,0.25));
#192 = LINE('',#193,#194);
#193 = CARTESIAN_POINT('',(1.85,-1.25,0.25));
#194 = VECTOR('',#195,1.);
#195 = DIRECTION('',(0.,-1.,0.));
#196 = ORIENTED_EDGE('',*,*,#197,.F.);
#197 = EDGE_CURVE('',#174,#190,#198,.T.);
#198 = LINE('',#199,#200);
#199 = CARTESIAN_POINT('',(1.85,-1.8,0.));
#200 = VECTOR('',#201,1.);
#201 = DIRECTION('',(0.,0.,1.));
#202 = PLANE('',#203);
#203 = AXIS2_PLACEMENT_3D('',#204,#205,#206);
#204 = CARTESIAN_POINT('',(1.85,-1.25,0.));
#205 = DIRECTION('',(1.,0.,0.));
#206 = DIRECTION('',(0.,-1.,0.));
#207 = ADVANCED_FACE('',(#208),#281,.T.);
#208 = FACE_BOUND('',#209,.T.);
#209 = EDGE_LOOP('',(#210,#211,#219,#227,#235,#243,#251,#259,#267,#275)
  );
#210 = ORIENTED_EDGE('',*,*,#171,.T.);
#211 = ORIENTED_EDGE('',*,*,#212,.T.);
#212 = EDGE_CURVE('',#174,#213,#215,.T.);
#213 = VERTEX_POINT('',#214);
#214 = CARTESIAN_POINT('',(1.65,-2.,0.));
#215 = LINE('',#216,#217);
#216 = CARTESIAN_POINT('',(1.429967262872,-2.220032737128,0.));
#217 = VECTOR('',#218,1.);
#218 = DIRECTION('',(-0.707106781187,-0.707106781187,0.));
#219 = ORIENTED_EDGE('',*,*,#220,.T.);
#220 = EDGE_CURVE('',#213,#221,#223,.T.);
#221 = VERTEX_POINT('',#222);
#222 = CARTESIAN_POINT('',(-1.65,-2.,0.));
#223 = LINE('',#224,#225);
#224 = CARTESIAN_POINT('',(1.85,-2.,0.));
#225 = VECTOR('',#226,1.);
#226 = DIRECTION('',(-1.,0.,0.));
#227 = ORIENTED_EDGE('',*,*,#228,.T.);
#228 = EDGE_CURVE('',#221,#229,#231,.T.);
#229 = VERTEX_POINT('',#230);
#230 = CARTESIAN_POINT('',(-1.85,-1.8,0.));
#231 = LINE('',#232,#233);
#232 = CARTESIAN_POINT('',(-1.429967262872,-2.220032737128,0.));
#233 = VECTOR('',#234,1.);
#234 = DIRECTION('',(-0.707106781187,0.707106781187,0.));
#235 = ORIENTED_EDGE('',*,*,#236,.T.);
#236 = EDGE_CURVE('',#229,#237,#239,.T.);
#237 = VERTEX_POINT('',#238);
#238 = CARTESIAN_POINT('',(-1.85,-1.25,0.));
#239 = LINE('',#240,#241);
#240 = CARTESIAN_POINT('',(-1.85,-2.,0.));
#241 = VECTOR('',#242,1.);
#242 = DIRECTION('',(0.,1.,0.));
#243 = ORIENTED_EDGE('',*,*,#244,.T.);
#244 = EDGE_CURVE('',#237,#245,#247,.T.);
#245 = VERTEX_POINT('',#246);
#246 = CARTESIAN_POINT('',(-2.,-1.1,0.));
#247 = LINE('',#248,#249);
#248 = CARTESIAN_POINT('',(-1.85,-1.25,0.));
#249 = VECTOR('',#250,1.);
#250 = DIRECTION('',(-0.707106781187,0.707106781187,0.));
#251 = ORIENTED_EDGE('',*,*,#252,.T.);
#252 = EDGE_CURVE('',#245,#253,#255,.T.);
#253 = VERTEX_POINT('',#254);
#254 = CARTESIAN_POINT('',(-2.,-0.9,0.));
#255 = LINE('',#256,#257);
#256 = CARTESIAN_POINT('',(-2.,-1.1,0.));
#257 = VECTOR('',#258,1.);
#258 = DIRECTION('',(0.,1.,0.));
#259 = ORIENTED_EDGE('',*,*,#260,.T.);
#260 = EDGE_CURVE('',#253,#261,#263,.T.);
#261 = VERTEX_POINT('',#262);
#262 = CARTESIAN_POINT('',(2.,-0.9,0.));
#263 = LINE('',#264,#265);
#264 = CARTESIAN_POINT('',(-2.,-0.9,0.));
#265 = VECTOR('',#266,1.);
#266 = DIRECTION('',(1.,0.,0.));
#267 = ORIENTED_EDGE('',*,*,#268,.T.);
#268 = EDGE_CURVE('',#261,#269,#271,.T.);
#269 = VERTEX_POINT('',#270);
#270 = CARTESIAN_POINT('',(2.,-1.1,0.));
#271 = LINE('',#272,#273);
#272 = CARTESIAN_POINT('',(2.,-0.9,0.));
#273 = VECTOR('',#274,1.);
#274 = DIRECTION('',(0.,-1.,0.));
#275 = ORIENTED_EDGE('',*,*,#276,.T.);
#276 = EDGE_CURVE('',#269,#172,#277,.T.);
#277 = LINE('',#278,#279);
#278 = CARTESIAN_POINT('',(2.,-1.1,0.));
#279 = VECTOR('',#280,1.);
#280 = DIRECTION('',(-0.707106781187,-0.707106781187,0.));
#281 = PLANE('',#282);
#282 = AXIS2_PLACEMENT_3D('',#283,#284,#285);
#283 = CARTESIAN_POINT('',(1.E-17,-1.430130948513,0.));
#284 = DIRECTION('',(-0.,-0.,-1.));
#285 = DIRECTION('',(-1.,0.,0.));
#286 = ADVANCED_FACE('',(#287),#305,.T.);
#287 = FACE_BOUND('',#288,.T.);
#288 = EDGE_LOOP('',(#289,#290,#291,#299));
#289 = ORIENTED_EDGE('',*,*,#212,.F.);
#290 = ORIENTED_EDGE('',*,*,#197,.T.);
#291 = ORIENTED_EDGE('',*,*,#292,.T.);
#292 = EDGE_CURVE('',#190,#293,#295,.T.);
#293 = VERTEX_POINT('',#294);
#294 = CARTESIAN_POINT('',(1.65,-2.,0.25));
#295 = LINE('',#296,#297);
#296 = CARTESIAN_POINT('',(1.429967262872,-2.220032737128,0.25));
#297 = VECTOR('',#298,1.);
#298 = DIRECTION('',(-0.707106781187,-0.707106781187,0.));
#299 = ORIENTED_EDGE('',*,*,#300,.F.);
#300 = EDGE_CURVE('',#213,#293,#301,.T.);
#301 = LINE('',#302,#303);
#302 = CARTESIAN_POINT('',(1.65,-2.,0.));
#303 = VECTOR('',#304,1.);
#304 = DIRECTION('',(0.,0.,1.));
#305 = PLANE('',#306);
#306 = AXIS2_PLACEMENT_3D('',#307,#308,#309);
#307 = CARTESIAN_POINT('',(1.75,-1.9,0.));
#308 = DIRECTION('',(0.707106781187,-0.707106781187,0.));
#309 = DIRECTION('',(0.,0.,1.));
#310 = ADVANCED_FACE('',(#311),#329,.T.);
#311 = FACE_BOUND('',#312,.T.);
#312 = EDGE_LOOP('',(#313,#321,#327,#328));
#313 = ORIENTED_EDGE('',*,*,#314,.T.);
#314 = EDGE_CURVE('',#269,#315,#317,.T.);
#315 = VERTEX_POINT('',#316);
#316 = CARTESIAN_POINT('',(2.,-1.1,0.25));
#317 = LINE('',#318,#319);
#318 = CARTESIAN_POINT('',(2.,-1.1,0.));
#319 = VECTOR('',#320,1.);
#320 = DIRECTION('',(0.,0.,1.));
#321 = ORIENTED_EDGE('',*,*,#322,.T.);
#322 = EDGE_CURVE('',#315,#182,#323,.T.);
#323 = LINE('',#324,#325);
#324 = CARTESIAN_POINT('',(2.,-1.1,0.25));
#325 = VECTOR('',#326,1.);
#326 = DIRECTION('',(-0.707106781187,-0.707106781187,0.));
#327 = ORIENTED_EDGE('',*,*,#181,.F.);
#328 = ORIENTED_EDGE('',*,*,#276,.F.);
#329 = PLANE('',#330);
#330 = AXIS2_PLACEMENT_3D('',#331,#332,#333);
#331 = CARTESIAN_POINT('',(2.,-1.1,0.));
#332 = DIRECTION('',(0.707106781187,-0.707106781187,0.));
#333 = DIRECTION('',(-0.707106781187,-0.707106781187,0.));
#334 = ADVANCED_FACE('',(#335),#394,.F.);
#335 = FACE_BOUND('',#336,.F.);
#336 = EDGE_LOOP('',(#337,#338,#339,#347,#355,#363,#371,#379,#387,#393)
  );
#337 = ORIENTED_EDGE('',*,*,#189,.T.);
#338 = ORIENTED_EDGE('',*,*,#292,.T.);
#339 = ORIENTED_EDGE('',*,*,#340,.T.);
#340 = EDGE_CURVE('',#293,#341,#343,.T.);
#341 = VERTEX_POINT('',#342);
#342 = CARTESIAN_POINT('',(-1.65,-2.,0.25));
#343 = LINE('',#344,#345);
#344 = CARTESIAN_POINT('',(1.85,-2.,0.25));
#345 = VECTOR('',#346,1.);
#346 = DIRECTION('',(-1.,0.,0.));
#347 = ORIENTED_EDGE('',*,*,#348,.T.);
#348 = EDGE_CURVE('',#341,#349,#351,.T.);
#349 = VERTEX_POINT('',#350);
#350 = CARTESIAN_POINT('',(-1.85,-1.8,0.25));
#351 = LINE('',#352,#353);
#352 = CARTESIAN_POINT('',(-1.429967262872,-2.220032737128,0.25));
#353 = VECTOR('',#354,1.);
#354 = DIRECTION('',(-0.707106781187,0.707106781187,0.));
#355 = ORIENTED_EDGE('',*,*,#356,.T.);
#356 = EDGE_CURVE('',#349,#357,#359,.T.);
#357 = VERTEX_POINT('',#358);
#358 = CARTESIAN_POINT('',(-1.85,-1.25,0.25));
#359 = LINE('',#360,#361);
#360 = CARTESIAN_POINT('',(-1.85,-2.,0.25));
#361 = VECTOR('',#362,1.);
#362 = DIRECTION('',(0.,1.,0.));
#363 = ORIENTED_EDGE('',*,*,#364,.T.);
#364 = EDGE_CURVE('',#357,#365,#367,.T.);
#365 = VERTEX_POINT('',#366);
#366 = CARTESIAN_POINT('',(-2.,-1.1,0.25));
#367 = LINE('',#368,#369);
#368 = CARTESIAN_POINT('',(-1.85,-1.25,0.25));
#369 = VECTOR('',#370,1.);
#370 = DIRECTION('',(-0.707106781187,0.707106781187,0.));
#371 = ORIENTED_EDGE('',*,*,#372,.T.);
#372 = EDGE_CURVE('',#365,#373,#375,.T.);
#373 = VERTEX_POINT('',#374);
#374 = CARTESIAN_POINT('',(-2.,-0.9,0.25));
#375 = LINE('',#376,#377);
#376 = CARTESIAN_POINT('',(-2.,-1.1,0.25));
#377 = VECTOR('',#378,1.);
#378 = DIRECTION('',(0.,1.,0.));
#379 = ORIENTED_EDGE('',*,*,#380,.T.);
#380 = EDGE_CURVE('',#373,#381,#383,.T.);
#381 = VERTEX_POINT('',#382);
#382 = CARTESIAN_POINT('',(2.,-0.9,0.25));
#383 = LINE('',#384,#385);
#384 = CARTESIAN_POINT('',(-2.,-0.9,0.25));
#385 = VECTOR('',#386,1.);
#386 = DIRECTION('',(1.,0.,0.));
#387 = ORIENTED_EDGE('',*,*,#388,.T.);
#388 = EDGE_CURVE('',#381,#315,#389,.T.);
#389 = LINE('',#390,#391);
#390 = CARTESIAN_POINT('',(2.,-0.9,0.25));
#391 = VECTOR('',#392,1.);
#392 = DIRECTION('',(0.,-1.,0.));
#393 = ORIENTED_EDGE('',*,*,#322,.T.);
#394 = PLANE('',#395);
#395 = AXIS2_PLACEMENT_3D('',#396,#397,#398);
#396 = CARTESIAN_POINT('',(1.E-17,-1.430130948513,0.25));
#397 = DIRECTION('',(-0.,-0.,-1.));
#398 = DIRECTION('',(-1.,0.,0.));
#399 = ADVANCED_FACE('',(#400),#411,.T.);
#400 = FACE_BOUND('',#401,.T.);
#401 = EDGE_LOOP('',(#402,#403,#404,#405));
#402 = ORIENTED_EDGE('',*,*,#220,.F.);
#403 = ORIENTED_EDGE('',*,*,#300,.T.);
#404 = ORIENTED_EDGE('',*,*,#340,.T.);
#405 = ORIENTED_EDGE('',*,*,#406,.F.);
#406 = EDGE_CURVE('',#221,#341,#407,.T.);
#407 = LINE('',#408,#409);
#408 = CARTESIAN_POINT('',(-1.65,-2.,0.));
#409 = VECTOR('',#410,1.);
#410 = DIRECTION('',(0.,0.,1.));
#411 = PLANE('',#412);
#412 = AXIS2_PLACEMENT_3D('',#413,#414,#415);
#413 = CARTESIAN_POINT('',(1.85,-2.,0.));
#414 = DIRECTION('',(0.,-1.,0.));
#415 = DIRECTION('',(-1.,0.,0.));
#416 = ADVANCED_FACE('',(#417),#428,.T.);
#417 = FACE_BOUND('',#418,.T.);
#418 = EDGE_LOOP('',(#419,#425,#426,#427));
#419 = ORIENTED_EDGE('',*,*,#420,.T.);
#420 = EDGE_CURVE('',#261,#381,#421,.T.);
#421 = LINE('',#422,#423);
#422 = CARTESIAN_POINT('',(2.,-0.9,0.));
#423 = VECTOR('',#424,1.);
#424 = DIRECTION('',(0.,0.,1.));
#425 = ORIENTED_EDGE('',*,*,#388,.T.);
#426 = ORIENTED_EDGE('',*,*,#314,.F.);
#427 = ORIENTED_EDGE('',*,*,#268,.F.);
#428 = PLANE('',#429);
#429 = AXIS2_PLACEMENT_3D('',#430,#431,#432);
#430 = CARTESIAN_POINT('',(2.,-0.9,0.));
#431 = DIRECTION('',(1.,0.,0.));
#432 = DIRECTION('',(0.,-1.,0.));
#433 = ADVANCED_FACE('',(#434),#445,.T.);
#434 = FACE_BOUND('',#435,.T.);
#435 = EDGE_LOOP('',(#436,#437,#438,#439));
#436 = ORIENTED_EDGE('',*,*,#228,.F.);
#437 = ORIENTED_EDGE('',*,*,#406,.T.);
#438 = ORIENTED_EDGE('',*,*,#348,.T.);
#439 = ORIENTED_EDGE('',*,*,#440,.F.);
#440 = EDGE_CURVE('',#229,#349,#441,.T.);
#441 = LINE('',#442,#443);
#442 = CARTESIAN_POINT('',(-1.85,-1.8,0.));
#443 = VECTOR('',#444,1.);
#444 = DIRECTION('',(0.,0.,1.));
#445 = PLANE('',#446);
#446 = AXIS2_PLACEMENT_3D('',#447,#448,#449);
#447 = CARTESIAN_POINT('',(-1.75,-1.9,0.));
#448 = DIRECTION('',(-0.707106781187,-0.707106781187,0.));
#449 = DIRECTION('',(0.,0.,1.));
#450 = ADVANCED_FACE('',(#451),#462,.T.);
#451 = FACE_BOUND('',#452,.T.);
#452 = EDGE_LOOP('',(#453,#459,#460,#461));
#453 = ORIENTED_EDGE('',*,*,#454,.T.);
#454 = EDGE_CURVE('',#253,#373,#455,.T.);
#455 = LINE('',#456,#457);
#456 = CARTESIAN_POINT('',(-2.,-0.9,0.));
#457 = VECTOR('',#458,1.);
#458 = DIRECTION('',(0.,0.,1.));
#459 = ORIENTED_EDGE('',*,*,#380,.T.);
#460 = ORIENTED_EDGE('',*,*,#420,.F.);
#461 = ORIENTED_EDGE('',*,*,#260,.F.);
#462 = PLANE('',#463);
#463 = AXIS2_PLACEMENT_3D('',#464,#465,#466);
#464 = CARTESIAN_POINT('',(-2.,-0.9,0.));
#465 = DIRECTION('',(0.,1.,0.));
#466 = DIRECTION('',(1.,0.,0.));
#467 = ADVANCED_FACE('',(#468),#479,.T.);
#468 = FACE_BOUND('',#469,.T.);
#469 = EDGE_LOOP('',(#470,#471,#472,#473));
#470 = ORIENTED_EDGE('',*,*,#236,.F.);
#471 = ORIENTED_EDGE('',*,*,#440,.T.);
#472 = ORIENTED_EDGE('',*,*,#356,.T.);
#473 = ORIENTED_EDGE('',*,*,#474,.F.);
#474 = EDGE_CURVE('',#237,#357,#475,.T.);
#475 = LINE('',#476,#477);
#476 = CARTESIAN_POINT('',(-1.85,-1.25,0.));
#477 = VECTOR('',#478,1.);
#478 = DIRECTION('',(0.,0.,1.));
#479 = PLANE('',#480);
#480 = AXIS2_PLACEMENT_3D('',#481,#482,#483);
#481 = CARTESIAN_POINT('',(-1.85,-2.,0.));
#482 = DIRECTION('',(-1.,0.,0.));
#483 = DIRECTION('',(0.,1.,0.));
#484 = ADVANCED_FACE('',(#485),#496,.T.);
#485 = FACE_BOUND('',#486,.T.);
#486 = EDGE_LOOP('',(#487,#493,#494,#495));
#487 = ORIENTED_EDGE('',*,*,#488,.T.);
#488 = EDGE_CURVE('',#245,#365,#489,.T.);
#489 = LINE('',#490,#491);
#490 = CARTESIAN_POINT('',(-2.,-1.1,0.));
#491 = VECTOR('',#492,1.);
#492 = DIRECTION('',(0.,0.,1.));
#493 = ORIENTED_EDGE('',*,*,#372,.T.);
#494 = ORIENTED_EDGE('',*,*,#454,.F.);
#495 = ORIENTED_EDGE('',*,*,#252,.F.);
#496 = PLANE('',#497);
#497 = AXIS2_PLACEMENT_3D('',#498,#499,#500);
#498 = CARTESIAN_POINT('',(-2.,-1.1,0.));
#499 = DIRECTION('',(-1.,0.,0.));
#500 = DIRECTION('',(0.,1.,0.));
#501 = ADVANCED_FACE('',(#502),#508,.T.);
#502 = FACE_BOUND('',#503,.T.);
#503 = EDGE_LOOP('',(#504,#505,#506,#507));
#504 = ORIENTED_EDGE('',*,*,#474,.T.);
#505 = ORIENTED_EDGE('',*,*,#364,.T.);
#506 = ORIENTED_EDGE('',*,*,#488,.F.);
#507 = ORIENTED_EDGE('',*,*,#244,.F.);
#508 = PLANE('',#509);
#509 = AXIS2_PLACEMENT_3D('',#510,#511,#512);
#510 = CARTESIAN_POINT('',(-1.85,-1.25,0.));
#511 = DIRECTION('',(-0.707106781187,-0.707106781187,0.));
#512 = DIRECTION('',(-0.707106781187,0.707106781187,0.));
#513 = MANIFOLD_SOLID_BREP('',#514);
#514 = CLOSED_SHELL('',(#515,#555,#634,#658,#682,#747,#764,#781,#798,
    #815,#832,#849));
#515 = ADVANCED_FACE('',(#516),#550,.T.);
#516 = FACE_BOUND('',#517,.F.);
#517 = EDGE_LOOP('',(#518,#528,#536,#544));
#518 = ORIENTED_EDGE('',*,*,#519,.F.);
#519 = EDGE_CURVE('',#520,#522,#524,.T.);
#520 = VERTEX_POINT('',#521);
#521 = CARTESIAN_POINT('',(1.85,1.25,1.E-15));
#522 = VERTEX_POINT('',#523);
#523 = CARTESIAN_POINT('',(1.85,1.8,8.02E-16));
#524 = LINE('',#525,#526);
#525 = CARTESIAN_POINT('',(1.85,1.25,5.6E-16));
#526 = VECTOR('',#527,1.);
#527 = DIRECTION('',(0.,1.,4.4E-16));
#528 = ORIENTED_EDGE('',*,*,#529,.T.);
#529 = EDGE_CURVE('',#520,#530,#532,.T.);
#530 = VERTEX_POINT('',#531);
#531 = CARTESIAN_POINT('',(1.85,1.25,0.25));
#532 = LINE('',#533,#534);
#533 = CARTESIAN_POINT('',(1.85,1.25,5.6E-16));
#534 = VECTOR('',#535,1.);
#535 = DIRECTION('',(0.,-4.4E-16,1.));
#536 = ORIENTED_EDGE('',*,*,#537,.T.);
#537 = EDGE_CURVE('',#530,#538,#540,.T.);
#538 = VERTEX_POINT('',#539);
#539 = CARTESIAN_POINT('',(1.85,1.8,0.25));
#540 = LINE('',#541,#542);
#541 = CARTESIAN_POINT('',(1.85,1.25,0.25));
#542 = VECTOR('',#543,1.);
#543 = DIRECTION('',(0.,1.,4.4E-16));
#544 = ORIENTED_EDGE('',*,*,#545,.F.);
#545 = EDGE_CURVE('',#522,#538,#546,.T.);
#546 = LINE('',#547,#548);
#547 = CARTESIAN_POINT('',(1.85,1.8,8.02E-16));
#548 = VECTOR('',#549,1.);
#549 = DIRECTION('',(0.,-4.4E-16,1.));
#550 = PLANE('',#551);
#551 = AXIS2_PLACEMENT_3D('',#552,#553,#554);
#552 = CARTESIAN_POINT('',(1.85,1.25,5.6E-16));
#553 = DIRECTION('',(1.,0.,0.));
#554 = DIRECTION('',(-0.,-1.,-4.4E-16));
#555 = ADVANCED_FACE('',(#556),#629,.T.);
#556 = FACE_BOUND('',#557,.F.);
#557 = EDGE_LOOP('',(#558,#559,#567,#575,#583,#591,#599,#607,#615,#623)
  );
#558 = ORIENTED_EDGE('',*,*,#519,.T.);
#559 = ORIENTED_EDGE('',*,*,#560,.T.);
#560 = EDGE_CURVE('',#522,#561,#563,.T.);
#561 = VERTEX_POINT('',#562);
#562 = CARTESIAN_POINT('',(1.65,2.,8.9E-16));
#563 = LINE('',#564,#565);
#564 = CARTESIAN_POINT('',(1.429967262872,2.220032737128,
    9.875567869906E-16));
#565 = VECTOR('',#566,1.);
#566 = DIRECTION('',(-0.707106781187,0.707106781187,3.111269837221E-16)
  );
#567 = ORIENTED_EDGE('',*,*,#568,.T.);
#568 = EDGE_CURVE('',#561,#569,#571,.T.);
#569 = VERTEX_POINT('',#570);
#570 = CARTESIAN_POINT('',(-1.65,2.,8.9E-16));
#571 = LINE('',#572,#573);
#572 = CARTESIAN_POINT('',(1.85,2.,8.9E-16));
#573 = VECTOR('',#574,1.);
#574 = DIRECTION('',(-1.,-0.,-0.));
#575 = ORIENTED_EDGE('',*,*,#576,.T.);
#576 = EDGE_CURVE('',#569,#577,#579,.T.);
#577 = VERTEX_POINT('',#578);
#578 = CARTESIAN_POINT('',(-1.85,1.8,8.02E-16));
#579 = LINE('',#580,#581);
#580 = CARTESIAN_POINT('',(-1.429967262872,2.220032737128,
    9.875567869906E-16));
#581 = VECTOR('',#582,1.);
#582 = DIRECTION('',(-0.707106781187,-0.707106781187,-3.111269837221E-16
    ));
#583 = ORIENTED_EDGE('',*,*,#584,.T.);
#584 = EDGE_CURVE('',#577,#585,#587,.T.);
#585 = VERTEX_POINT('',#586);
#586 = CARTESIAN_POINT('',(-1.85,1.25,1.E-15));
#587 = LINE('',#588,#589);
#588 = CARTESIAN_POINT('',(-1.85,2.,8.9E-16));
#589 = VECTOR('',#590,1.);
#590 = DIRECTION('',(-0.,-1.,-4.4E-16));
#591 = ORIENTED_EDGE('',*,*,#592,.T.);
#592 = EDGE_CURVE('',#585,#593,#595,.T.);
#593 = VERTEX_POINT('',#594);
#594 = CARTESIAN_POINT('',(-2.,1.1,0.));
#595 = LINE('',#596,#597);
#596 = CARTESIAN_POINT('',(-1.85,1.25,5.6E-16));
#597 = VECTOR('',#598,1.);
#598 = DIRECTION('',(-0.707106781187,-0.707106781187,-3.1E-16));
#599 = ORIENTED_EDGE('',*,*,#600,.T.);
#600 = EDGE_CURVE('',#593,#601,#603,.T.);
#601 = VERTEX_POINT('',#602);
#602 = CARTESIAN_POINT('',(-2.,0.9,0.));
#603 = LINE('',#604,#605);
#604 = CARTESIAN_POINT('',(-2.,1.1,4.9E-16));
#605 = VECTOR('',#606,1.);
#606 = DIRECTION('',(-0.,-1.,-4.4E-16));
#607 = ORIENTED_EDGE('',*,*,#608,.T.);
#608 = EDGE_CURVE('',#601,#609,#611,.T.);
#609 = VERTEX_POINT('',#610);
#610 = CARTESIAN_POINT('',(2.,0.9,0.));
#611 = LINE('',#612,#613);
#612 = CARTESIAN_POINT('',(-2.,0.9,4.E-16));
#613 = VECTOR('',#614,1.);
#614 = DIRECTION('',(1.,0.,0.));
#615 = ORIENTED_EDGE('',*,*,#616,.T.);
#616 = EDGE_CURVE('',#609,#617,#619,.T.);
#617 = VERTEX_POINT('',#618);
#618 = CARTESIAN_POINT('',(2.,1.1,0.));
#619 = LINE('',#620,#621);
#620 = CARTESIAN_POINT('',(2.,0.9,4.E-16));
#621 = VECTOR('',#622,1.);
#622 = DIRECTION('',(0.,1.,4.4E-16));
#623 = ORIENTED_EDGE('',*,*,#624,.T.);
#624 = EDGE_CURVE('',#617,#520,#625,.T.);
#625 = LINE('',#626,#627);
#626 = CARTESIAN_POINT('',(2.,1.1,4.9E-16));
#627 = VECTOR('',#628,1.);
#628 = DIRECTION('',(-0.707106781187,0.707106781187,3.1E-16));
#629 = PLANE('',#630);
#630 = AXIS2_PLACEMENT_3D('',#631,#632,#633);
#631 = CARTESIAN_POINT('',(1.E-17,1.430130948513,6.4E-16));
#632 = DIRECTION('',(0.,4.4E-16,-1.));
#633 = DIRECTION('',(1.,0.,0.));
#634 = ADVANCED_FACE('',(#635),#653,.T.);
#635 = FACE_BOUND('',#636,.F.);
#636 = EDGE_LOOP('',(#637,#638,#639,#647));
#637 = ORIENTED_EDGE('',*,*,#560,.F.);
#638 = ORIENTED_EDGE('',*,*,#545,.T.);
#639 = ORIENTED_EDGE('',*,*,#640,.T.);
#640 = EDGE_CURVE('',#538,#641,#643,.T.);
#641 = VERTEX_POINT('',#642);
#642 = CARTESIAN_POINT('',(1.65,2.,0.25));
#643 = LINE('',#644,#645);
#644 = CARTESIAN_POINT('',(1.429967262872,2.220032737128,0.25));
#645 = VECTOR('',#646,1.);
#646 = DIRECTION('',(-0.707106781187,0.707106781187,3.111269837221E-16)
  );
#647 = ORIENTED_EDGE('',*,*,#648,.F.);
#648 = EDGE_CURVE('',#561,#641,#649,.T.);
#649 = LINE('',#650,#651);
#650 = CARTESIAN_POINT('',(1.65,2.,8.9E-16));
#651 = VECTOR('',#652,1.);
#652 = DIRECTION('',(0.,-4.4E-16,1.));
#653 = PLANE('',#654);
#654 = AXIS2_PLACEMENT_3D('',#655,#656,#657);
#655 = CARTESIAN_POINT('',(1.75,1.9,8.46E-16));
#656 = DIRECTION('',(0.707106781187,0.707106781187,3.141105180227E-16));
#657 = DIRECTION('',(2.109677335877E-18,4.421096773359E-16,-1.));
#658 = ADVANCED_FACE('',(#659),#677,.T.);
#659 = FACE_BOUND('',#660,.F.);
#660 = EDGE_LOOP('',(#661,#669,#675,#676));
#661 = ORIENTED_EDGE('',*,*,#662,.T.);
#662 = EDGE_CURVE('',#617,#663,#665,.T.);
#663 = VERTEX_POINT('',#664);
#664 = CARTESIAN_POINT('',(2.,1.1,0.25));
#665 = LINE('',#666,#667);
#666 = CARTESIAN_POINT('',(2.,1.1,4.9E-16));
#667 = VECTOR('',#668,1.);
#668 = DIRECTION('',(0.,-4.4E-16,1.));
#669 = ORIENTED_EDGE('',*,*,#670,.T.);
#670 = EDGE_CURVE('',#663,#530,#671,.T.);
#671 = LINE('',#672,#673);
#672 = CARTESIAN_POINT('',(2.,1.1,0.25));
#673 = VECTOR('',#674,1.);
#674 = DIRECTION('',(-0.707106781187,0.707106781187,3.1E-16));
#675 = ORIENTED_EDGE('',*,*,#529,.F.);
#676 = ORIENTED_EDGE('',*,*,#624,.F.);
#677 = PLANE('',#678);
#678 = AXIS2_PLACEMENT_3D('',#679,#680,#681);
#679 = CARTESIAN_POINT('',(2.,1.1,4.9E-16));
#680 = DIRECTION('',(0.707106781187,0.707106781187,3.1E-16));
#681 = DIRECTION('',(0.707106781187,-0.707106781187,-3.1E-16));
#682 = ADVANCED_FACE('',(#683),#742,.F.);
#683 = FACE_BOUND('',#684,.T.);
#684 = EDGE_LOOP('',(#685,#686,#687,#695,#703,#711,#719,#727,#735,#741)
  );
#685 = ORIENTED_EDGE('',*,*,#537,.T.);
#686 = ORIENTED_EDGE('',*,*,#640,.T.);
#687 = ORIENTED_EDGE('',*,*,#688,.T.);
#688 = EDGE_CURVE('',#641,#689,#691,.T.);
#689 = VERTEX_POINT('',#690);
#690 = CARTESIAN_POINT('',(-1.65,2.,0.25));
#691 = LINE('',#692,#693);
#692 = CARTESIAN_POINT('',(1.85,2.,0.25));
#693 = VECTOR('',#694,1.);
#694 = DIRECTION('',(-1.,-0.,-0.));
#695 = ORIENTED_EDGE('',*,*,#696,.T.);
#696 = EDGE_CURVE('',#689,#697,#699,.T.);
#697 = VERTEX_POINT('',#698);
#698 = CARTESIAN_POINT('',(-1.85,1.8,0.25));
#699 = LINE('',#700,#701);
#700 = CARTESIAN_POINT('',(-1.429967262872,2.220032737128,0.25));
#701 = VECTOR('',#702,1.);
#702 = DIRECTION('',(-0.707106781187,-0.707106781187,-3.111269837221E-16
    ));
#703 = ORIENTED_EDGE('',*,*,#704,.T.);
#704 = EDGE_CURVE('',#697,#705,#707,.T.);
#705 = VERTEX_POINT('',#706);
#706 = CARTESIAN_POINT('',(-1.85,1.25,0.25));
#707 = LINE('',#708,#709);
#708 = CARTESIAN_POINT('',(-1.85,2.,0.25));
#709 = VECTOR('',#710,1.);
#710 = DIRECTION('',(-0.,-1.,-4.4E-16));
#711 = ORIENTED_EDGE('',*,*,#712,.T.);
#712 = EDGE_CURVE('',#705,#713,#715,.T.);
#713 = VERTEX_POINT('',#714);
#714 = CARTESIAN_POINT('',(-2.,1.1,0.25));
#715 = LINE('',#716,#717);
#716 = CARTESIAN_POINT('',(-1.85,1.25,0.25));
#717 = VECTOR('',#718,1.);
#718 = DIRECTION('',(-0.707106781187,-0.707106781187,-3.1E-16));
#719 = ORIENTED_EDGE('',*,*,#720,.T.);
#720 = EDGE_CURVE('',#713,#721,#723,.T.);
#721 = VERTEX_POINT('',#722);
#722 = CARTESIAN_POINT('',(-2.,0.9,0.25));
#723 = LINE('',#724,#725);
#724 = CARTESIAN_POINT('',(-2.,1.1,0.25));
#725 = VECTOR('',#726,1.);
#726 = DIRECTION('',(-0.,-1.,-4.4E-16));
#727 = ORIENTED_EDGE('',*,*,#728,.T.);
#728 = EDGE_CURVE('',#721,#729,#731,.T.);
#729 = VERTEX_POINT('',#730);
#730 = CARTESIAN_POINT('',(2.,0.9,0.25));
#731 = LINE('',#732,#733);
#732 = CARTESIAN_POINT('',(-2.,0.9,0.25));
#733 = VECTOR('',#734,1.);
#734 = DIRECTION('',(1.,0.,0.));
#735 = ORIENTED_EDGE('',*,*,#736,.T.);
#736 = EDGE_CURVE('',#729,#663,#737,.T.);
#737 = LINE('',#738,#739);
#738 = CARTESIAN_POINT('',(2.,0.9,0.25));
#739 = VECTOR('',#740,1.);
#740 = DIRECTION('',(0.,1.,4.4E-16));
#741 = ORIENTED_EDGE('',*,*,#670,.T.);
#742 = PLANE('',#743);
#743 = AXIS2_PLACEMENT_3D('',#744,#745,#746);
#744 = CARTESIAN_POINT('',(1.E-17,1.430130948513,0.25));
#745 = DIRECTION('',(0.,4.4E-16,-1.));
#746 = DIRECTION('',(1.,0.,0.));
#747 = ADVANCED_FACE('',(#748),#759,.T.);
#748 = FACE_BOUND('',#749,.F.);
#749 = EDGE_LOOP('',(#750,#751,#752,#753));
#750 = ORIENTED_EDGE('',*,*,#568,.F.);
#751 = ORIENTED_EDGE('',*,*,#648,.T.);
#752 = ORIENTED_EDGE('',*,*,#688,.T.);
#753 = ORIENTED_EDGE('',*,*,#754,.F.);
#754 = EDGE_CURVE('',#569,#689,#755,.T.);
#755 = LINE('',#756,#757);
#756 = CARTESIAN_POINT('',(-1.65,2.,8.9E-16));
#757 = VECTOR('',#758,1.);
#758 = DIRECTION('',(0.,-4.4E-16,1.));
#759 = PLANE('',#760);
#760 = AXIS2_PLACEMENT_3D('',#761,#762,#763);
#761 = CARTESIAN_POINT('',(1.85,2.,8.9E-16));
#762 = DIRECTION('',(0.,1.,4.4E-16));
#763 = DIRECTION('',(1.,0.,0.));
#764 = ADVANCED_FACE('',(#765),#776,.T.);
#765 = FACE_BOUND('',#766,.F.);
#766 = EDGE_LOOP('',(#767,#773,#774,#775));
#767 = ORIENTED_EDGE('',*,*,#768,.T.);
#768 = EDGE_CURVE('',#609,#729,#769,.T.);
#769 = LINE('',#770,#771);
#770 = CARTESIAN_POINT('',(2.,0.9,4.E-16));
#771 = VECTOR('',#772,1.);
#772 = DIRECTION('',(0.,-4.4E-16,1.));
#773 = ORIENTED_EDGE('',*,*,#736,.T.);
#774 = ORIENTED_EDGE('',*,*,#662,.F.);
#775 = ORIENTED_EDGE('',*,*,#616,.F.);
#776 = PLANE('',#777);
#777 = AXIS2_PLACEMENT_3D('',#778,#779,#780);
#778 = CARTESIAN_POINT('',(2.,0.9,4.E-16));
#779 = DIRECTION('',(1.,0.,0.));
#780 = DIRECTION('',(-0.,-1.,-4.4E-16));
#781 = ADVANCED_FACE('',(#782),#793,.T.);
#782 = FACE_BOUND('',#783,.F.);
#783 = EDGE_LOOP('',(#784,#785,#786,#787));
#784 = ORIENTED_EDGE('',*,*,#576,.F.);
#785 = ORIENTED_EDGE('',*,*,#754,.T.);
#786 = ORIENTED_EDGE('',*,*,#696,.T.);
#787 = ORIENTED_EDGE('',*,*,#788,.F.);
#788 = EDGE_CURVE('',#577,#697,#789,.T.);
#789 = LINE('',#790,#791);
#790 = CARTESIAN_POINT('',(-1.85,1.8,8.02E-16));
#791 = VECTOR('',#792,1.);
#792 = DIRECTION('',(0.,-4.4E-16,1.));
#793 = PLANE('',#794);
#794 = AXIS2_PLACEMENT_3D('',#795,#796,#797);
#795 = CARTESIAN_POINT('',(-1.75,1.9,8.46E-16));
#796 = DIRECTION('',(-0.707106781187,0.707106781187,3.141105180227E-16)
  );
#797 = DIRECTION('',(-2.109677335877E-18,4.421096773359E-16,-1.));
#798 = ADVANCED_FACE('',(#799),#810,.T.);
#799 = FACE_BOUND('',#800,.F.);
#800 = EDGE_LOOP('',(#801,#807,#808,#809));
#801 = ORIENTED_EDGE('',*,*,#802,.T.);
#802 = EDGE_CURVE('',#601,#721,#803,.T.);
#803 = LINE('',#804,#805);
#804 = CARTESIAN_POINT('',(-2.,0.9,4.E-16));
#805 = VECTOR('',#806,1.);
#806 = DIRECTION('',(0.,-4.4E-16,1.));
#807 = ORIENTED_EDGE('',*,*,#728,.T.);
#808 = ORIENTED_EDGE('',*,*,#768,.F.);
#809 = ORIENTED_EDGE('',*,*,#608,.F.);
#810 = PLANE('',#811);
#811 = AXIS2_PLACEMENT_3D('',#812,#813,#814);
#812 = CARTESIAN_POINT('',(-2.,0.9,4.E-16));
#813 = DIRECTION('',(-0.,-1.,-4.4E-16));
#814 = DIRECTION('',(-1.,0.,0.));
#815 = ADVANCED_FACE('',(#816),#827,.T.);
#816 = FACE_BOUND('',#817,.F.);
#817 = EDGE_LOOP('',(#818,#819,#820,#821));
#818 = ORIENTED_EDGE('',*,*,#584,.F.);
#819 = ORIENTED_EDGE('',*,*,#788,.T.);
#820 = ORIENTED_EDGE('',*,*,#704,.T.);
#821 = ORIENTED_EDGE('',*,*,#822,.F.);
#822 = EDGE_CURVE('',#585,#705,#823,.T.);
#823 = LINE('',#824,#825);
#824 = CARTESIAN_POINT('',(-1.85,1.25,5.6E-16));
#825 = VECTOR('',#826,1.);
#826 = DIRECTION('',(0.,-4.4E-16,1.));
#827 = PLANE('',#828);
#828 = AXIS2_PLACEMENT_3D('',#829,#830,#831);
#829 = CARTESIAN_POINT('',(-1.85,2.,8.9E-16));
#830 = DIRECTION('',(-1.,-0.,-0.));
#831 = DIRECTION('',(0.,1.,4.4E-16));
#832 = ADVANCED_FACE('',(#833),#844,.T.);
#833 = FACE_BOUND('',#834,.F.);
#834 = EDGE_LOOP('',(#835,#841,#842,#843));
#835 = ORIENTED_EDGE('',*,*,#836,.T.);
#836 = EDGE_CURVE('',#593,#713,#837,.T.);
#837 = LINE('',#838,#839);
#838 = CARTESIAN_POINT('',(-2.,1.1,4.9E-16));
#839 = VECTOR('',#840,1.);
#840 = DIRECTION('',(0.,-4.4E-16,1.));
#841 = ORIENTED_EDGE('',*,*,#720,.T.);
#842 = ORIENTED_EDGE('',*,*,#802,.F.);
#843 = ORIENTED_EDGE('',*,*,#600,.F.);
#844 = PLANE('',#845);
#845 = AXIS2_PLACEMENT_3D('',#846,#847,#848);
#846 = CARTESIAN_POINT('',(-2.,1.1,4.9E-16));
#847 = DIRECTION('',(-1.,-0.,-0.));
#848 = DIRECTION('',(0.,1.,4.4E-16));
#849 = ADVANCED_FACE('',(#850),#856,.T.);
#850 = FACE_BOUND('',#851,.F.);
#851 = EDGE_LOOP('',(#852,#853,#854,#855));
#852 = ORIENTED_EDGE('',*,*,#822,.T.);
#853 = ORIENTED_EDGE('',*,*,#712,.T.);
#854 = ORIENTED_EDGE('',*,*,#836,.F.);
#855 = ORIENTED_EDGE('',*,*,#592,.F.);
#856 = PLANE('',#857);
#857 = AXIS2_PLACEMENT_3D('',#858,#859,#860);
#858 = CARTESIAN_POINT('',(-1.85,1.25,5.6E-16));
#859 = DIRECTION('',(-0.707106781187,0.707106781187,3.1E-16));
#860 = DIRECTION('',(0.707106781187,0.707106781187,3.1E-16));
#861 = MANIFOLD_SOLID_BREP('',#862);
#862 = CLOSED_SHELL('',(#863,#903,#936,#967,#1000,#1031,#1064,#1095,
    #1119,#1135));
#863 = ADVANCED_FACE('',(#864),#898,.T.);
#864 = FACE_BOUND('',#865,.T.);
#865 = EDGE_LOOP('',(#866,#876,#884,#892));
#866 = ORIENTED_EDGE('',*,*,#867,.T.);
#867 = EDGE_CURVE('',#868,#870,#872,.T.);
#868 = VERTEX_POINT('',#869);
#869 = CARTESIAN_POINT('',(-1.85,-0.95,0.25));
#870 = VERTEX_POINT('',#871);
#871 = CARTESIAN_POINT('',(-1.85,-0.95,1.55));
#872 = LINE('',#873,#874);
#873 = CARTESIAN_POINT('',(-1.85,-0.95,0.25));
#874 = VECTOR('',#875,1.);
#875 = DIRECTION('',(0.,0.,1.));
#876 = ORIENTED_EDGE('',*,*,#877,.T.);
#877 = EDGE_CURVE('',#870,#878,#880,.T.);
#878 = VERTEX_POINT('',#879);
#879 = CARTESIAN_POINT('',(-1.85,0.95,1.55));
#880 = LINE('',#881,#882);
#881 = CARTESIAN_POINT('',(-1.85,-0.95,1.55));
#882 = VECTOR('',#883,1.);
#883 = DIRECTION('',(0.,1.,0.));
#884 = ORIENTED_EDGE('',*,*,#885,.F.);
#885 = EDGE_CURVE('',#886,#878,#888,.T.);
#886 = VERTEX_POINT('',#887);
#887 = CARTESIAN_POINT('',(-1.85,0.95,0.25));
#888 = LINE('',#889,#890);
#889 = CARTESIAN_POINT('',(-1.85,0.95,0.25));
#890 = VECTOR('',#891,1.);
#891 = DIRECTION('',(0.,0.,1.));
#892 = ORIENTED_EDGE('',*,*,#893,.F.);
#893 = EDGE_CURVE('',#868,#886,#894,.T.);
#894 = LINE('',#895,#896);
#895 = CARTESIAN_POINT('',(-1.85,-0.95,0.25));
#896 = VECTOR('',#897,1.);
#897 = DIRECTION('',(0.,1.,0.));
#898 = PLANE('',#899);
#899 = AXIS2_PLACEMENT_3D('',#900,#901,#902);
#900 = CARTESIAN_POINT('',(-1.85,-0.95,0.25));
#901 = DIRECTION('',(-1.,0.,0.));
#902 = DIRECTION('',(0.,1.,0.));
#903 = ADVANCED_FACE('',(#904),#931,.T.);
#904 = FACE_BOUND('',#905,.F.);
#905 = EDGE_LOOP('',(#906,#916,#923,#924));
#906 = ORIENTED_EDGE('',*,*,#907,.T.);
#907 = EDGE_CURVE('',#908,#910,#912,.T.);
#908 = VERTEX_POINT('',#909);
#909 = CARTESIAN_POINT('',(-1.55,1.25,0.25));
#910 = VERTEX_POINT('',#911);
#911 = CARTESIAN_POINT('',(-1.55,1.25,1.55));
#912 = LINE('',#913,#914);
#913 = CARTESIAN_POINT('',(-1.55,1.25,0.25));
#914 = VECTOR('',#915,1.);
#915 = DIRECTION('',(0.,0.,1.));
#916 = ORIENTED_EDGE('',*,*,#917,.T.);
#917 = EDGE_CURVE('',#910,#878,#918,.T.);
#918 = CIRCLE('',#919,0.3);
#919 = AXIS2_PLACEMENT_3D('',#920,#921,#922);
#920 = CARTESIAN_POINT('',(-1.55,0.95,1.55));
#921 = DIRECTION('',(0.,0.,1.));
#922 = DIRECTION('',(1.,0.,0.));
#923 = ORIENTED_EDGE('',*,*,#885,.F.);
#924 = ORIENTED_EDGE('',*,*,#925,.F.);
#925 = EDGE_CURVE('',#908,#886,#926,.T.);
#926 = CIRCLE('',#927,0.3);
#927 = AXIS2_PLACEMENT_3D('',#928,#929,#930);
#928 = CARTESIAN_POINT('',(-1.55,0.95,0.25));
#929 = DIRECTION('',(0.,0.,1.));
#930 = DIRECTION('',(1.,0.,0.));
#931 = CYLINDRICAL_SURFACE('',#932,0.3);
#932 = AXIS2_PLACEMENT_3D('',#933,#934,#935);
#933 = CARTESIAN_POINT('',(-1.55,0.95,0.25));
#934 = DIRECTION('',(-0.,-0.,-1.));
#935 = DIRECTION('',(1.,0.,0.));
#936 = ADVANCED_FACE('',(#937),#962,.T.);
#937 = FACE_BOUND('',#938,.T.);
#938 = EDGE_LOOP('',(#939,#940,#948,#956));
#939 = ORIENTED_EDGE('',*,*,#907,.T.);
#940 = ORIENTED_EDGE('',*,*,#941,.T.);
#941 = EDGE_CURVE('',#910,#942,#944,.T.);
#942 = VERTEX_POINT('',#943);
#943 = CARTESIAN_POINT('',(1.55,1.25,1.55));
#944 = LINE('',#945,#946);
#945 = CARTESIAN_POINT('',(-1.55,1.25,1.55));
#946 = VECTOR('',#947,1.);
#947 = DIRECTION('',(1.,0.,0.));
#948 = ORIENTED_EDGE('',*,*,#949,.F.);
#949 = EDGE_CURVE('',#950,#942,#952,.T.);
#950 = VERTEX_POINT('',#951);
#951 = CARTESIAN_POINT('',(1.55,1.25,0.25));
#952 = LINE('',#953,#954);
#953 = CARTESIAN_POINT('',(1.55,1.25,0.25));
#954 = VECTOR('',#955,1.);
#955 = DIRECTION('',(0.,0.,1.));
#956 = ORIENTED_EDGE('',*,*,#957,.F.);
#957 = EDGE_CURVE('',#908,#950,#958,.T.);
#958 = LINE('',#959,#960);
#959 = CARTESIAN_POINT('',(-1.55,1.25,0.25));
#960 = VECTOR('',#961,1.);
#961 = DIRECTION('',(1.,0.,0.));
#962 = PLANE('',#963);
#963 = AXIS2_PLACEMENT_3D('',#964,#965,#966);
#964 = CARTESIAN_POINT('',(-1.55,1.25,0.25));
#965 = DIRECTION('',(0.,1.,0.));
#966 = DIRECTION('',(1.,0.,0.));
#967 = ADVANCED_FACE('',(#968),#995,.T.);
#968 = FACE_BOUND('',#969,.F.);
#969 = EDGE_LOOP('',(#970,#980,#987,#988));
#970 = ORIENTED_EDGE('',*,*,#971,.T.);
#971 = EDGE_CURVE('',#972,#974,#976,.T.);
#972 = VERTEX_POINT('',#973);
#973 = CARTESIAN_POINT('',(1.85,0.95,0.25));
#974 = VERTEX_POINT('',#975);
#975 = CARTESIAN_POINT('',(1.85,0.95,1.55));
#976 = LINE('',#977,#978);
#977 = CARTESIAN_POINT('',(1.85,0.95,0.25));
#978 = VECTOR('',#979,1.);
#979 = DIRECTION('',(0.,0.,1.));
#980 = ORIENTED_EDGE('',*,*,#981,.T.);
#981 = EDGE_CURVE('',#974,#942,#982,.T.);
#982 = CIRCLE('',#983,0.3);
#983 = AXIS2_PLACEMENT_3D('',#984,#985,#986);
#984 = CARTESIAN_POINT('',(1.55,0.95,1.55));
#985 = DIRECTION('',(0.,0.,1.));
#986 = DIRECTION('',(1.,0.,0.));
#987 = ORIENTED_EDGE('',*,*,#949,.F.);
#988 = ORIENTED_EDGE('',*,*,#989,.F.);
#989 = EDGE_CURVE('',#972,#950,#990,.T.);
#990 = CIRCLE('',#991,0.3);
#991 = AXIS2_PLACEMENT_3D('',#992,#993,#994);
#992 = CARTESIAN_POINT('',(1.55,0.95,0.25));
#993 = DIRECTION('',(0.,0.,1.));
#994 = DIRECTION('',(1.,0.,0.));
#995 = CYLINDRICAL_SURFACE('',#996,0.3);
#996 = AXIS2_PLACEMENT_3D('',#997,#998,#999);
#997 = CARTESIAN_POINT('',(1.55,0.95,0.25));
#998 = DIRECTION('',(-0.,-0.,-1.));
#999 = DIRECTION('',(1.,0.,0.));
#1000 = ADVANCED_FACE('',(#1001),#1026,.T.);
#1001 = FACE_BOUND('',#1002,.T.);
#1002 = EDGE_LOOP('',(#1003,#1004,#1012,#1020));
#1003 = ORIENTED_EDGE('',*,*,#971,.T.);
#1004 = ORIENTED_EDGE('',*,*,#1005,.T.);
#1005 = EDGE_CURVE('',#974,#1006,#1008,.T.);
#1006 = VERTEX_POINT('',#1007);
#1007 = CARTESIAN_POINT('',(1.85,-0.95,1.55));
#1008 = LINE('',#1009,#1010);
#1009 = CARTESIAN_POINT('',(1.85,0.95,1.55));
#1010 = VECTOR('',#1011,1.);
#1011 = DIRECTION('',(0.,-1.,0.));
#1012 = ORIENTED_EDGE('',*,*,#1013,.F.);
#1013 = EDGE_CURVE('',#1014,#1006,#1016,.T.);
#1014 = VERTEX_POINT('',#1015);
#1015 = CARTESIAN_POINT('',(1.85,-0.95,0.25));
#1016 = LINE('',#1017,#1018);
#1017 = CARTESIAN_POINT('',(1.85,-0.95,0.25));
#1018 = VECTOR('',#1019,1.);
#1019 = DIRECTION('',(0.,0.,1.));
#1020 = ORIENTED_EDGE('',*,*,#1021,.F.);
#1021 = EDGE_CURVE('',#972,#1014,#1022,.T.);
#1022 = LINE('',#1023,#1024);
#1023 = CARTESIAN_POINT('',(1.85,0.95,0.25));
#1024 = VECTOR('',#1025,1.);
#1025 = DIRECTION('',(0.,-1.,0.));
#1026 = PLANE('',#1027);
#1027 = AXIS2_PLACEMENT_3D('',#1028,#1029,#1030);
#1028 = CARTESIAN_POINT('',(1.85,0.95,0.25));
#1029 = DIRECTION('',(1.,0.,0.));
#1030 = DIRECTION('',(0.,-1.,0.));
#1031 = ADVANCED_FACE('',(#1032),#1059,.T.);
#1032 = FACE_BOUND('',#1033,.F.);
#1033 = EDGE_LOOP('',(#1034,#1044,#1051,#1052));
#1034 = ORIENTED_EDGE('',*,*,#1035,.T.);
#1035 = EDGE_CURVE('',#1036,#1038,#1040,.T.);
#1036 = VERTEX_POINT('',#1037);
#1037 = CARTESIAN_POINT('',(1.55,-1.25,0.25));
#1038 = VERTEX_POINT('',#1039);
#1039 = CARTESIAN_POINT('',(1.55,-1.25,1.55));
#1040 = LINE('',#1041,#1042);
#1041 = CARTESIAN_POINT('',(1.55,-1.25,0.25));
#1042 = VECTOR('',#1043,1.);
#1043 = DIRECTION('',(0.,0.,1.));
#1044 = ORIENTED_EDGE('',*,*,#1045,.T.);
#1045 = EDGE_CURVE('',#1038,#1006,#1046,.T.);
#1046 = CIRCLE('',#1047,0.3);
#1047 = AXIS2_PLACEMENT_3D('',#1048,#1049,#1050);
#1048 = CARTESIAN_POINT('',(1.55,-0.95,1.55));
#1049 = DIRECTION('',(0.,0.,1.));
#1050 = DIRECTION('',(1.,0.,0.));
#1051 = ORIENTED_EDGE('',*,*,#1013,.F.);
#1052 = ORIENTED_EDGE('',*,*,#1053,.F.);
#1053 = EDGE_CURVE('',#1036,#1014,#1054,.T.);
#1054 = CIRCLE('',#1055,0.3);
#1055 = AXIS2_PLACEMENT_3D('',#1056,#1057,#1058);
#1056 = CARTESIAN_POINT('',(1.55,-0.95,0.25));
#1057 = DIRECTION('',(0.,0.,1.));
#1058 = DIRECTION('',(1.,0.,0.));
#1059 = CYLINDRICAL_SURFACE('',#1060,0.3);
#1060 = AXIS2_PLACEMENT_3D('',#1061,#1062,#1063);
#1061 = CARTESIAN_POINT('',(1.55,-0.95,0.25));
#1062 = DIRECTION('',(-0.,-0.,-1.));
#1063 = DIRECTION('',(1.,0.,0.));
#1064 = ADVANCED_FACE('',(#1065),#1090,.T.);
#1065 = FACE_BOUND('',#1066,.T.);
#1066 = EDGE_LOOP('',(#1067,#1068,#1076,#1084));
#1067 = ORIENTED_EDGE('',*,*,#1035,.T.);
#1068 = ORIENTED_EDGE('',*,*,#1069,.T.);
#1069 = EDGE_CURVE('',#1038,#1070,#1072,.T.);
#1070 = VERTEX_POINT('',#1071);
#1071 = CARTESIAN_POINT('',(-1.55,-1.25,1.55));
#1072 = LINE('',#1073,#1074);
#1073 = CARTESIAN_POINT('',(1.55,-1.25,1.55));
#1074 = VECTOR('',#1075,1.);
#1075 = DIRECTION('',(-1.,0.,0.));
#1076 = ORIENTED_EDGE('',*,*,#1077,.F.);
#1077 = EDGE_CURVE('',#1078,#1070,#1080,.T.);
#1078 = VERTEX_POINT('',#1079);
#1079 = CARTESIAN_POINT('',(-1.55,-1.25,0.25));
#1080 = LINE('',#1081,#1082);
#1081 = CARTESIAN_POINT('',(-1.55,-1.25,0.25));
#1082 = VECTOR('',#1083,1.);
#1083 = DIRECTION('',(0.,0.,1.));
#1084 = ORIENTED_EDGE('',*,*,#1085,.F.);
#1085 = EDGE_CURVE('',#1036,#1078,#1086,.T.);
#1086 = LINE('',#1087,#1088);
#1087 = CARTESIAN_POINT('',(1.55,-1.25,0.25));
#1088 = VECTOR('',#1089,1.);
#1089 = DIRECTION('',(-1.,0.,0.));
#1090 = PLANE('',#1091);
#1091 = AXIS2_PLACEMENT_3D('',#1092,#1093,#1094);
#1092 = CARTESIAN_POINT('',(1.55,-1.25,0.25));
#1093 = DIRECTION('',(0.,-1.,0.));
#1094 = DIRECTION('',(-1.,0.,0.));
#1095 = ADVANCED_FACE('',(#1096),#1114,.T.);
#1096 = FACE_BOUND('',#1097,.F.);
#1097 = EDGE_LOOP('',(#1098,#1099,#1106,#1107));
#1098 = ORIENTED_EDGE('',*,*,#867,.T.);
#1099 = ORIENTED_EDGE('',*,*,#1100,.T.);
#1100 = EDGE_CURVE('',#870,#1070,#1101,.T.);
#1101 = CIRCLE('',#1102,0.3);
#1102 = AXIS2_PLACEMENT_3D('',#1103,#1104,#1105);
#1103 = CARTESIAN_POINT('',(-1.55,-0.95,1.55));
#1104 = DIRECTION('',(0.,0.,1.));
#1105 = DIRECTION('',(1.,0.,0.));
#1106 = ORIENTED_EDGE('',*,*,#1077,.F.);
#1107 = ORIENTED_EDGE('',*,*,#1108,.F.);
#1108 = EDGE_CURVE('',#868,#1078,#1109,.T.);
#1109 = CIRCLE('',#1110,0.3);
#1110 = AXIS2_PLACEMENT_3D('',#1111,#1112,#1113);
#1111 = CARTESIAN_POINT('',(-1.55,-0.95,0.25));
#1112 = DIRECTION('',(0.,0.,1.));
#1113 = DIRECTION('',(1.,0.,0.));
#1114 = CYLINDRICAL_SURFACE('',#1115,0.3);
#1115 = AXIS2_PLACEMENT_3D('',#1116,#1117,#1118);
#1116 = CARTESIAN_POINT('',(-1.55,-0.95,0.25));
#1117 = DIRECTION('',(-0.,-0.,-1.));
#1118 = DIRECTION('',(1.,0.,0.));
#1119 = ADVANCED_FACE('',(#1120),#1130,.T.);
#1120 = FACE_BOUND('',#1121,.T.);
#1121 = EDGE_LOOP('',(#1122,#1123,#1124,#1125,#1126,#1127,#1128,#1129));
#1122 = ORIENTED_EDGE('',*,*,#893,.T.);
#1123 = ORIENTED_EDGE('',*,*,#925,.F.);
#1124 = ORIENTED_EDGE('',*,*,#957,.T.);
#1125 = ORIENTED_EDGE('',*,*,#989,.F.);
#1126 = ORIENTED_EDGE('',*,*,#1021,.T.);
#1127 = ORIENTED_EDGE('',*,*,#1053,.F.);
#1128 = ORIENTED_EDGE('',*,*,#1085,.T.);
#1129 = ORIENTED_EDGE('',*,*,#1108,.F.);
#1130 = PLANE('',#1131);
#1131 = AXIS2_PLACEMENT_3D('',#1132,#1133,#1134);
#1132 = CARTESIAN_POINT('',(-1.E-17,-8.E-17,0.25));
#1133 = DIRECTION('',(-0.,-0.,-1.));
#1134 = DIRECTION('',(-1.,0.,0.));
#1135 = ADVANCED_FACE('',(#1136),#1146,.F.);
#1136 = FACE_BOUND('',#1137,.F.);
#1137 = EDGE_LOOP('',(#1138,#1139,#1140,#1141,#1142,#1143,#1144,#1145));
#1138 = ORIENTED_EDGE('',*,*,#877,.T.);
#1139 = ORIENTED_EDGE('',*,*,#917,.F.);
#1140 = ORIENTED_EDGE('',*,*,#941,.T.);
#1141 = ORIENTED_EDGE('',*,*,#981,.F.);
#1142 = ORIENTED_EDGE('',*,*,#1005,.T.);
#1143 = ORIENTED_EDGE('',*,*,#1045,.F.);
#1144 = ORIENTED_EDGE('',*,*,#1069,.T.);
#1145 = ORIENTED_EDGE('',*,*,#1100,.F.);
#1146 = PLANE('',#1147);
#1147 = AXIS2_PLACEMENT_3D('',#1148,#1149,#1150);
#1148 = CARTESIAN_POINT('',(-1.E-17,-8.E-17,1.55));
#1149 = DIRECTION('',(-0.,-0.,-1.));
#1150 = DIRECTION('',(-1.,0.,0.));
#1151 = MANIFOLD_SOLID_BREP('',#1152);
#1152 = CLOSED_SHELL('',(#1153,#1193,#1320,#1344,#1368,#1481,#1498,#1515
    ,#1532,#1549,#1566,#1583,#1600,#1617,#1634,#1651,#1668,#1685));
#1153 = ADVANCED_FACE('',(#1154),#1188,.F.);
#1154 = FACE_BOUND('',#1155,.F.);
#1155 = EDGE_LOOP('',(#1156,#1166,#1174,#1182));
#1156 = ORIENTED_EDGE('',*,*,#1157,.F.);
#1157 = EDGE_CURVE('',#1158,#1160,#1162,.T.);
#1158 = VERTEX_POINT('',#1159);
#1159 = CARTESIAN_POINT('',(-1.85,-1.25,1.55));
#1160 = VERTEX_POINT('',#1161);
#1161 = CARTESIAN_POINT('',(-1.85,-1.65,1.55));
#1162 = LINE('',#1163,#1164);
#1163 = CARTESIAN_POINT('',(-1.85,-1.25,1.55));
#1164 = VECTOR('',#1165,1.);
#1165 = DIRECTION('',(0.,-1.,0.));
#1166 = ORIENTED_EDGE('',*,*,#1167,.T.);
#1167 = EDGE_CURVE('',#1158,#1168,#1170,.T.);
#1168 = VERTEX_POINT('',#1169);
#1169 = CARTESIAN_POINT('',(-1.85,-1.25,1.8));
#1170 = LINE('',#1171,#1172);
#1171 = CARTESIAN_POINT('',(-1.85,-1.25,1.55));
#1172 = VECTOR('',#1173,1.);
#1173 = DIRECTION('',(0.,0.,1.));
#1174 = ORIENTED_EDGE('',*,*,#1175,.T.);
#1175 = EDGE_CURVE('',#1168,#1176,#1178,.T.);
#1176 = VERTEX_POINT('',#1177);
#1177 = CARTESIAN_POINT('',(-1.85,-1.65,1.8));
#1178 = LINE('',#1179,#1180);
#1179 = CARTESIAN_POINT('',(-1.85,-1.25,1.8));
#1180 = VECTOR('',#1181,1.);
#1181 = DIRECTION('',(0.,-1.,0.));
#1182 = ORIENTED_EDGE('',*,*,#1183,.F.);
#1183 = EDGE_CURVE('',#1160,#1176,#1184,.T.);
#1184 = LINE('',#1185,#1186);
#1185 = CARTESIAN_POINT('',(-1.85,-1.65,1.55));
#1186 = VECTOR('',#1187,1.);
#1187 = DIRECTION('',(0.,0.,1.));
#1188 = PLANE('',#1189);
#1189 = AXIS2_PLACEMENT_3D('',#1190,#1191,#1192);
#1190 = CARTESIAN_POINT('',(-1.85,-1.25,1.55));
#1191 = DIRECTION('',(1.,0.,0.));
#1192 = DIRECTION('',(0.,-1.,0.));
#1193 = ADVANCED_FACE('',(#1194),#1315,.F.);
#1194 = FACE_BOUND('',#1195,.F.);
#1195 = EDGE_LOOP('',(#1196,#1197,#1205,#1213,#1221,#1229,#1237,#1245,
    #1253,#1261,#1269,#1277,#1285,#1293,#1301,#1309));
#1196 = ORIENTED_EDGE('',*,*,#1157,.T.);
#1197 = ORIENTED_EDGE('',*,*,#1198,.T.);
#1198 = EDGE_CURVE('',#1160,#1199,#1201,.T.);
#1199 = VERTEX_POINT('',#1200);
#1200 = CARTESIAN_POINT('',(-1.75,-1.75,1.55));
#1201 = LINE('',#1202,#1203);
#1202 = CARTESIAN_POINT('',(-1.775,-1.725,1.55));
#1203 = VECTOR('',#1204,1.);
#1204 = DIRECTION('',(0.707106781187,-0.707106781187,0.));
#1205 = ORIENTED_EDGE('',*,*,#1206,.T.);
#1206 = EDGE_CURVE('',#1199,#1207,#1209,.T.);
#1207 = VERTEX_POINT('',#1208);
#1208 = CARTESIAN_POINT('',(1.75,-1.75,1.55));
#1209 = LINE('',#1210,#1211);
#1210 = CARTESIAN_POINT('',(-1.85,-1.75,1.55));
#1211 = VECTOR('',#1212,1.);
#1212 = DIRECTION('',(1.,0.,0.));
#1213 = ORIENTED_EDGE('',*,*,#1214,.T.);
#1214 = EDGE_CURVE('',#1207,#1215,#1217,.T.);
#1215 = VERTEX_POINT('',#1216);
#1216 = CARTESIAN_POINT('',(1.85,-1.65,1.55));
#1217 = LINE('',#1218,#1219);
#1218 = CARTESIAN_POINT('',(1.775,-1.725,1.55));
#1219 = VECTOR('',#1220,1.);
#1220 = DIRECTION('',(0.707106781187,0.707106781187,0.));
#1221 = ORIENTED_EDGE('',*,*,#1222,.T.);
#1222 = EDGE_CURVE('',#1215,#1223,#1225,.T.);
#1223 = VERTEX_POINT('',#1224);
#1224 = CARTESIAN_POINT('',(1.85,-1.25,1.55));
#1225 = LINE('',#1226,#1227);
#1226 = CARTESIAN_POINT('',(1.85,-1.75,1.55));
#1227 = VECTOR('',#1228,1.);
#1228 = DIRECTION('',(0.,1.,0.));
#1229 = ORIENTED_EDGE('',*,*,#1230,.T.);
#1230 = EDGE_CURVE('',#1223,#1231,#1233,.T.);
#1231 = VERTEX_POINT('',#1232);
#1232 = CARTESIAN_POINT('',(2.,-1.1,1.55));
#1233 = LINE('',#1234,#1235);
#1234 = CARTESIAN_POINT('',(1.85,-1.25,1.55));
#1235 = VECTOR('',#1236,1.);
#1236 = DIRECTION('',(0.707106781187,0.707106781187,0.));
#1237 = ORIENTED_EDGE('',*,*,#1238,.T.);
#1238 = EDGE_CURVE('',#1231,#1239,#1241,.T.);
#1239 = VERTEX_POINT('',#1240);
#1240 = CARTESIAN_POINT('',(2.,1.1,1.55));
#1241 = LINE('',#1242,#1243);
#1242 = CARTESIAN_POINT('',(2.,-1.1,1.55));
#1243 = VECTOR('',#1244,1.);
#1244 = DIRECTION('',(0.,1.,0.));
#1245 = ORIENTED_EDGE('',*,*,#1246,.T.);
#1246 = EDGE_CURVE('',#1239,#1247,#1249,.T.);
#1247 = VERTEX_POINT('',#1248);
#1248 = CARTESIAN_POINT('',(1.85,1.25,1.55));
#1249 = LINE('',#1250,#1251);
#1250 = CARTESIAN_POINT('',(2.,1.1,1.55));
#1251 = VECTOR('',#1252,1.);
#1252 = DIRECTION('',(-0.707106781187,0.707106781187,0.));
#1253 = ORIENTED_EDGE('',*,*,#1254,.T.);
#1254 = EDGE_CURVE('',#1247,#1255,#1257,.T.);
#1255 = VERTEX_POINT('',#1256);
#1256 = CARTESIAN_POINT('',(1.85,1.65,1.55));
#1257 = LINE('',#1258,#1259);
#1258 = CARTESIAN_POINT('',(1.85,1.25,1.55));
#1259 = VECTOR('',#1260,1.);
#1260 = DIRECTION('',(0.,1.,0.));
#1261 = ORIENTED_EDGE('',*,*,#1262,.T.);
#1262 = EDGE_CURVE('',#1255,#1263,#1265,.T.);
#1263 = VERTEX_POINT('',#1264);
#1264 = CARTESIAN_POINT('',(1.75,1.75,1.55));
#1265 = LINE('',#1266,#1267);
#1266 = CARTESIAN_POINT('',(1.775,1.725,1.55));
#1267 = VECTOR('',#1268,1.);
#1268 = DIRECTION('',(-0.707106781187,0.707106781187,0.));
#1269 = ORIENTED_EDGE('',*,*,#1270,.T.);
#1270 = EDGE_CURVE('',#1263,#1271,#1273,.T.);
#1271 = VERTEX_POINT('',#1272);
#1272 = CARTESIAN_POINT('',(-1.75,1.75,1.55));
#1273 = LINE('',#1274,#1275);
#1274 = CARTESIAN_POINT('',(1.85,1.75,1.55));
#1275 = VECTOR('',#1276,1.);
#1276 = DIRECTION('',(-1.,0.,0.));
#1277 = ORIENTED_EDGE('',*,*,#1278,.T.);
#1278 = EDGE_CURVE('',#1271,#1279,#1281,.T.);
#1279 = VERTEX_POINT('',#1280);
#1280 = CARTESIAN_POINT('',(-1.85,1.65,1.55));
#1281 = LINE('',#1282,#1283);
#1282 = CARTESIAN_POINT('',(-1.775,1.725,1.55));
#1283 = VECTOR('',#1284,1.);
#1284 = DIRECTION('',(-0.707106781187,-0.707106781187,0.));
#1285 = ORIENTED_EDGE('',*,*,#1286,.T.);
#1286 = EDGE_CURVE('',#1279,#1287,#1289,.T.);
#1287 = VERTEX_POINT('',#1288);
#1288 = CARTESIAN_POINT('',(-1.85,1.25,1.55));
#1289 = LINE('',#1290,#1291);
#1290 = CARTESIAN_POINT('',(-1.85,1.75,1.55));
#1291 = VECTOR('',#1292,1.);
#1292 = DIRECTION('',(0.,-1.,0.));
#1293 = ORIENTED_EDGE('',*,*,#1294,.T.);
#1294 = EDGE_CURVE('',#1287,#1295,#1297,.T.);
#1295 = VERTEX_POINT('',#1296);
#1296 = CARTESIAN_POINT('',(-2.,1.1,1.55));
#1297 = LINE('',#1298,#1299);
#1298 = CARTESIAN_POINT('',(-1.85,1.25,1.55));
#1299 = VECTOR('',#1300,1.);
#1300 = DIRECTION('',(-0.707106781187,-0.707106781187,0.));
#1301 = ORIENTED_EDGE('',*,*,#1302,.T.);
#1302 = EDGE_CURVE('',#1295,#1303,#1305,.T.);
#1303 = VERTEX_POINT('',#1304);
#1304 = CARTESIAN_POINT('',(-2.,-1.1,1.55));
#1305 = LINE('',#1306,#1307);
#1306 = CARTESIAN_POINT('',(-2.,1.1,1.55));
#1307 = VECTOR('',#1308,1.);
#1308 = DIRECTION('',(0.,-1.,0.));
#1309 = ORIENTED_EDGE('',*,*,#1310,.T.);
#1310 = EDGE_CURVE('',#1303,#1158,#1311,.T.);
#1311 = LINE('',#1312,#1313);
#1312 = CARTESIAN_POINT('',(-2.,-1.1,1.55));
#1313 = VECTOR('',#1314,1.);
#1314 = DIRECTION('',(0.707106781187,-0.707106781187,0.));
#1315 = PLANE('',#1316);
#1316 = AXIS2_PLACEMENT_3D('',#1317,#1318,#1319);
#1317 = CARTESIAN_POINT('',(4.736922261957E-17,1.326338233348E-17,1.55)
  );
#1318 = DIRECTION('',(0.,0.,1.));
#1319 = DIRECTION('',(1.,0.,0.));
#1320 = ADVANCED_FACE('',(#1321),#1339,.T.);
#1321 = FACE_BOUND('',#1322,.F.);
#1322 = EDGE_LOOP('',(#1323,#1324,#1325,#1333));
#1323 = ORIENTED_EDGE('',*,*,#1198,.F.);
#1324 = ORIENTED_EDGE('',*,*,#1183,.T.);
#1325 = ORIENTED_EDGE('',*,*,#1326,.T.);
#1326 = EDGE_CURVE('',#1176,#1327,#1329,.T.);
#1327 = VERTEX_POINT('',#1328);
#1328 = CARTESIAN_POINT('',(-1.75,-1.75,1.8));
#1329 = LINE('',#1330,#1331);
#1330 = CARTESIAN_POINT('',(-1.775,-1.725,1.8));
#1331 = VECTOR('',#1332,1.);
#1332 = DIRECTION('',(0.707106781187,-0.707106781187,0.));
#1333 = ORIENTED_EDGE('',*,*,#1334,.F.);
#1334 = EDGE_CURVE('',#1199,#1327,#1335,.T.);
#1335 = LINE('',#1336,#1337);
#1336 = CARTESIAN_POINT('',(-1.75,-1.75,1.55));
#1337 = VECTOR('',#1338,1.);
#1338 = DIRECTION('',(0.,0.,1.));
#1339 = PLANE('',#1340);
#1340 = AXIS2_PLACEMENT_3D('',#1341,#1342,#1343);
#1341 = CARTESIAN_POINT('',(-1.8,-1.7,1.55));
#1342 = DIRECTION('',(-0.707106781187,-0.707106781187,0.));
#1343 = DIRECTION('',(-0.,-0.,-1.));
#1344 = ADVANCED_FACE('',(#1345),#1363,.F.);
#1345 = FACE_BOUND('',#1346,.F.);
#1346 = EDGE_LOOP('',(#1347,#1355,#1361,#1362));
#1347 = ORIENTED_EDGE('',*,*,#1348,.T.);
#1348 = EDGE_CURVE('',#1303,#1349,#1351,.T.);
#1349 = VERTEX_POINT('',#1350);
#1350 = CARTESIAN_POINT('',(-2.,-1.1,1.8));
#1351 = LINE('',#1352,#1353);
#1352 = CARTESIAN_POINT('',(-2.,-1.1,1.55));
#1353 = VECTOR('',#1354,1.);
#1354 = DIRECTION('',(0.,0.,1.));
#1355 = ORIENTED_EDGE('',*,*,#1356,.T.);
#1356 = EDGE_CURVE('',#1349,#1168,#1357,.T.);
#1357 = LINE('',#1358,#1359);
#1358 = CARTESIAN_POINT('',(-2.,-1.1,1.8));
#1359 = VECTOR('',#1360,1.);
#1360 = DIRECTION('',(0.707106781187,-0.707106781187,0.));
#1361 = ORIENTED_EDGE('',*,*,#1167,.F.);
#1362 = ORIENTED_EDGE('',*,*,#1310,.F.);
#1363 = PLANE('',#1364);
#1364 = AXIS2_PLACEMENT_3D('',#1365,#1366,#1367);
#1365 = CARTESIAN_POINT('',(-2.,-1.1,1.55));
#1366 = DIRECTION('',(0.707106781187,0.707106781187,0.));
#1367 = DIRECTION('',(0.707106781187,-0.707106781187,0.));
#1368 = ADVANCED_FACE('',(#1369),#1476,.T.);
#1369 = FACE_BOUND('',#1370,.T.);
#1370 = EDGE_LOOP('',(#1371,#1372,#1373,#1381,#1389,#1397,#1405,#1413,
    #1421,#1429,#1437,#1445,#1453,#1461,#1469,#1475));
#1371 = ORIENTED_EDGE('',*,*,#1175,.T.);
#1372 = ORIENTED_EDGE('',*,*,#1326,.T.);
#1373 = ORIENTED_EDGE('',*,*,#1374,.T.);
#1374 = EDGE_CURVE('',#1327,#1375,#1377,.T.);
#1375 = VERTEX_POINT('',#1376);
#1376 = CARTESIAN_POINT('',(1.75,-1.75,1.8));
#1377 = LINE('',#1378,#1379);
#1378 = CARTESIAN_POINT('',(-1.85,-1.75,1.8));
#1379 = VECTOR('',#1380,1.);
#1380 = DIRECTION('',(1.,0.,0.));
#1381 = ORIENTED_EDGE('',*,*,#1382,.T.);
#1382 = EDGE_CURVE('',#1375,#1383,#1385,.T.);
#1383 = VERTEX_POINT('',#1384);
#1384 = CARTESIAN_POINT('',(1.85,-1.65,1.8));
#1385 = LINE('',#1386,#1387);
#1386 = CARTESIAN_POINT('',(1.775,-1.725,1.8));
#1387 = VECTOR('',#1388,1.);
#1388 = DIRECTION('',(0.707106781187,0.707106781187,0.));
#1389 = ORIENTED_EDGE('',*,*,#1390,.T.);
#1390 = EDGE_CURVE('',#1383,#1391,#1393,.T.);
#1391 = VERTEX_POINT('',#1392);
#1392 = CARTESIAN_POINT('',(1.85,-1.25,1.8));
#1393 = LINE('',#1394,#1395);
#1394 = CARTESIAN_POINT('',(1.85,-1.75,1.8));
#1395 = VECTOR('',#1396,1.);
#1396 = DIRECTION('',(0.,1.,0.));
#1397 = ORIENTED_EDGE('',*,*,#1398,.T.);
#1398 = EDGE_CURVE('',#1391,#1399,#1401,.T.);
#1399 = VERTEX_POINT('',#1400);
#1400 = CARTESIAN_POINT('',(2.,-1.1,1.8));
#1401 = LINE('',#1402,#1403);
#1402 = CARTESIAN_POINT('',(1.85,-1.25,1.8));
#1403 = VECTOR('',#1404,1.);
#1404 = DIRECTION('',(0.707106781187,0.707106781187,0.));
#1405 = ORIENTED_EDGE('',*,*,#1406,.T.);
#1406 = EDGE_CURVE('',#1399,#1407,#1409,.T.);
#1407 = VERTEX_POINT('',#1408);
#1408 = CARTESIAN_POINT('',(2.,1.1,1.8));
#1409 = LINE('',#1410,#1411);
#1410 = CARTESIAN_POINT('',(2.,-1.1,1.8));
#1411 = VECTOR('',#1412,1.);
#1412 = DIRECTION('',(0.,1.,0.));
#1413 = ORIENTED_EDGE('',*,*,#1414,.T.);
#1414 = EDGE_CURVE('',#1407,#1415,#1417,.T.);
#1415 = VERTEX_POINT('',#1416);
#1416 = CARTESIAN_POINT('',(1.85,1.25,1.8));
#1417 = LINE('',#1418,#1419);
#1418 = CARTESIAN_POINT('',(2.,1.1,1.8));
#1419 = VECTOR('',#1420,1.);
#1420 = DIRECTION('',(-0.707106781187,0.707106781187,0.));
#1421 = ORIENTED_EDGE('',*,*,#1422,.T.);
#1422 = EDGE_CURVE('',#1415,#1423,#1425,.T.);
#1423 = VERTEX_POINT('',#1424);
#1424 = CARTESIAN_POINT('',(1.85,1.65,1.8));
#1425 = LINE('',#1426,#1427);
#1426 = CARTESIAN_POINT('',(1.85,1.25,1.8));
#1427 = VECTOR('',#1428,1.);
#1428 = DIRECTION('',(0.,1.,0.));
#1429 = ORIENTED_EDGE('',*,*,#1430,.T.);
#1430 = EDGE_CURVE('',#1423,#1431,#1433,.T.);
#1431 = VERTEX_POINT('',#1432);
#1432 = CARTESIAN_POINT('',(1.75,1.75,1.8));
#1433 = LINE('',#1434,#1435);
#1434 = CARTESIAN_POINT('',(1.775,1.725,1.8));
#1435 = VECTOR('',#1436,1.);
#1436 = DIRECTION('',(-0.707106781187,0.707106781187,0.));
#1437 = ORIENTED_EDGE('',*,*,#1438,.T.);
#1438 = EDGE_CURVE('',#1431,#1439,#1441,.T.);
#1439 = VERTEX_POINT('',#1440);
#1440 = CARTESIAN_POINT('',(-1.75,1.75,1.8));
#1441 = LINE('',#1442,#1443);
#1442 = CARTESIAN_POINT('',(1.85,1.75,1.8));
#1443 = VECTOR('',#1444,1.);
#1444 = DIRECTION('',(-1.,0.,0.));
#1445 = ORIENTED_EDGE('',*,*,#1446,.T.);
#1446 = EDGE_CURVE('',#1439,#1447,#1449,.T.);
#1447 = VERTEX_POINT('',#1448);
#1448 = CARTESIAN_POINT('',(-1.85,1.65,1.8));
#1449 = LINE('',#1450,#1451);
#1450 = CARTESIAN_POINT('',(-1.775,1.725,1.8));
#1451 = VECTOR('',#1452,1.);
#1452 = DIRECTION('',(-0.707106781187,-0.707106781187,0.));
#1453 = ORIENTED_EDGE('',*,*,#1454,.T.);
#1454 = EDGE_CURVE('',#1447,#1455,#1457,.T.);
#1455 = VERTEX_POINT('',#1456);
#1456 = CARTESIAN_POINT('',(-1.85,1.25,1.8));
#1457 = LINE('',#1458,#1459);
#1458 = CARTESIAN_POINT('',(-1.85,1.75,1.8));
#1459 = VECTOR('',#1460,1.);
#1460 = DIRECTION('',(0.,-1.,0.));
#1461 = ORIENTED_EDGE('',*,*,#1462,.T.);
#1462 = EDGE_CURVE('',#1455,#1463,#1465,.T.);
#1463 = VERTEX_POINT('',#1464);
#1464 = CARTESIAN_POINT('',(-2.,1.1,1.8));
#1465 = LINE('',#1466,#1467);
#1466 = CARTESIAN_POINT('',(-1.85,1.25,1.8));
#1467 = VECTOR('',#1468,1.);
#1468 = DIRECTION('',(-0.707106781187,-0.707106781187,0.));
#1469 = ORIENTED_EDGE('',*,*,#1470,.T.);
#1470 = EDGE_CURVE('',#1463,#1349,#1471,.T.);
#1471 = LINE('',#1472,#1473);
#1472 = CARTESIAN_POINT('',(-2.,1.1,1.8));
#1473 = VECTOR('',#1474,1.);
#1474 = DIRECTION('',(0.,-1.,0.));
#1475 = ORIENTED_EDGE('',*,*,#1356,.T.);
#1476 = PLANE('',#1477);
#1477 = AXIS2_PLACEMENT_3D('',#1478,#1479,#1480);
#1478 = CARTESIAN_POINT('',(4.736922261957E-17,1.326338233348E-17,1.8));
#1479 = DIRECTION('',(0.,0.,1.));
#1480 = DIRECTION('',(1.,0.,0.));
#1481 = ADVANCED_FACE('',(#1482),#1493,.F.);
#1482 = FACE_BOUND('',#1483,.F.);
#1483 = EDGE_LOOP('',(#1484,#1485,#1486,#1487));
#1484 = ORIENTED_EDGE('',*,*,#1206,.F.);
#1485 = ORIENTED_EDGE('',*,*,#1334,.T.);
#1486 = ORIENTED_EDGE('',*,*,#1374,.T.);
#1487 = ORIENTED_EDGE('',*,*,#1488,.F.);
#1488 = EDGE_CURVE('',#1207,#1375,#1489,.T.);
#1489 = LINE('',#1490,#1491);
#1490 = CARTESIAN_POINT('',(1.75,-1.75,1.55));
#1491 = VECTOR('',#1492,1.);
#1492 = DIRECTION('',(0.,0.,1.));
#1493 = PLANE('',#1494);
#1494 = AXIS2_PLACEMENT_3D('',#1495,#1496,#1497);
#1495 = CARTESIAN_POINT('',(-1.85,-1.75,1.55));
#1496 = DIRECTION('',(0.,1.,0.));
#1497 = DIRECTION('',(1.,0.,0.));
#1498 = ADVANCED_FACE('',(#1499),#1510,.F.);
#1499 = FACE_BOUND('',#1500,.F.);
#1500 = EDGE_LOOP('',(#1501,#1507,#1508,#1509));
#1501 = ORIENTED_EDGE('',*,*,#1502,.T.);
#1502 = EDGE_CURVE('',#1295,#1463,#1503,.T.);
#1503 = LINE('',#1504,#1505);
#1504 = CARTESIAN_POINT('',(-2.,1.1,1.55));
#1505 = VECTOR('',#1506,1.);
#1506 = DIRECTION('',(0.,0.,1.));
#1507 = ORIENTED_EDGE('',*,*,#1470,.T.);
#1508 = ORIENTED_EDGE('',*,*,#1348,.F.);
#1509 = ORIENTED_EDGE('',*,*,#1302,.F.);
#1510 = PLANE('',#1511);
#1511 = AXIS2_PLACEMENT_3D('',#1512,#1513,#1514);
#1512 = CARTESIAN_POINT('',(-2.,1.1,1.55));
#1513 = DIRECTION('',(1.,0.,0.));
#1514 = DIRECTION('',(0.,-1.,0.));
#1515 = ADVANCED_FACE('',(#1516),#1527,.T.);
#1516 = FACE_BOUND('',#1517,.F.);
#1517 = EDGE_LOOP('',(#1518,#1519,#1520,#1521));
#1518 = ORIENTED_EDGE('',*,*,#1214,.F.);
#1519 = ORIENTED_EDGE('',*,*,#1488,.T.);
#1520 = ORIENTED_EDGE('',*,*,#1382,.T.);
#1521 = ORIENTED_EDGE('',*,*,#1522,.F.);
#1522 = EDGE_CURVE('',#1215,#1383,#1523,.T.);
#1523 = LINE('',#1524,#1525);
#1524 = CARTESIAN_POINT('',(1.85,-1.65,1.55));
#1525 = VECTOR('',#1526,1.);
#1526 = DIRECTION('',(0.,0.,1.));
#1527 = PLANE('',#1528);
#1528 = AXIS2_PLACEMENT_3D('',#1529,#1530,#1531);
#1529 = CARTESIAN_POINT('',(1.8,-1.7,1.55));
#1530 = DIRECTION('',(0.707106781187,-0.707106781187,0.));
#1531 = DIRECTION('',(-0.,-0.,-1.));
#1532 = ADVANCED_FACE('',(#1533),#1544,.F.);
#1533 = FACE_BOUND('',#1534,.F.);
#1534 = EDGE_LOOP('',(#1535,#1541,#1542,#1543));
#1535 = ORIENTED_EDGE('',*,*,#1536,.T.);
#1536 = EDGE_CURVE('',#1287,#1455,#1537,.T.);
#1537 = LINE('',#1538,#1539);
#1538 = CARTESIAN_POINT('',(-1.85,1.25,1.55));
#1539 = VECTOR('',#1540,1.);
#1540 = DIRECTION('',(0.,0.,1.));
#1541 = ORIENTED_EDGE('',*,*,#1462,.T.);
#1542 = ORIENTED_EDGE('',*,*,#1502,.F.);
#1543 = ORIENTED_EDGE('',*,*,#1294,.F.);
#1544 = PLANE('',#1545);
#1545 = AXIS2_PLACEMENT_3D('',#1546,#1547,#1548);
#1546 = CARTESIAN_POINT('',(-1.85,1.25,1.55));
#1547 = DIRECTION('',(0.707106781187,-0.707106781187,0.));
#1548 = DIRECTION('',(-0.707106781187,-0.707106781187,0.));
#1549 = ADVANCED_FACE('',(#1550),#1561,.F.);
#1550 = FACE_BOUND('',#1551,.F.);
#1551 = EDGE_LOOP('',(#1552,#1553,#1554,#1555));
#1552 = ORIENTED_EDGE('',*,*,#1222,.F.);
#1553 = ORIENTED_EDGE('',*,*,#1522,.T.);
#1554 = ORIENTED_EDGE('',*,*,#1390,.T.);
#1555 = ORIENTED_EDGE('',*,*,#1556,.F.);
#1556 = EDGE_CURVE('',#1223,#1391,#1557,.T.);
#1557 = LINE('',#1558,#1559);
#1558 = CARTESIAN_POINT('',(1.85,-1.25,1.55));
#1559 = VECTOR('',#1560,1.);
#1560 = DIRECTION('',(0.,0.,1.));
#1561 = PLANE('',#1562);
#1562 = AXIS2_PLACEMENT_3D('',#1563,#1564,#1565);
#1563 = CARTESIAN_POINT('',(1.85,-1.75,1.55));
#1564 = DIRECTION('',(-1.,0.,0.));
#1565 = DIRECTION('',(0.,1.,0.));
#1566 = ADVANCED_FACE('',(#1567),#1578,.F.);
#1567 = FACE_BOUND('',#1568,.F.);
#1568 = EDGE_LOOP('',(#1569,#1570,#1576,#1577));
#1569 = ORIENTED_EDGE('',*,*,#1286,.F.);
#1570 = ORIENTED_EDGE('',*,*,#1571,.T.);
#1571 = EDGE_CURVE('',#1279,#1447,#1572,.T.);
#1572 = LINE('',#1573,#1574);
#1573 = CARTESIAN_POINT('',(-1.85,1.65,1.55));
#1574 = VECTOR('',#1575,1.);
#1575 = DIRECTION('',(0.,0.,1.));
#1576 = ORIENTED_EDGE('',*,*,#1454,.T.);
#1577 = ORIENTED_EDGE('',*,*,#1536,.F.);
#1578 = PLANE('',#1579);
#1579 = AXIS2_PLACEMENT_3D('',#1580,#1581,#1582);
#1580 = CARTESIAN_POINT('',(-1.85,1.75,1.55));
#1581 = DIRECTION('',(1.,0.,0.));
#1582 = DIRECTION('',(0.,-1.,0.));
#1583 = ADVANCED_FACE('',(#1584),#1595,.F.);
#1584 = FACE_BOUND('',#1585,.F.);
#1585 = EDGE_LOOP('',(#1586,#1587,#1588,#1594));
#1586 = ORIENTED_EDGE('',*,*,#1556,.T.);
#1587 = ORIENTED_EDGE('',*,*,#1398,.T.);
#1588 = ORIENTED_EDGE('',*,*,#1589,.F.);
#1589 = EDGE_CURVE('',#1231,#1399,#1590,.T.);
#1590 = LINE('',#1591,#1592);
#1591 = CARTESIAN_POINT('',(2.,-1.1,1.55));
#1592 = VECTOR('',#1593,1.);
#1593 = DIRECTION('',(0.,0.,1.));
#1594 = ORIENTED_EDGE('',*,*,#1230,.F.);
#1595 = PLANE('',#1596);
#1596 = AXIS2_PLACEMENT_3D('',#1597,#1598,#1599);
#1597 = CARTESIAN_POINT('',(1.85,-1.25,1.55));
#1598 = DIRECTION('',(-0.707106781187,0.707106781187,0.));
#1599 = DIRECTION('',(0.707106781187,0.707106781187,0.));
#1600 = ADVANCED_FACE('',(#1601),#1612,.T.);
#1601 = FACE_BOUND('',#1602,.F.);
#1602 = EDGE_LOOP('',(#1603,#1604,#1610,#1611));
#1603 = ORIENTED_EDGE('',*,*,#1278,.F.);
#1604 = ORIENTED_EDGE('',*,*,#1605,.T.);
#1605 = EDGE_CURVE('',#1271,#1439,#1606,.T.);
#1606 = LINE('',#1607,#1608);
#1607 = CARTESIAN_POINT('',(-1.75,1.75,1.55));
#1608 = VECTOR('',#1609,1.);
#1609 = DIRECTION('',(0.,0.,1.));
#1610 = ORIENTED_EDGE('',*,*,#1446,.T.);
#1611 = ORIENTED_EDGE('',*,*,#1571,.F.);
#1612 = PLANE('',#1613);
#1613 = AXIS2_PLACEMENT_3D('',#1614,#1615,#1616);
#1614 = CARTESIAN_POINT('',(-1.8,1.7,1.55));
#1615 = DIRECTION('',(-0.707106781187,0.707106781187,0.));
#1616 = DIRECTION('',(-0.,-0.,-1.));
#1617 = ADVANCED_FACE('',(#1618),#1629,.F.);
#1618 = FACE_BOUND('',#1619,.F.);
#1619 = EDGE_LOOP('',(#1620,#1621,#1622,#1628));
#1620 = ORIENTED_EDGE('',*,*,#1589,.T.);
#1621 = ORIENTED_EDGE('',*,*,#1406,.T.);
#1622 = ORIENTED_EDGE('',*,*,#1623,.F.);
#1623 = EDGE_CURVE('',#1239,#1407,#1624,.T.);
#1624 = LINE('',#1625,#1626);
#1625 = CARTESIAN_POINT('',(2.,1.1,1.55));
#1626 = VECTOR('',#1627,1.);
#1627 = DIRECTION('',(0.,0.,1.));
#1628 = ORIENTED_EDGE('',*,*,#1238,.F.);
#1629 = PLANE('',#1630);
#1630 = AXIS2_PLACEMENT_3D('',#1631,#1632,#1633);
#1631 = CARTESIAN_POINT('',(2.,-1.1,1.55));
#1632 = DIRECTION('',(-1.,0.,0.));
#1633 = DIRECTION('',(0.,1.,0.));
#1634 = ADVANCED_FACE('',(#1635),#1646,.F.);
#1635 = FACE_BOUND('',#1636,.F.);
#1636 = EDGE_LOOP('',(#1637,#1638,#1644,#1645));
#1637 = ORIENTED_EDGE('',*,*,#1270,.F.);
#1638 = ORIENTED_EDGE('',*,*,#1639,.T.);
#1639 = EDGE_CURVE('',#1263,#1431,#1640,.T.);
#1640 = LINE('',#1641,#1642);
#1641 = CARTESIAN_POINT('',(1.75,1.75,1.55));
#1642 = VECTOR('',#1643,1.);
#1643 = DIRECTION('',(0.,0.,1.));
#1644 = ORIENTED_EDGE('',*,*,#1438,.T.);
#1645 = ORIENTED_EDGE('',*,*,#1605,.F.);
#1646 = PLANE('',#1647);
#1647 = AXIS2_PLACEMENT_3D('',#1648,#1649,#1650);
#1648 = CARTESIAN_POINT('',(1.85,1.75,1.55));
#1649 = DIRECTION('',(0.,-1.,0.));
#1650 = DIRECTION('',(-1.,0.,0.));
#1651 = ADVANCED_FACE('',(#1652),#1663,.F.);
#1652 = FACE_BOUND('',#1653,.F.);
#1653 = EDGE_LOOP('',(#1654,#1655,#1656,#1662));
#1654 = ORIENTED_EDGE('',*,*,#1623,.T.);
#1655 = ORIENTED_EDGE('',*,*,#1414,.T.);
#1656 = ORIENTED_EDGE('',*,*,#1657,.F.);
#1657 = EDGE_CURVE('',#1247,#1415,#1658,.T.);
#1658 = LINE('',#1659,#1660);
#1659 = CARTESIAN_POINT('',(1.85,1.25,1.55));
#1660 = VECTOR('',#1661,1.);
#1661 = DIRECTION('',(0.,0.,1.));
#1662 = ORIENTED_EDGE('',*,*,#1246,.F.);
#1663 = PLANE('',#1664);
#1664 = AXIS2_PLACEMENT_3D('',#1665,#1666,#1667);
#1665 = CARTESIAN_POINT('',(2.,1.1,1.55));
#1666 = DIRECTION('',(-0.707106781187,-0.707106781187,0.));
#1667 = DIRECTION('',(-0.707106781187,0.707106781187,0.));
#1668 = ADVANCED_FACE('',(#1669),#1680,.T.);
#1669 = FACE_BOUND('',#1670,.F.);
#1670 = EDGE_LOOP('',(#1671,#1672,#1678,#1679));
#1671 = ORIENTED_EDGE('',*,*,#1262,.F.);
#1672 = ORIENTED_EDGE('',*,*,#1673,.T.);
#1673 = EDGE_CURVE('',#1255,#1423,#1674,.T.);
#1674 = LINE('',#1675,#1676);
#1675 = CARTESIAN_POINT('',(1.85,1.65,1.55));
#1676 = VECTOR('',#1677,1.);
#1677 = DIRECTION('',(0.,0.,1.));
#1678 = ORIENTED_EDGE('',*,*,#1430,.T.);
#1679 = ORIENTED_EDGE('',*,*,#1639,.F.);
#1680 = PLANE('',#1681);
#1681 = AXIS2_PLACEMENT_3D('',#1682,#1683,#1684);
#1682 = CARTESIAN_POINT('',(1.8,1.7,1.55));
#1683 = DIRECTION('',(0.707106781187,0.707106781187,0.));
#1684 = DIRECTION('',(0.,0.,-1.));
#1685 = ADVANCED_FACE('',(#1686),#1692,.F.);
#1686 = FACE_BOUND('',#1687,.F.);
#1687 = EDGE_LOOP('',(#1688,#1689,#1690,#1691));
#1688 = ORIENTED_EDGE('',*,*,#1254,.F.);
#1689 = ORIENTED_EDGE('',*,*,#1657,.T.);
#1690 = ORIENTED_EDGE('',*,*,#1422,.T.);
#1691 = ORIENTED_EDGE('',*,*,#1673,.F.);
#1692 = PLANE('',#1693);
#1693 = AXIS2_PLACEMENT_3D('',#1694,#1695,#1696);
#1694 = CARTESIAN_POINT('',(1.85,1.25,1.55));
#1695 = DIRECTION('',(-1.,0.,0.));
#1696 = DIRECTION('',(0.,1.,0.));
#1697 = ( GEOMETRIC_REPRESENTATION_CONTEXT(3) 
GLOBAL_UNCERTAINTY_ASSIGNED_CONTEXT((#1701)) 
GLOBAL_UNIT_ASSIGNED_CONTEXT((#1698,#1699,#1700)) REPRESENTATION_CONTEXT
('Context #1','3D Context with UNIT and UNCERTAINTY') );
#1698 = ( LENGTH_UNIT() NAMED_UNIT(*) SI_UNIT(.MILLI.,.METRE.) );
#1699 = ( NAMED_UNIT(*) PLANE_ANGLE_UNIT() SI_UNIT($,.RADIAN.) );
#1700 = ( NAMED_UNIT(*) SI_UNIT($,.STERADIAN.) SOLID_ANGLE_UNIT() );
#1701 = UNCERTAINTY_MEASURE_WITH_UNIT(LENGTH_MEASURE(2.E-05),#1698,
  'distance_accuracy_value','confusion accuracy');
#1702 = PRODUCT_RELATED_PRODUCT_CATEGORY('part',$,(#7));
#1703 = MECHANICAL_DESIGN_GEOMETRIC_PRESENTATION_REPRESENTATION('',(
    #1704,#1715,#1723,#1730,#1737,#1744,#1751,#1758,#1767,#1776,#1785,
    #1792,#1799,#1806,#1813,#1820,#1827,#1834,#1841,#1848,#1855,#1864,
    #1871,#1878,#1885,#1892,#1899,#1906,#1913,#1920,#1927,#1934,#1941,
    #1948,#1955,#1962,#1969,#1976,#1983),#1697);
#1704 = STYLED_ITEM('color',(#1705),#15);
#1705 = PRESENTATION_STYLE_ASSIGNMENT((#1706,#1712));
#1706 = SURFACE_STYLE_USAGE(.BOTH.,#1707);
#1707 = SURFACE_SIDE_STYLE('',(#1708));
#1708 = SURFACE_STYLE_FILL_AREA(#1709);
#1709 = FILL_AREA_STYLE('',(#1710));
#1710 = FILL_AREA_STYLE_COLOUR('',#1711);
#1711 = COLOUR_RGB('',0.800000011921,0.800000011921,0.800000011921);
#1712 = CURVE_STYLE('',#1713,POSITIVE_LENGTH_MEASURE(0.1),#1714);
#1713 = DRAUGHTING_PRE_DEFINED_CURVE_FONT('continuous');
#1714 = COLOUR_RGB('',9.803921729326E-02,9.803921729326E-02,
  9.803921729326E-02);
#1715 = OVER_RIDING_STYLED_ITEM('overriding color',(#1716),#17,#1704);
#1716 = PRESENTATION_STYLE_ASSIGNMENT((#1717));
#1717 = SURFACE_STYLE_USAGE(.BOTH.,#1718);
#1718 = SURFACE_SIDE_STYLE('',(#1719));
#1719 = SURFACE_STYLE_FILL_AREA(#1720);
#1720 = FILL_AREA_STYLE('',(#1721));
#1721 = FILL_AREA_STYLE_COLOUR('',#1722);
#1722 = COLOUR_RGB('',0.223529413342,0.305882364511,0.529411792755);
#1723 = OVER_RIDING_STYLED_ITEM('overriding color',(#1724),#57,#1704);
#1724 = PRESENTATION_STYLE_ASSIGNMENT((#1725));
#1725 = SURFACE_STYLE_USAGE(.BOTH.,#1726);
#1726 = SURFACE_SIDE_STYLE('',(#1727));
#1727 = SURFACE_STYLE_FILL_AREA(#1728);
#1728 = FILL_AREA_STYLE('',(#1729));
#1729 = FILL_AREA_STYLE_COLOUR('',#1722);
#1730 = OVER_RIDING_STYLED_ITEM('overriding color',(#1731),#88,#1704);
#1731 = PRESENTATION_STYLE_ASSIGNMENT((#1732));
#1732 = SURFACE_STYLE_USAGE(.BOTH.,#1733);
#1733 = SURFACE_SIDE_STYLE('',(#1734));
#1734 = SURFACE_STYLE_FILL_AREA(#1735);
#1735 = FILL_AREA_STYLE('',(#1736));
#1736 = FILL_AREA_STYLE_COLOUR('',#1722);
#1737 = OVER_RIDING_STYLED_ITEM('overriding color',(#1738),#119,#1704);
#1738 = PRESENTATION_STYLE_ASSIGNMENT((#1739));
#1739 = SURFACE_STYLE_USAGE(.BOTH.,#1740);
#1740 = SURFACE_SIDE_STYLE('',(#1741));
#1741 = SURFACE_STYLE_FILL_AREA(#1742);
#1742 = FILL_AREA_STYLE('',(#1743));
#1743 = FILL_AREA_STYLE_COLOUR('',#1722);
#1744 = OVER_RIDING_STYLED_ITEM('overriding color',(#1745),#141,#1704);
#1745 = PRESENTATION_STYLE_ASSIGNMENT((#1746));
#1746 = SURFACE_STYLE_USAGE(.BOTH.,#1747);
#1747 = SURFACE_SIDE_STYLE('',(#1748));
#1748 = SURFACE_STYLE_FILL_AREA(#1749);
#1749 = FILL_AREA_STYLE('',(#1750));
#1750 = FILL_AREA_STYLE_COLOUR('',#1722);
#1751 = OVER_RIDING_STYLED_ITEM('overriding color',(#1752),#153,#1704);
#1752 = PRESENTATION_STYLE_ASSIGNMENT((#1753));
#1753 = SURFACE_STYLE_USAGE(.BOTH.,#1754);
#1754 = SURFACE_SIDE_STYLE('',(#1755));
#1755 = SURFACE_STYLE_FILL_AREA(#1756);
#1756 = FILL_AREA_STYLE('',(#1757));
#1757 = FILL_AREA_STYLE_COLOUR('',#1722);
#1758 = STYLED_ITEM('color',(#1759),#165);
#1759 = PRESENTATION_STYLE_ASSIGNMENT((#1760,#1765));
#1760 = SURFACE_STYLE_USAGE(.BOTH.,#1761);
#1761 = SURFACE_SIDE_STYLE('',(#1762));
#1762 = SURFACE_STYLE_FILL_AREA(#1763);
#1763 = FILL_AREA_STYLE('',(#1764));
#1764 = FILL_AREA_STYLE_COLOUR('',#1711);
#1765 = CURVE_STYLE('',#1766,POSITIVE_LENGTH_MEASURE(0.1),#1714);
#1766 = DRAUGHTING_PRE_DEFINED_CURVE_FONT('continuous');
#1767 = STYLED_ITEM('color',(#1768),#513);
#1768 = PRESENTATION_STYLE_ASSIGNMENT((#1769,#1774));
#1769 = SURFACE_STYLE_USAGE(.BOTH.,#1770);
#1770 = SURFACE_SIDE_STYLE('',(#1771));
#1771 = SURFACE_STYLE_FILL_AREA(#1772);
#1772 = FILL_AREA_STYLE('',(#1773));
#1773 = FILL_AREA_STYLE_COLOUR('',#1711);
#1774 = CURVE_STYLE('',#1775,POSITIVE_LENGTH_MEASURE(0.1),#1714);
#1775 = DRAUGHTING_PRE_DEFINED_CURVE_FONT('continuous');
#1776 = STYLED_ITEM('color',(#1777),#861);
#1777 = PRESENTATION_STYLE_ASSIGNMENT((#1778,#1783));
#1778 = SURFACE_STYLE_USAGE(.BOTH.,#1779);
#1779 = SURFACE_SIDE_STYLE('',(#1780));
#1780 = SURFACE_STYLE_FILL_AREA(#1781);
#1781 = FILL_AREA_STYLE('',(#1782));
#1782 = FILL_AREA_STYLE_COLOUR('',#1711);
#1783 = CURVE_STYLE('',#1784,POSITIVE_LENGTH_MEASURE(0.1),#1714);
#1784 = DRAUGHTING_PRE_DEFINED_CURVE_FONT('continuous');
#1785 = OVER_RIDING_STYLED_ITEM('overriding color',(#1786),#863,#1776);
#1786 = PRESENTATION_STYLE_ASSIGNMENT((#1787));
#1787 = SURFACE_STYLE_USAGE(.BOTH.,#1788);
#1788 = SURFACE_SIDE_STYLE('',(#1789));
#1789 = SURFACE_STYLE_FILL_AREA(#1790);
#1790 = FILL_AREA_STYLE('',(#1791));
#1791 = FILL_AREA_STYLE_COLOUR('',#1722);
#1792 = OVER_RIDING_STYLED_ITEM('overriding color',(#1793),#903,#1776);
#1793 = PRESENTATION_STYLE_ASSIGNMENT((#1794));
#1794 = SURFACE_STYLE_USAGE(.BOTH.,#1795);
#1795 = SURFACE_SIDE_STYLE('',(#1796));
#1796 = SURFACE_STYLE_FILL_AREA(#1797);
#1797 = FILL_AREA_STYLE('',(#1798));
#1798 = FILL_AREA_STYLE_COLOUR('',#1722);
#1799 = OVER_RIDING_STYLED_ITEM('overriding color',(#1800),#936,#1776);
#1800 = PRESENTATION_STYLE_ASSIGNMENT((#1801));
#1801 = SURFACE_STYLE_USAGE(.BOTH.,#1802);
#1802 = SURFACE_SIDE_STYLE('',(#1803));
#1803 = SURFACE_STYLE_FILL_AREA(#1804);
#1804 = FILL_AREA_STYLE('',(#1805));
#1805 = FILL_AREA_STYLE_COLOUR('',#1722);
#1806 = OVER_RIDING_STYLED_ITEM('overriding color',(#1807),#967,#1776);
#1807 = PRESENTATION_STYLE_ASSIGNMENT((#1808));
#1808 = SURFACE_STYLE_USAGE(.BOTH.,#1809);
#1809 = SURFACE_SIDE_STYLE('',(#1810));
#1810 = SURFACE_STYLE_FILL_AREA(#1811);
#1811 = FILL_AREA_STYLE('',(#1812));
#1812 = FILL_AREA_STYLE_COLOUR('',#1722);
#1813 = OVER_RIDING_STYLED_ITEM('overriding color',(#1814),#1000,#1776);
#1814 = PRESENTATION_STYLE_ASSIGNMENT((#1815));
#1815 = SURFACE_STYLE_USAGE(.BOTH.,#1816);
#1816 = SURFACE_SIDE_STYLE('',(#1817));
#1817 = SURFACE_STYLE_FILL_AREA(#1818);
#1818 = FILL_AREA_STYLE('',(#1819));
#1819 = FILL_AREA_STYLE_COLOUR('',#1722);
#1820 = OVER_RIDING_STYLED_ITEM('overriding color',(#1821),#1031,#1776);
#1821 = PRESENTATION_STYLE_ASSIGNMENT((#1822));
#1822 = SURFACE_STYLE_USAGE(.BOTH.,#1823);
#1823 = SURFACE_SIDE_STYLE('',(#1824));
#1824 = SURFACE_STYLE_FILL_AREA(#1825);
#1825 = FILL_AREA_STYLE('',(#1826));
#1826 = FILL_AREA_STYLE_COLOUR('',#1722);
#1827 = OVER_RIDING_STYLED_ITEM('overriding color',(#1828),#1064,#1776);
#1828 = PRESENTATION_STYLE_ASSIGNMENT((#1829));
#1829 = SURFACE_STYLE_USAGE(.BOTH.,#1830);
#1830 = SURFACE_SIDE_STYLE('',(#1831));
#1831 = SURFACE_STYLE_FILL_AREA(#1832);
#1832 = FILL_AREA_STYLE('',(#1833));
#1833 = FILL_AREA_STYLE_COLOUR('',#1722);
#1834 = OVER_RIDING_STYLED_ITEM('overriding color',(#1835),#1095,#1776);
#1835 = PRESENTATION_STYLE_ASSIGNMENT((#1836));
#1836 = SURFACE_STYLE_USAGE(.BOTH.,#1837);
#1837 = SURFACE_SIDE_STYLE('',(#1838));
#1838 = SURFACE_STYLE_FILL_AREA(#1839);
#1839 = FILL_AREA_STYLE('',(#1840));
#1840 = FILL_AREA_STYLE_COLOUR('',#1722);
#1841 = OVER_RIDING_STYLED_ITEM('overriding color',(#1842),#1119,#1776);
#1842 = PRESENTATION_STYLE_ASSIGNMENT((#1843));
#1843 = SURFACE_STYLE_USAGE(.BOTH.,#1844);
#1844 = SURFACE_SIDE_STYLE('',(#1845));
#1845 = SURFACE_STYLE_FILL_AREA(#1846);
#1846 = FILL_AREA_STYLE('',(#1847));
#1847 = FILL_AREA_STYLE_COLOUR('',#1722);
#1848 = OVER_RIDING_STYLED_ITEM('overriding color',(#1849),#1135,#1776);
#1849 = PRESENTATION_STYLE_ASSIGNMENT((#1850));
#1850 = SURFACE_STYLE_USAGE(.BOTH.,#1851);
#1851 = SURFACE_SIDE_STYLE('',(#1852));
#1852 = SURFACE_STYLE_FILL_AREA(#1853);
#1853 = FILL_AREA_STYLE('',(#1854));
#1854 = FILL_AREA_STYLE_COLOUR('',#1722);
#1855 = STYLED_ITEM('color',(#1856),#1151);
#1856 = PRESENTATION_STYLE_ASSIGNMENT((#1857,#1862));
#1857 = SURFACE_STYLE_USAGE(.BOTH.,#1858);
#1858 = SURFACE_SIDE_STYLE('',(#1859));
#1859 = SURFACE_STYLE_FILL_AREA(#1860);
#1860 = FILL_AREA_STYLE('',(#1861));
#1861 = FILL_AREA_STYLE_COLOUR('',#1711);
#1862 = CURVE_STYLE('',#1863,POSITIVE_LENGTH_MEASURE(0.1),#1714);
#1863 = DRAUGHTING_PRE_DEFINED_CURVE_FONT('continuous');
#1864 = OVER_RIDING_STYLED_ITEM('overriding color',(#1865),#1153,#1855);
#1865 = PRESENTATION_STYLE_ASSIGNMENT((#1866));
#1866 = SURFACE_STYLE_USAGE(.BOTH.,#1867);
#1867 = SURFACE_SIDE_STYLE('',(#1868));
#1868 = SURFACE_STYLE_FILL_AREA(#1869);
#1869 = FILL_AREA_STYLE('',(#1870));
#1870 = FILL_AREA_STYLE_COLOUR('',#1722);
#1871 = OVER_RIDING_STYLED_ITEM('overriding color',(#1872),#1193,#1855);
#1872 = PRESENTATION_STYLE_ASSIGNMENT((#1873));
#1873 = SURFACE_STYLE_USAGE(.BOTH.,#1874);
#1874 = SURFACE_SIDE_STYLE('',(#1875));
#1875 = SURFACE_STYLE_FILL_AREA(#1876);
#1876 = FILL_AREA_STYLE('',(#1877));
#1877 = FILL_AREA_STYLE_COLOUR('',#1722);
#1878 = OVER_RIDING_STYLED_ITEM('overriding color',(#1879),#1320,#1855);
#1879 = PRESENTATION_STYLE_ASSIGNMENT((#1880));
#1880 = SURFACE_STYLE_USAGE(.BOTH.,#1881);
#1881 = SURFACE_SIDE_STYLE('',(#1882));
#1882 = SURFACE_STYLE_FILL_AREA(#1883);
#1883 = FILL_AREA_STYLE('',(#1884));
#1884 = FILL_AREA_STYLE_COLOUR('',#1722);
#1885 = OVER_RIDING_STYLED_ITEM('overriding color',(#1886),#1344,#1855);
#1886 = PRESENTATION_STYLE_ASSIGNMENT((#1887));
#1887 = SURFACE_STYLE_USAGE(.BOTH.,#1888);
#1888 = SURFACE_SIDE_STYLE('',(#1889));
#1889 = SURFACE_STYLE_FILL_AREA(#1890);
#1890 = FILL_AREA_STYLE('',(#1891));
#1891 = FILL_AREA_STYLE_COLOUR('',#1722);
#1892 = OVER_RIDING_STYLED_ITEM('overriding color',(#1893),#1368,#1855);
#1893 = PRESENTATION_STYLE_ASSIGNMENT((#1894));
#1894 = SURFACE_STYLE_USAGE(.BOTH.,#1895);
#1895 = SURFACE_SIDE_STYLE('',(#1896));
#1896 = SURFACE_STYLE_FILL_AREA(#1897);
#1897 = FILL_AREA_STYLE('',(#1898));
#1898 = FILL_AREA_STYLE_COLOUR('',#1722);
#1899 = OVER_RIDING_STYLED_ITEM('overriding color',(#1900),#1481,#1855);
#1900 = PRESENTATION_STYLE_ASSIGNMENT((#1901));
#1901 = SURFACE_STYLE_USAGE(.BOTH.,#1902);
#1902 = SURFACE_SIDE_STYLE('',(#1903));
#1903 = SURFACE_STYLE_FILL_AREA(#1904);
#1904 = FILL_AREA_STYLE('',(#1905));
#1905 = FILL_AREA_STYLE_COLOUR('',#1722);
#1906 = OVER_RIDING_STYLED_ITEM('overriding color',(#1907),#1498,#1855);
#1907 = PRESENTATION_STYLE_ASSIGNMENT((#1908));
#1908 = SURFACE_STYLE_USAGE(.BOTH.,#1909);
#1909 = SURFACE_SIDE_STYLE('',(#1910));
#1910 = SURFACE_STYLE_FILL_AREA(#1911);
#1911 = FILL_AREA_STYLE('',(#1912));
#1912 = FILL_AREA_STYLE_COLOUR('',#1722);
#1913 = OVER_RIDING_STYLED_ITEM('overriding color',(#1914),#1515,#1855);
#1914 = PRESENTATION_STYLE_ASSIGNMENT((#1915));
#1915 = SURFACE_STYLE_USAGE(.BOTH.,#1916);
#1916 = SURFACE_SIDE_STYLE('',(#1917));
#1917 = SURFACE_STYLE_FILL_AREA(#1918);
#1918 = FILL_AREA_STYLE('',(#1919));
#1919 = FILL_AREA_STYLE_COLOUR('',#1722);
#1920 = OVER_RIDING_STYLED_ITEM('overriding color',(#1921),#1532,#1855);
#1921 = PRESENTATION_STYLE_ASSIGNMENT((#1922));
#1922 = SURFACE_STYLE_USAGE(.BOTH.,#1923);
#1923 = SURFACE_SIDE_STYLE('',(#1924));
#1924 = SURFACE_STYLE_FILL_AREA(#1925);
#1925 = FILL_AREA_STYLE('',(#1926));
#1926 = FILL_AREA_STYLE_COLOUR('',#1722);
#1927 = OVER_RIDING_STYLED_ITEM('overriding color',(#1928),#1549,#1855);
#1928 = PRESENTATION_STYLE_ASSIGNMENT((#1929));
#1929 = SURFACE_STYLE_USAGE(.BOTH.,#1930);
#1930 = SURFACE_SIDE_STYLE('',(#1931));
#1931 = SURFACE_STYLE_FILL_AREA(#1932);
#1932 = FILL_AREA_STYLE('',(#1933));
#1933 = FILL_AREA_STYLE_COLOUR('',#1722);
#1934 = OVER_RIDING_STYLED_ITEM('overriding color',(#1935),#1566,#1855);
#1935 = PRESENTATION_STYLE_ASSIGNMENT((#1936));
#1936 = SURFACE_STYLE_USAGE(.BOTH.,#1937);
#1937 = SURFACE_SIDE_STYLE('',(#1938));
#1938 = SURFACE_STYLE_FILL_AREA(#1939);
#1939 = FILL_AREA_STYLE('',(#1940));
#1940 = FILL_AREA_STYLE_COLOUR('',#1722);
#1941 = OVER_RIDING_STYLED_ITEM('overriding color',(#1942),#1583,#1855);
#1942 = PRESENTATION_STYLE_ASSIGNMENT((#1943));
#1943 = SURFACE_STYLE_USAGE(.BOTH.,#1944);
#1944 = SURFACE_SIDE_STYLE('',(#1945));
#1945 = SURFACE_STYLE_FILL_AREA(#1946);
#1946 = FILL_AREA_STYLE('',(#1947));
#1947 = FILL_AREA_STYLE_COLOUR('',#1722);
#1948 = OVER_RIDING_STYLED_ITEM('overriding color',(#1949),#1600,#1855);
#1949 = PRESENTATION_STYLE_ASSIGNMENT((#1950));
#1950 = SURFACE_STYLE_USAGE(.BOTH.,#1951);
#1951 = SURFACE_SIDE_STYLE('',(#1952));
#1952 = SURFACE_STYLE_FILL_AREA(#1953);
#1953 = FILL_AREA_STYLE('',(#1954));
#1954 = FILL_AREA_STYLE_COLOUR('',#1722);
#1955 = OVER_RIDING_STYLED_ITEM('overriding color',(#1956),#1617,#1855);
#1956 = PRESENTATION_STYLE_ASSIGNMENT((#1957));
#1957 = SURFACE_STYLE_USAGE(.BOTH.,#1958);
#1958 = SURFACE_SIDE_STYLE('',(#1959));
#1959 = SURFACE_STYLE_FILL_AREA(#1960);
#1960 = FILL_AREA_STYLE('',(#1961));
#1961 = FILL_AREA_STYLE_COLOUR('',#1722);
#1962 = OVER_RIDING_STYLED_ITEM('overriding color',(#1963),#1634,#1855);
#1963 = PRESENTATION_STYLE_ASSIGNMENT((#1964));
#1964 = SURFACE_STYLE_USAGE(.BOTH.,#1965);
#1965 = SURFACE_SIDE_STYLE('',(#1966));
#1966 = SURFACE_STYLE_FILL_AREA(#1967);
#1967 = FILL_AREA_STYLE('',(#1968));
#1968 = FILL_AREA_STYLE_COLOUR('',#1722);
#1969 = OVER_RIDING_STYLED_ITEM('overriding color',(#1970),#1651,#1855);
#1970 = PRESENTATION_STYLE_ASSIGNMENT((#1971));
#1971 = SURFACE_STYLE_USAGE(.BOTH.,#1972);
#1972 = SURFACE_SIDE_STYLE('',(#1973));
#1973 = SURFACE_STYLE_FILL_AREA(#1974);
#1974 = FILL_AREA_STYLE('',(#1975));
#1975 = FILL_AREA_STYLE_COLOUR('',#1722);
#1976 = OVER_RIDING_STYLED_ITEM('overriding color',(#1977),#1668,#1855);
#1977 = PRESENTATION_STYLE_ASSIGNMENT((#1978));
#1978 = SURFACE_STYLE_USAGE(.BOTH.,#1979);
#1979 = SURFACE_SIDE_STYLE('',(#1980));
#1980 = SURFACE_STYLE_FILL_AREA(#1981);
#1981 = FILL_AREA_STYLE('',(#1982));
#1982 = FILL_AREA_STYLE_COLOUR('',#1722);
#1983 = OVER_RIDING_STYLED_ITEM('overriding color',(#1984),#1685,#1855);
#1984 = PRESENTATION_STYLE_ASSIGNMENT((#1985));
#1985 = SURFACE_STYLE_USAGE(.BOTH.,#1986);
#1986 = SURFACE_SIDE_STYLE('',(#1987));
#1987 = SURFACE_STYLE_FILL_AREA(#1988);
#1988 = FILL_AREA_STYLE('',(#1989));
#1989 = FILL_AREA_STYLE_COLOUR('',#1722);
ENDSEC;
END-ISO-10303-21;
