EESchema Schematic File Version 4
EELAYER 30 0
EELAYER END
$Descr User 17335 11946
encoding utf-8
Sheet 3 8
Title "RB0505 CPU Board"
Date "2020-04-15"
Rev ""
Comp ""
Comment1 ""
Comment2 ""
Comment3 ""
Comment4 ""
$EndDescr
Wire Wire Line
	4650 2250 4650 2350
Wire Wire Line
	14750 2325 14750 2425
Wire Wire Line
	13375 2525 13375 2625
Wire Wire Line
	13375 2625 13375 2675
Wire Wire Line
	13375 2625 12850 2625
Wire Wire Line
	12850 2625 12850 2125
Wire Wire Line
	14200 2625 14200 2325
Connection ~ 13375 2625
Wire Wire Line
	10650 2125 10650 2225
Wire Wire Line
	10650 2225 10650 2325
Wire Wire Line
	10650 2325 10650 2425
Connection ~ 10650 2425
Connection ~ 10650 2325
Connection ~ 10650 2225
Text HLabel 4850 1900 2    56   Output ~ 0
PRES-INT
Text HLabel 4825 3725 2    56   Output ~ 0
P_VALVE
Text HLabel 4800 5550 2    56   Output ~ 0
PRES-PROX
Text HLabel 7050 4150 0    56   Input ~ 0
CE\-INT-PRES-SENS
Text HLabel 7050 4050 0    56   Input ~ 0
SCLK-SPI-0
Text HLabel 10950 6000 0    56   Input ~ 0
SCLK-SPI-0
Text HLabel 7050 2475 0    56   Output ~ 0
MRST-SPI-0_E
Text HLabel 10950 4400 0    56   Output ~ 0
MRST-SPI-0_E
Text HLabel 7050 4250 0    56   Input ~ 0
MTSR-SPI-0
Text HLabel 10950 6200 0    56   Input ~ 0
MTSR-SPI-0
Text Label 7050 2375 2    56   ~ 0
INT-PRES-MEAS
Wire Wire Line
	3950 2763 4387 2763
Text Label 4387 2763 0    56   ~ 0
INT-PRES-MEAS
Wire Wire Line
	3950 6300 3950 6400
Text Label 7050 8475 2    56   ~ 0
VALVE-PRES-MEAS
Text HLabel 7050 10250 0    56   Input ~ 0
CE\-VALV-PRES-SENS
Text HLabel 11600 2050 2    56   Output ~ 0
QI-MEAS
Wire Wire Line
	14350 2025 14200 2025
Wire Wire Line
	14200 2025 13775 2025
Wire Wire Line
	14200 2025 14200 2125
Connection ~ 14200 2025
Wire Wire Line
	14750 2125 14750 2025
Wire Wire Line
	14750 2025 14887 2025
Connection ~ 14750 2025
Text HLabel 14887 2025 2    70   Output ~ 0
MES_Q_E
Wire Wire Line
	12850 1925 12850 1475
Wire Wire Line
	12850 1475 13375 1475
Wire Wire Line
	13375 1475 13375 1525
Wire Wire Line
	13375 1475 13375 1425
Connection ~ 13375 1475
Text HLabel 10950 6100 0    56   Input ~ 0
CE\-FLOW-INSP-SENS
Text HLabel 13400 6075 0    56   Input ~ 0
CE\-FLOW-EXP-SENS
$Comp
L cpu-board:C1206 C59
U 1 1 079CFDA5
P 1525 1575
F 0 "C59" H 1244 1625 64  0000 L BNN
F 1 "220nF" H 1238 1481 42  0000 L BNN
F 2 "AllModules:C0805_1" H 1525 1575 50  0001 C CNN
F 3 "" H 1525 1575 50  0001 C CNN
F 4 "CAP CERAMIC,220NF,25V,X7R,+/-10%,0805" H 1525 1575 50  0001 C CNN "Description"
F 5 "10022968" H 1525 1575 50  0001 C CNN "Item Number"
F 6 "AVX_RMS1" H 1525 1575 50  0001 C CNN "Manufacturer"
F 7 "08053C224KAZ2A" H 1525 1575 50  0001 C CNN "Manufacturer_No"
F 8 "SMT MULTILAYER CAPACITOR" H 1525 1575 50  0001 C CNN "Manufacturer_Desc"
F 9 "KEMET_RMS1" H 1525 1575 50  0001 C CNN "Manufacturer2"
F 10 "C0805C224K3RAC" H 1525 1575 50  0001 C CNN "Manufacturer_No2"
F 11 "CERAMIC CHIP CAPACITOR" H 1525 1575 50  0001 C CNN "Manufacturer_Desc2"
F 12 "AVX_RMS1" H 1525 1575 50  0001 C CNN "Manufacturer3"
F 13 "08053C224KAT2A" H 1525 1575 50  0001 C CNN "Manufacturer_No3"
F 14 "X7R DIELECTRIC" H 1525 1575 50  0001 C CNN "Manufacturer_Desc3"
F 15 "KEMET_RMS1" H 1525 1575 50  0001 C CNN "Manufacturer4"
F 16 "C0805C224K3RACTU" H 1525 1575 50  0001 C CNN "Manufacturer_No4"
F 17 "CERAMIC CHIP CAPACITOR" H 1525 1575 50  0001 C CNN "Manufacturer_Desc4"
	1    1525 1575
	1    0    0    -1  
$EndComp
$Comp
L cpu-board:C1206 C65
U 1 1 6EB094ED
P 1500 3375
F 0 "C65" H 1219 3375 64  0000 L BNN
F 1 "220nF" H 1213 3306 42  0000 L BNN
F 2 "AllModules:C0805_1" H 1500 3375 50  0001 C CNN
F 3 "" H 1500 3375 50  0001 C CNN
F 4 "CAP CERAMIC,220NF,25V,X7R,+/-10%,0805" H 1500 3375 50  0001 C CNN "Description"
F 5 "10022968" H 1500 3375 50  0001 C CNN "Item Number"
F 6 "AVX_RMS1" H 1500 3375 50  0001 C CNN "Manufacturer"
F 7 "08053C224KAZ2A" H 1500 3375 50  0001 C CNN "Manufacturer_No"
F 8 "SMT MULTILAYER CAPACITOR" H 1500 3375 50  0001 C CNN "Manufacturer_Desc"
F 9 "KEMET_RMS1" H 1500 3375 50  0001 C CNN "Manufacturer2"
F 10 "C0805C224K3RAC" H 1500 3375 50  0001 C CNN "Manufacturer_No2"
F 11 "CERAMIC CHIP CAPACITOR" H 1500 3375 50  0001 C CNN "Manufacturer_Desc2"
F 12 "AVX_RMS1" H 1500 3375 50  0001 C CNN "Manufacturer3"
F 13 "08053C224KAT2A" H 1500 3375 50  0001 C CNN "Manufacturer_No3"
F 14 "X7R DIELECTRIC" H 1500 3375 50  0001 C CNN "Manufacturer_Desc3"
F 15 "KEMET_RMS1" H 1500 3375 50  0001 C CNN "Manufacturer4"
F 16 "C0805C224K3RACTU" H 1500 3375 50  0001 C CNN "Manufacturer_No4"
F 17 "CERAMIC CHIP CAPACITOR" H 1500 3375 50  0001 C CNN "Manufacturer_Desc4"
	1    1500 3375
	1    0    0    -1  
$EndComp
$Comp
L cpu-board:R0805 R34
U 1 1 EFB8A895
P 4400 1900
F 0 "R34" H 4337 2050 64  0000 L BNN
F 1 "4.7k" H 4350 1975 42  0000 L BNN
F 2 "AllModules:R0603_1" H 4400 1900 50  0001 C CNN
F 3 "" H 4400 1900 50  0001 C CNN
F 4 "RESISTOR, 4.7 K OHM, 0.063W +/-5%" H 4400 1900 50  0001 C CNN "Description"
F 5 "10022617" H 4400 1900 50  0001 C CNN "Item Number"
F 6 "ASJ" H 4400 1900 50  0001 C CNN "Manufacturer"
F 7 "CR16-472JL" H 4400 1900 50  0001 C CNN "Manufacturer_No"
F 8 "THICK FILM CHIP RESISTOR" H 4400 1900 50  0001 C CNN "Manufacturer_Desc"
F 9 "YAGEO_RMS1" H 4400 1900 50  0001 C CNN "Manufacturer2"
F 10 "232270260472L" H 4400 1900 50  0001 C CNN "Manufacturer_No2"
F 11 "RESISTOR, METAL GLAZE/THICK FILM, 0.1 W, 5 %, 100 PPM, 4700 OHM, SURFACE MOUNT, 0603" H 4400 1900 50  0001 C CNN "Manufacturer_Desc2"
F 12 "YAGEO_RMS1" H 4400 1900 50  0001 C CNN "Manufacturer3"
F 13 "RC0603JR-074K7L" H 4400 1900 50  0001 C CNN "Manufacturer_No3"
F 14 "RESISTOR, METAL GLAZE/THICK FILM, 0.1 W, 5 %, 100 PPM, 4700 OHM, SURFACE MOUNT, 0603" H 4400 1900 50  0001 C CNN "Manufacturer_Desc3"
F 15 "YAGEO_RMS1" H 4400 1900 50  0001 C CNN "Manufacturer4"
F 16 "232270260472" H 4400 1900 50  0001 C CNN "Manufacturer_No4"
F 17 "RESISTOR, METAL GLAZE/THICK FILM, 0.1 W, 5 %, 100 PPM, 4700 OHM, SURFACE MOUNT, 0603" H 4400 1900 50  0001 C CNN "Manufacturer_Desc4"
	1    4400 1900
	1    0    0    -1  
$EndComp
$Comp
L cpu-board:C0805 C63
U 1 1 2FAB5BC8
P 4650 2150
F 0 "C63" H 4750 2200 64  0000 L CNN
F 1 "100nF" H 4750 2100 42  0000 L CNN
F 2 "AllModules:C0402_1" H 4650 2150 50  0001 C CNN
F 3 "" H 4650 2150 50  0001 C CNN
F 4 "CAPACITOR,100NF,16V,+/-10%,X7R,0402" H 4650 2150 50  0001 C CNN "Description"
F 5 "10022607" H 4650 2150 50  0001 C CNN "Item Number"
F 6 "MURATA" H 4650 2150 50  0001 C CNN "Manufacturer"
F 7 "GRM155R71C104JA88J" H 4650 2150 50  0001 C CNN "Manufacturer_No"
F 8 "CAPACITOR, CERAMIC, MULTILAYER, 16V, X7R, 0.1UF, 0402" H 4650 2150 50  0001 C CNN "Manufacturer_Desc"
F 9 "YAGEO_RMS1" H 4650 2150 50  0001 C CNN "Manufacturer2"
F 10 "CC0402KRX7R7BB104" H 4650 2150 50  0001 C CNN "Manufacturer_No2"
F 11 "CAP CER 0.1uF 16V X7R 10% 0402" H 4650 2150 50  0001 C CNN "Manufacturer_Desc2"
F 12 "YAGEO_RMS1" H 4650 2150 50  0001 C CNN "Manufacturer3"
F 13 "223878715649" H 4650 2150 50  0001 C CNN "Manufacturer_No3"
F 14 "CAPACITOR, CERAMIC, MULTILAYER, 16 V, X7R, 0.1 UF, SURFACE MOUNT, 0402" H 4650 2150 50  0001 C CNN "Manufacturer_Desc3"
F 15 "MURATA MANUFACTURING CO., LTD." H 4650 2150 50  0001 C CNN "Manufacturer4"
F 16 "GRM155R71C104KA88D" H 4650 2150 50  0001 C CNN "Manufacturer_No4"
F 17 "MONOLITHIC CERAMIC CAPACITOR" H 4650 2150 50  0001 C CNN "Manufacturer_Desc4"
	1    4650 2150
	1    0    0    -1  
$EndComp
$Comp
L cpu-board:0VANA #U$0130
U 1 1 A92F6304
P 4650 2350
F 0 "#U$0130" H 4650 2350 50  0001 C CNN
F 1 "0VANA" H 4537 2175 59  0000 L BNN
F 2 "" H 4650 2350 50  0001 C CNN
F 3 "" H 4650 2350 50  0001 C CNN
	1    4650 2350
	1    0    0    -1  
$EndComp
$Comp
L cpu-board:C0805 C64
U 1 1 680B2917
P 3550 2100
F 0 "C64" H 3650 2150 64  0000 L CNN
F 1 "4.7nF" H 3650 2050 42  0000 L CNN
F 2 "AllModules:C0603_1" H 3550 2100 50  0001 C CNN
F 3 "" H 3550 2100 50  0001 C CNN
F 4 "CAPACITOR CERAMIC,4.7NF,+/-10%,50V,0603" H 3550 2100 50  0001 C CNN "Description"
F 5 "10022613" H 3550 2100 50  0001 C CNN "Item Number"
F 6 "KEMET_RMS1" H 3550 2100 50  0001 C CNN "Manufacturer"
F 7 "C0603C472K5RACTU" H 3550 2100 50  0001 C CNN "Manufacturer_No"
F 8 "CAP 4700PF 50V CERAMIC X7R 0603" H 3550 2100 50  0001 C CNN "Manufacturer_Desc"
F 9 "YAGEO_RMS1" H 3550 2100 50  0001 C CNN "Manufacturer2"
F 10 "CC0603KRX7R9BB472" H 3550 2100 50  0001 C CNN "Manufacturer_No2"
F 11 "" H 3550 2100 50  0001 C CNN "Manufacturer_Desc2"
	1    3550 2100
	1    0    0    -1  
$EndComp
$Comp
L cpu-board:0VANA #U$0169
U 1 1 960C894E
P 1525 2550
F 0 "#U$0169" H 1525 2550 50  0001 C CNN
F 1 "0VANA" H 1438 2363 59  0000 L BNN
F 2 "" H 1525 2550 50  0001 C CNN
F 3 "" H 1525 2550 50  0001 C CNN
	1    1525 2550
	1    0    0    -1  
$EndComp
$Comp
L cpu-board:R0805 R38
U 1 1 6C0A03D3
P 4300 3725
F 0 "R38" H 4225 3875 64  0000 L BNN
F 1 "4.7k" H 4237 3800 42  0000 L BNN
F 2 "AllModules:R0603_1" H 4300 3725 50  0001 C CNN
F 3 "" H 4300 3725 50  0001 C CNN
F 4 "RESISTOR, 4.7 K OHM, 0.063W +/-5%" H 4300 3725 50  0001 C CNN "Description"
F 5 "10022617" H 4300 3725 50  0001 C CNN "Item Number"
F 6 "ASJ" H 4300 3725 50  0001 C CNN "Manufacturer"
F 7 "CR16-472JL" H 4300 3725 50  0001 C CNN "Manufacturer_No"
F 8 "THICK FILM CHIP RESISTOR" H 4300 3725 50  0001 C CNN "Manufacturer_Desc"
F 9 "YAGEO_RMS1" H 4300 3725 50  0001 C CNN "Manufacturer2"
F 10 "232270260472L" H 4300 3725 50  0001 C CNN "Manufacturer_No2"
F 11 "RESISTOR, METAL GLAZE/THICK FILM, 0.1 W, 5 %, 100 PPM, 4700 OHM, SURFACE MOUNT, 0603" H 4300 3725 50  0001 C CNN "Manufacturer_Desc2"
F 12 "YAGEO_RMS1" H 4300 3725 50  0001 C CNN "Manufacturer3"
F 13 "RC0603JR-074K7L" H 4300 3725 50  0001 C CNN "Manufacturer_No3"
F 14 "RESISTOR, METAL GLAZE/THICK FILM, 0.1 W, 5 %, 100 PPM, 4700 OHM, SURFACE MOUNT, 0603" H 4300 3725 50  0001 C CNN "Manufacturer_Desc3"
F 15 "YAGEO_RMS1" H 4300 3725 50  0001 C CNN "Manufacturer4"
F 16 "232270260472" H 4300 3725 50  0001 C CNN "Manufacturer_No4"
F 17 "RESISTOR, METAL GLAZE/THICK FILM, 0.1 W, 5 %, 100 PPM, 4700 OHM, SURFACE MOUNT, 0603" H 4300 3725 50  0001 C CNN "Manufacturer_Desc4"
	1    4300 3725
	1    0    0    -1  
$EndComp
$Comp
L cpu-board:C0805 C70
U 1 1 5F8D81F9
P 4550 4000
F 0 "C70" H 4725 4075 64  0000 L CNN
F 1 "100nF" H 4725 3975 42  0000 L CNN
F 2 "AllModules:C0402_1" H 4550 4000 50  0001 C CNN
F 3 "" H 4550 4000 50  0001 C CNN
F 4 "CAPACITOR,100NF,16V,+/-10%,X7R,0402" H 4550 4000 50  0001 C CNN "Description"
F 5 "10022607" H 4550 4000 50  0001 C CNN "Item Number"
F 6 "MURATA" H 4550 4000 50  0001 C CNN "Manufacturer"
F 7 "GRM155R71C104JA88J" H 4550 4000 50  0001 C CNN "Manufacturer_No"
F 8 "CAPACITOR, CERAMIC, MULTILAYER, 16V, X7R, 0.1UF, 0402" H 4550 4000 50  0001 C CNN "Manufacturer_Desc"
F 9 "YAGEO_RMS1" H 4550 4000 50  0001 C CNN "Manufacturer2"
F 10 "CC0402KRX7R7BB104" H 4550 4000 50  0001 C CNN "Manufacturer_No2"
F 11 "CAP CER 0.1uF 16V X7R 10% 0402" H 4550 4000 50  0001 C CNN "Manufacturer_Desc2"
F 12 "YAGEO_RMS1" H 4550 4000 50  0001 C CNN "Manufacturer3"
F 13 "223878715649" H 4550 4000 50  0001 C CNN "Manufacturer_No3"
F 14 "CAPACITOR, CERAMIC, MULTILAYER, 16 V, X7R, 0.1 UF, SURFACE MOUNT, 0402" H 4550 4000 50  0001 C CNN "Manufacturer_Desc3"
F 15 "MURATA MANUFACTURING CO., LTD." H 4550 4000 50  0001 C CNN "Manufacturer4"
F 16 "GRM155R71C104KA88D" H 4550 4000 50  0001 C CNN "Manufacturer_No4"
F 17 "MONOLITHIC CERAMIC CAPACITOR" H 4550 4000 50  0001 C CNN "Manufacturer_Desc4"
	1    4550 4000
	1    0    0    -1  
$EndComp
$Comp
L cpu-board:C0805 C71
U 1 1 13BC9B95
P 3550 3900
F 0 "C71" H 3650 3950 64  0000 L CNN
F 1 "4.7nF" H 3650 3850 42  0000 L CNN
F 2 "AllModules:C0603_1" H 3550 3900 50  0001 C CNN
F 3 "" H 3550 3900 50  0001 C CNN
F 4 "CAPACITOR CERAMIC,4.7NF,+/-10%,50V,0603" H 3550 3900 50  0001 C CNN "Description"
F 5 "10022613" H 3550 3900 50  0001 C CNN "Item Number"
F 6 "KEMET_RMS1" H 3550 3900 50  0001 C CNN "Manufacturer"
F 7 "C0603C472K5RACTU" H 3550 3900 50  0001 C CNN "Manufacturer_No"
F 8 "CAP 4700PF 50V CERAMIC X7R 0603" H 3550 3900 50  0001 C CNN "Manufacturer_Desc"
F 9 "YAGEO_RMS1" H 3550 3900 50  0001 C CNN "Manufacturer2"
F 10 "CC0603KRX7R9BB472" H 3550 3900 50  0001 C CNN "Manufacturer_No2"
F 11 "" H 3550 3900 50  0001 C CNN "Manufacturer_Desc2"
	1    3550 3900
	1    0    0    -1  
$EndComp
$Comp
L cpu-board:ASDX IC18
U 1 1 CEEB9070
P 2475 3825
F 0 "IC18" H 2463 4388 85  0000 C CNN
F 1 "ASDX001D44R-SQ04689" H 2463 4288 55  0000 C CNN
F 2 "AllModules:ASDX001D44R_1" H 2475 3825 50  0001 C CNN
F 3 "" H 2475 3825 50  0001 C CNN
F 4 "IC, PRESSURE TRANSDUCER,(-10/+100 MBAR)" H 2475 3825 50  0001 C CNN "Description"
F 5 "10023117" H 2475 3825 50  0001 C CNN "Item Number"
F 6 "SENSYM_RMS1" H 2475 3825 50  0001 C CNN "Manufacturer"
F 7 "ASDX001D44R-SQ04689" H 2475 3825 50  0001 C CNN "Manufacturer_No"
F 8 "PRESSURE TRANSDUCER" H 2475 3825 50  0001 C CNN "Manufacturer_Desc"
F 9 "HONEYWELL_RMS1" H 2475 3825 50  0001 C CNN "Manufacturer2"
F 10 "XZ209766-ASDX" H 2475 3825 50  0001 C CNN "Manufacturer_No2"
F 11 "IC DIFFERENTIAL PRESSURE SENSOR WITH ANALOGUE OUTPUT -10 TO 100 MBAR" H 2475 3825 50  0001 C CNN "Manufacturer_Desc2"
	1    2475 3825
	1    0    0    -1  
$EndComp
$Comp
L cpu-board:+5VREF #U$07
U 1 1 63C62AE7
P 3500 1275
F 0 "#U$07" H 3500 1275 50  0001 C CNN
F 1 "+5VREF" V 3475 1212 59  0000 R TNN
F 2 "" H 3500 1275 50  0001 C CNN
F 3 "" H 3500 1275 50  0001 C CNN
	1    3500 1275
	0    -1   -1   0   
$EndComp
$Comp
L cpu-board:+5VREF #U$030
U 1 1 A87AFBDE
P 2500 2875
F 0 "#U$030" H 2500 2875 50  0001 C CNN
F 1 "+5VREF" H 2625 2837 59  0000 R TNN
F 2 "" H 2500 2875 50  0001 C CNN
F 3 "" H 2500 2875 50  0001 C CNN
	1    2500 2875
	-1   0    0    1   
$EndComp
$Comp
L cpu-board:+5VREF #U$058
U 1 1 039D6C76
P 8050 1975
F 0 "#U$058" H 8050 1975 50  0001 C CNN
F 1 "+5VREF" H 7887 1887 59  0000 L BNN
F 2 "" H 8050 1975 50  0001 C CNN
F 3 "" H 8050 1975 50  0001 C CNN
	1    8050 1975
	-1   0    0    1   
$EndComp
$Comp
L cpu-board:0VANA #U$059
U 1 1 072A72F1
P 7550 2050
F 0 "#U$059" H 7550 2050 50  0001 C CNN
F 1 "0VANA" H 7437 1887 59  0000 L BNN
F 2 "" H 7550 2050 50  0001 C CNN
F 3 "" H 7550 2050 50  0001 C CNN
	1    7550 2050
	-1   0    0    1   
$EndComp
$Comp
L cpu-board:C0805 C40
U 1 1 001A6BB2
P 7800 2375
F 0 "C40" V 8038 2281 64  0000 L BNN
F 1 "100nF" V 7944 2263 42  0000 L BNN
F 2 "AllModules:C0402_1" H 7800 2375 50  0001 C CNN
F 3 "" H 7800 2375 50  0001 C CNN
	1    7800 2375
	0    -1   -1   0   
$EndComp
$Comp
L cpu-board:JUMP_0U JP2
U 1 1 BAFA783C
P 3950 2450
F 0 "JP2" V 3988 2525 51  0000 L BNN
F 1 "JUMP_0U" H 3850 2300 51  0001 L BNN
F 2 "AllModules:R0603_1" H 3950 2450 50  0001 C CNN
F 3 "" H 3950 2450 50  0001 C CNN
	1    3950 2450
	0    -1   -1   0   
$EndComp
$Comp
L cpu-board:SQ276 IC28
U 1 1 9F4013D5
P 7550 9550
F 0 "IC28" V 8125 9387 73  0000 R BNN
F 1 "SQ276" V 8025 9387 59  0000 R BNN
F 2 "AllModules:SQ276-05856_1" H 7550 9550 50  0001 C CNN
F 3 "" H 7550 9550 50  0001 C CNN
	1    7550 9550
	0    -1   -1   0   
$EndComp
$Comp
L cpu-board:+5VREF #U$0164
U 1 1 BB97410A
P 8050 8075
F 0 "#U$0164" H 8050 8075 50  0001 C CNN
F 1 "+5VREF" H 7875 7987 59  0000 L BNN
F 2 "" H 8050 8075 50  0001 C CNN
F 3 "" H 8050 8075 50  0001 C CNN
	1    8050 8075
	-1   0    0    1   
$EndComp
$Comp
L cpu-board:0VANA #U$0171
U 1 1 1AC4EF2D
P 7550 8150
F 0 "#U$0171" H 7550 8150 50  0001 C CNN
F 1 "0VANA" H 7437 7987 59  0000 L BNN
F 2 "" H 7550 8150 50  0001 C CNN
F 3 "" H 7550 8150 50  0001 C CNN
	1    7550 8150
	-1   0    0    1   
$EndComp
$Comp
L cpu-board:C0805 C48
U 1 1 8B0D254A
P 7800 8475
F 0 "C48" V 8025 8382 64  0000 L BNN
F 1 "100nF" V 7943 8363 42  0000 L BNN
F 2 "AllModules:C0402_1" H 7800 8475 50  0001 C CNN
F 3 "" H 7800 8475 50  0001 C CNN
	1    7800 8475
	0    -1   -1   0   
$EndComp
$Comp
L cpu-board:0VANA #U$0276
U 1 1 A87F6502
P 7550 5100
F 0 "#U$0276" H 7550 5100 50  0001 C CNN
F 1 "0VANA" H 7412 4925 59  0000 L BNN
F 2 "" H 7550 5100 50  0001 C CNN
F 3 "" H 7550 5100 50  0001 C CNN
	1    7550 5100
	-1   0    0    1   
$EndComp
$Comp
L cpu-board:JUMP_0U JP3
U 1 1 8182258E
P 3950 4275
F 0 "JP3" V 3975 4363 51  0000 L BNN
F 1 "JUMP_0U" H 3850 4125 51  0001 L BNN
F 2 "AllModules:R0603_1" H 3950 4275 50  0001 C CNN
F 3 "" H 3950 4275 50  0001 C CNN
	1    3950 4275
	0    -1   -1   0   
$EndComp
$Comp
L cpu-board:JUMP_0U JP4
U 1 1 193933AB
P 3950 6100
F 0 "JP4" V 3987 6188 51  0000 L BNN
F 1 "JUMP_0U" H 3850 5950 51  0001 L BNN
F 2 "AllModules:R0603_1" H 3950 6100 50  0001 C CNN
F 3 "" H 3950 6100 50  0001 C CNN
	1    3950 6100
	0    -1   -1   0   
$EndComp
$Comp
L cpu-board:C0805 C60
U 1 1 74AE98EE
P 11450 2275
F 0 "C60" H 11538 2363 64  0000 L CNN
F 1 "100nF" H 11538 2263 42  0000 L CNN
F 2 "AllModules:C0402_1" H 11450 2275 50  0001 C CNN
F 3 "" H 11450 2275 50  0001 C CNN
F 4 "CAPACITOR,100NF,16V,+/-10%,X7R,0402" H 11450 2275 50  0001 C CNN "Description"
F 5 "10022607" H 11450 2275 50  0001 C CNN "Item Number"
F 6 "MURATA" H 11450 2275 50  0001 C CNN "Manufacturer"
F 7 "GRM155R71C104JA88J" H 11450 2275 50  0001 C CNN "Manufacturer_No"
F 8 "CAPACITOR, CERAMIC, MULTILAYER, 16V, X7R, 0.1UF, 0402" H 11450 2275 50  0001 C CNN "Manufacturer_Desc"
F 9 "YAGEO_RMS1" H 11450 2275 50  0001 C CNN "Manufacturer2"
F 10 "CC0402KRX7R7BB104" H 11450 2275 50  0001 C CNN "Manufacturer_No2"
F 11 "CAP CER 0.1uF 16V X7R 10% 0402" H 11450 2275 50  0001 C CNN "Manufacturer_Desc2"
F 12 "YAGEO_RMS1" H 11450 2275 50  0001 C CNN "Manufacturer3"
F 13 "223878715649" H 11450 2275 50  0001 C CNN "Manufacturer_No3"
F 14 "CAPACITOR, CERAMIC, MULTILAYER, 16 V, X7R, 0.1 UF, SURFACE MOUNT, 0402" H 11450 2275 50  0001 C CNN "Manufacturer_Desc3"
F 15 "MURATA MANUFACTURING CO., LTD." H 11450 2275 50  0001 C CNN "Manufacturer4"
F 16 "GRM155R71C104KA88D" H 11450 2275 50  0001 C CNN "Manufacturer_No4"
F 17 "MONOLITHIC CERAMIC CAPACITOR" H 11450 2275 50  0001 C CNN "Manufacturer_Desc4"
	1    11450 2275
	1    0    0    -1  
$EndComp
$Comp
L cpu-board:0VANA #U$076
U 1 1 299EB625
P 11450 2450
F 0 "#U$076" H 11450 2450 50  0001 C CNN
F 1 "0VANA" H 11350 2275 59  0000 L BNN
F 2 "" H 11450 2450 50  0001 C CNN
F 3 "" H 11450 2450 50  0001 C CNN
	1    11450 2450
	1    0    0    -1  
$EndComp
$Comp
L cpu-board:0VANA #U$096
U 1 1 5F4A551C
P 10050 2700
F 0 "#U$096" H 10050 2700 50  0001 C CNN
F 1 "0VANA" H 9963 2513 59  0000 L BNN
F 2 "" H 10050 2700 50  0001 C CNN
F 3 "" H 10050 2700 50  0001 C CNN
	1    10050 2700
	1    0    0    -1  
$EndComp
$Comp
L cpu-board:C0805 C61
U 1 1 4189E79D
P 10875 2275
F 0 "C61" H 10963 2363 64  0000 L CNN
F 1 "4.7nF" H 10963 2263 42  0000 L CNN
F 2 "AllModules:C0603_1" H 10875 2275 50  0001 C CNN
F 3 "" H 10875 2275 50  0001 C CNN
F 4 "CAPACITOR CERAMIC,4.7NF,+/-10%,50V,0603" H 10875 2275 50  0001 C CNN "Description"
F 5 "10022613" H 10875 2275 50  0001 C CNN "Item Number"
F 6 "KEMET_RMS1" H 10875 2275 50  0001 C CNN "Manufacturer"
F 7 "C0603C472K5RACTU" H 10875 2275 50  0001 C CNN "Manufacturer_No"
F 8 "CAP 4700PF 50V CERAMIC X7R 0603" H 10875 2275 50  0001 C CNN "Manufacturer_Desc"
F 9 "YAGEO_RMS1" H 10875 2275 50  0001 C CNN "Manufacturer2"
F 10 "CC0603KRX7R9BB472" H 10875 2275 50  0001 C CNN "Manufacturer_No2"
F 11 "" H 10875 2275 50  0001 C CNN "Manufacturer_Desc2"
	1    10875 2275
	1    0    0    -1  
$EndComp
$Comp
L cpu-board:C0805 C62
U 1 1 3872CC01
P 9500 2050
F 0 "C62" H 9400 2100 64  0000 R CNN
F 1 "100nF" H 9400 2000 42  0000 R CNN
F 2 "AllModules:C0805_1" H 9500 2050 50  0001 C CNN
F 3 "" H 9500 2050 50  0001 C CNN
F 4 "CAPACITOR CERAMIC, 100NF, +/-10%, 50V, X7R,0805" H 9500 2050 50  0001 C CNN "Description"
F 5 "10022135" H 9500 2050 50  0001 C CNN "Item Number"
F 6 "YAGEO_RMS1" H 9500 2050 50  0001 C CNN "Manufacturer"
F 7 "223858055649" H 9500 2050 50  0001 C CNN "Manufacturer_No"
F 8 "CAPACITOR, CERAMIC, MULTILAYER, 50 V, X7R, 0.1 UF, SURFACE MOUNT, 0805" H 9500 2050 50  0001 C CNN "Manufacturer_Desc"
F 9 "MURATA MANUFACTURING CO., LTD." H 9500 2050 50  0001 C CNN "Manufacturer2"
F 10 "GRM21BR71H104KA01L" H 9500 2050 50  0001 C CNN "Manufacturer_No2"
F 11 "MONOLITHIC CERAMIC CAPACITOR" H 9500 2050 50  0001 C CNN "Manufacturer_Desc2"
F 12 "YAGEO_RMS1" H 9500 2050 50  0001 C CNN "Manufacturer3"
F 13 "223858015649" H 9500 2050 50  0001 C CNN "Manufacturer_No3"
F 14 "CAPACITOR, CERAMIC, MULTILAYER, 50 V, X7R, 0.1 UF, SURFACE MOUNT, 0805" H 9500 2050 50  0001 C CNN "Manufacturer_Desc3"
F 15 "SAMSUNG_RMS1" H 9500 2050 50  0001 C CNN "Manufacturer4"
F 16 "CL21B104KBCNNNC" H 9500 2050 50  0001 C CNN "Manufacturer_No4"
F 17 "MULTILAYER CERAMIC CAPACITOR" H 9500 2050 50  0001 C CNN "Manufacturer_Desc4"
F 18 "YAGEO_RMS1" H 9500 2050 50  0001 C CNN "Manufacturer5"
F 19 "CC0805KRX7R9BB104" H 9500 2050 50  0001 C CNN "Manufacturer_No5"
F 20 "CAP CER .1UF 50V 10% X7R 0805" H 9500 2050 50  0001 C CNN "Manufacturer_Desc5"
F 21 "AVX_RMS1" H 9500 2050 50  0001 C CNN "Manufacturer6"
F 22 "08055C104KAT2A" H 9500 2050 50  0001 C CNN "Manufacturer_No6"
F 23 "CAPACITOR CERAMIC, 100NF, +/-10%, 50V, X7R,0805, X7R DIELECTRIC" H 9500 2050 50  0001 C CNN "Manufacturer_Desc6"
	1    9500 2050
	1    0    0    -1  
$EndComp
$Comp
L cpu-board:AWM3300V IC15
U 1 1 90D2B56F
P 10050 2050
F 0 "IC15" H 10088 2538 73  0000 L BNN
F 1 "AWM3300V" H 10075 2475 45  0000 L BNN
F 2 "10125623A00:AWM3300V" H 10050 2050 50  0001 C CNN
F 3 "" H 10050 2050 50  0001 C CNN
F 4 "IC AIR FLOW SENSOR,(0-1 LITRE)" H 10050 2050 50  0001 C CNN "Description"
F 5 "10022706" H 10050 2050 50  0001 C CNN "Item Number"
F 6 "HONEYWELL_RMS1" H 10050 2050 50  0001 C CNN "Manufacturer"
F 7 "AWM3300V" H 10050 2050 50  0001 C CNN "Manufacturer_No"
F 8 "AIRFLOW SENSOR" H 10050 2050 50  0001 C CNN "Manufacturer_Desc"
F 9 "HONEYWELL_RMS1" H 10050 2050 50  0001 C CNN "Manufacturer2"
F 10 "FBAL001DU" H 10050 2050 50  0001 C CNN "Manufacturer_No2"
F 11 "AIR FLOW SENSOR" H 10050 2050 50  0001 C CNN "Manufacturer_Desc2"
	1    10050 2050
	1    0    0    -1  
$EndComp
$Comp
L cpu-board:R0805 R37
U 1 1 11FD54D7
P 14550 2025
F 0 "R37" H 14487 2175 64  0000 L BNN
F 1 "4.7k" H 14487 2100 42  0000 L BNN
F 2 "AllModules:R0603_1" H 14550 2025 50  0001 C CNN
F 3 "" H 14550 2025 50  0001 C CNN
F 4 "RESISTOR, 4.7 K OHM, 0.063W +/-5%" H 14550 2025 50  0001 C CNN "Description"
F 5 "10022617" H 14550 2025 50  0001 C CNN "Item Number"
F 6 "ASJ" H 14550 2025 50  0001 C CNN "Manufacturer"
F 7 "CR16-472JL" H 14550 2025 50  0001 C CNN "Manufacturer_No"
F 8 "THICK FILM CHIP RESISTOR" H 14550 2025 50  0001 C CNN "Manufacturer_Desc"
F 9 "YAGEO_RMS1" H 14550 2025 50  0001 C CNN "Manufacturer2"
F 10 "232270260472L" H 14550 2025 50  0001 C CNN "Manufacturer_No2"
F 11 "RESISTOR, METAL GLAZE/THICK FILM, 0.1 W, 5 %, 100 PPM, 4700 OHM, SURFACE MOUNT, 0603" H 14550 2025 50  0001 C CNN "Manufacturer_Desc2"
F 12 "YAGEO_RMS1" H 14550 2025 50  0001 C CNN "Manufacturer3"
F 13 "RC0603JR-074K7L" H 14550 2025 50  0001 C CNN "Manufacturer_No3"
F 14 "RESISTOR, METAL GLAZE/THICK FILM, 0.1 W, 5 %, 100 PPM, 4700 OHM, SURFACE MOUNT, 0603" H 14550 2025 50  0001 C CNN "Manufacturer_Desc3"
F 15 "YAGEO_RMS1" H 14550 2025 50  0001 C CNN "Manufacturer4"
F 16 "232270260472" H 14550 2025 50  0001 C CNN "Manufacturer_No4"
F 17 "RESISTOR, METAL GLAZE/THICK FILM, 0.1 W, 5 %, 100 PPM, 4700 OHM, SURFACE MOUNT, 0603" H 14550 2025 50  0001 C CNN "Manufacturer_Desc4"
	1    14550 2025
	1    0    0    -1  
$EndComp
$Comp
L cpu-board:C0805 C66
U 1 1 5B12AA4C
P 14750 2225
F 0 "C66" H 14850 2300 64  0000 L CNN
F 1 "100nF" H 14850 2200 42  0000 L CNN
F 2 "AllModules:C0402_1" H 14750 2225 50  0001 C CNN
F 3 "" H 14750 2225 50  0001 C CNN
F 4 "CAPACITOR,100NF,16V,+/-10%,X7R,0402" H 14750 2225 50  0001 C CNN "Description"
F 5 "10022607" H 14750 2225 50  0001 C CNN "Item Number"
F 6 "MURATA" H 14750 2225 50  0001 C CNN "Manufacturer"
F 7 "GRM155R71C104JA88J" H 14750 2225 50  0001 C CNN "Manufacturer_No"
F 8 "CAPACITOR, CERAMIC, MULTILAYER, 16V, X7R, 0.1UF, 0402" H 14750 2225 50  0001 C CNN "Manufacturer_Desc"
F 9 "YAGEO_RMS1" H 14750 2225 50  0001 C CNN "Manufacturer2"
F 10 "CC0402KRX7R7BB104" H 14750 2225 50  0001 C CNN "Manufacturer_No2"
F 11 "CAP CER 0.1uF 16V X7R 10% 0402" H 14750 2225 50  0001 C CNN "Manufacturer_Desc2"
F 12 "YAGEO_RMS1" H 14750 2225 50  0001 C CNN "Manufacturer3"
F 13 "223878715649" H 14750 2225 50  0001 C CNN "Manufacturer_No3"
F 14 "CAPACITOR, CERAMIC, MULTILAYER, 16 V, X7R, 0.1 UF, SURFACE MOUNT, 0402" H 14750 2225 50  0001 C CNN "Manufacturer_Desc3"
F 15 "MURATA MANUFACTURING CO., LTD." H 14750 2225 50  0001 C CNN "Manufacturer4"
F 16 "GRM155R71C104KA88D" H 14750 2225 50  0001 C CNN "Manufacturer_No4"
F 17 "MONOLITHIC CERAMIC CAPACITOR" H 14750 2225 50  0001 C CNN "Manufacturer_Desc4"
	1    14750 2225
	1    0    0    -1  
$EndComp
$Comp
L cpu-board:0VANA #U$0104
U 1 1 891FCEC7
P 14750 2425
F 0 "#U$0104" H 14750 2425 50  0001 C CNN
F 1 "0VANA" H 14662 2237 59  0000 L BNN
F 2 "" H 14750 2425 50  0001 C CNN
F 3 "" H 14750 2425 50  0001 C CNN
	1    14750 2425
	1    0    0    -1  
$EndComp
$Comp
L cpu-board:0VANA #U$0105
U 1 1 BED1FF17
P 13375 2675
F 0 "#U$0105" H 13375 2675 50  0001 C CNN
F 1 "0VANA" H 13287 2487 59  0000 L BNN
F 2 "" H 13375 2675 50  0001 C CNN
F 3 "" H 13375 2675 50  0001 C CNN
	1    13375 2675
	1    0    0    -1  
$EndComp
$Comp
L cpu-board:C0805 C68
U 1 1 F44D85A5
P 14200 2225
F 0 "C68" H 14300 2300 64  0000 L CNN
F 1 "4.7nF" H 14300 2200 42  0000 L CNN
F 2 "AllModules:C0603_1" H 14200 2225 50  0001 C CNN
F 3 "" H 14200 2225 50  0001 C CNN
F 4 "CAPACITOR CERAMIC,4.7NF,+/-10%,50V,0603" H 14200 2225 50  0001 C CNN "Description"
F 5 "10022613" H 14200 2225 50  0001 C CNN "Item Number"
F 6 "KEMET_RMS1" H 14200 2225 50  0001 C CNN "Manufacturer"
F 7 "C0603C472K5RACTU" H 14200 2225 50  0001 C CNN "Manufacturer_No"
F 8 "CAP 4700PF 50V CERAMIC X7R 0603" H 14200 2225 50  0001 C CNN "Manufacturer_Desc"
F 9 "YAGEO_RMS1" H 14200 2225 50  0001 C CNN "Manufacturer2"
F 10 "CC0603KRX7R9BB472" H 14200 2225 50  0001 C CNN "Manufacturer_No2"
F 11 "" H 14200 2225 50  0001 C CNN "Manufacturer_Desc2"
	1    14200 2225
	1    0    0    -1  
$EndComp
$Comp
L cpu-board:C0805 C69
U 1 1 1015ED7D
P 12850 2025
F 0 "C69" H 12575 2100 64  0000 L CNN
F 1 "100nF" H 12575 2000 42  0000 L CNN
F 2 "AllModules:C0805_1" H 12850 2025 50  0001 C CNN
F 3 "" H 12850 2025 50  0001 C CNN
F 4 "CAPACITOR CERAMIC, 100NF, +/-10%, 50V, X7R,0805" H 12850 2025 50  0001 C CNN "Description"
F 5 "10022135" H 12850 2025 50  0001 C CNN "Item Number"
F 6 "YAGEO_RMS1" H 12850 2025 50  0001 C CNN "Manufacturer"
F 7 "223858055649" H 12850 2025 50  0001 C CNN "Manufacturer_No"
F 8 "CAPACITOR, CERAMIC, MULTILAYER, 50 V, X7R, 0.1 UF, SURFACE MOUNT, 0805" H 12850 2025 50  0001 C CNN "Manufacturer_Desc"
F 9 "MURATA MANUFACTURING CO., LTD." H 12850 2025 50  0001 C CNN "Manufacturer2"
F 10 "GRM21BR71H104KA01L" H 12850 2025 50  0001 C CNN "Manufacturer_No2"
F 11 "MONOLITHIC CERAMIC CAPACITOR" H 12850 2025 50  0001 C CNN "Manufacturer_Desc2"
F 12 "YAGEO_RMS1" H 12850 2025 50  0001 C CNN "Manufacturer3"
F 13 "223858015649" H 12850 2025 50  0001 C CNN "Manufacturer_No3"
F 14 "CAPACITOR, CERAMIC, MULTILAYER, 50 V, X7R, 0.1 UF, SURFACE MOUNT, 0805" H 12850 2025 50  0001 C CNN "Manufacturer_Desc3"
F 15 "SAMSUNG_RMS1" H 12850 2025 50  0001 C CNN "Manufacturer4"
F 16 "CL21B104KBCNNNC" H 12850 2025 50  0001 C CNN "Manufacturer_No4"
F 17 "MULTILAYER CERAMIC CAPACITOR" H 12850 2025 50  0001 C CNN "Manufacturer_Desc4"
F 18 "YAGEO_RMS1" H 12850 2025 50  0001 C CNN "Manufacturer5"
F 19 "CC0805KRX7R9BB104" H 12850 2025 50  0001 C CNN "Manufacturer_No5"
F 20 "CAP CER .1UF 50V 10% X7R 0805" H 12850 2025 50  0001 C CNN "Manufacturer_Desc5"
F 21 "AVX_RMS1" H 12850 2025 50  0001 C CNN "Manufacturer6"
F 22 "08055C104KAT2A" H 12850 2025 50  0001 C CNN "Manufacturer_No6"
F 23 "CAPACITOR CERAMIC, 100NF, +/-10%, 50V, X7R,0805, X7R DIELECTRIC" H 12850 2025 50  0001 C CNN "Manufacturer_Desc6"
	1    12850 2025
	1    0    0    -1  
$EndComp
$Comp
L cpu-board:AWM3300V IC17
U 1 1 93EF86A4
P 13375 2025
F 0 "IC17" H 13425 2550 73  0000 L BNN
F 1 "AWM3300V" H 13425 2475 45  0000 L BNN
F 2 "10125623A00:AWM3300V" H 13375 2025 50  0001 C CNN
F 3 "" H 13375 2025 50  0001 C CNN
F 4 "IC AIR FLOW SENSOR,(0-1 LITRE)" H 13375 2025 50  0001 C CNN "Description"
F 5 "10022706" H 13375 2025 50  0001 C CNN "Item Number"
F 6 "HONEYWELL_RMS1" H 13375 2025 50  0001 C CNN "Manufacturer"
F 7 "AWM3300V" H 13375 2025 50  0001 C CNN "Manufacturer_No"
F 8 "AIRFLOW SENSOR" H 13375 2025 50  0001 C CNN "Manufacturer_Desc"
F 9 "HONEYWELL_RMS1" H 13375 2025 50  0001 C CNN "Manufacturer2"
F 10 "FBAL001DU" H 13375 2025 50  0001 C CNN "Manufacturer_No2"
F 11 "AIR FLOW SENSOR" H 13375 2025 50  0001 C CNN "Manufacturer_Desc2"
	1    13375 2025
	1    0    0    -1  
$EndComp
$Comp
L cpu-board:+10VREF #U$159
U 1 1 2E2820CB
P 10050 1400
AR Path="/2E2820CB" Ref="#U$159"  Part="1" 
AR Path="/5E924D33/2E2820CB" Ref="#U$0159"  Part="1" 
F 0 "#U$0159" H 10050 1400 50  0001 C CNN
F 1 "+10VREF" H 9887 1250 59  0000 L BNN
F 2 "" H 10050 1400 50  0001 C CNN
F 3 "" H 10050 1400 50  0001 C CNN
	1    10050 1400
	-1   0    0    1   
$EndComp
$Comp
L cpu-board:+10VREF #U$162
U 1 1 B9994C73
P 13375 1425
AR Path="/B9994C73" Ref="#U$162"  Part="1" 
AR Path="/5E924D33/B9994C73" Ref="#U$0162"  Part="1" 
F 0 "#U$0162" H 13375 1425 50  0001 C CNN
F 1 "+10VREF" H 13200 1225 59  0000 L BNN
F 2 "" H 13375 1425 50  0001 C CNN
F 3 "" H 13375 1425 50  0001 C CNN
	1    13375 1425
	-1   0    0    1   
$EndComp
$Comp
L cpu-board:BLIN-AWM33 BL1
U 1 1 AAFF44B7
P 10450 2425
F 0 "BL1" H 10450 2325 56  0000 L BNN
F 1 "BLIN-AWM33" H 10450 2225 42  0001 L BNN
F 2 "10125623A00:BLIN-AWM" H 10450 2425 50  0001 C CNN
F 3 "" H 10450 2425 50  0001 C CNN
F 4 "EMC,FLOW SENSOR HOUSING,IC15 & IC17" H 10450 2425 50  0001 C CNN "Description"
F 5 "4096600.M00.023" H 10450 2425 50  0001 C CNN "Item Number"
F 6 "SUZHOU ACE SHEET MATEL MANUFACTURING CO., LTD" H 10450 2425 50  0001 C CNN "Manufacturer"
F 7 "4096600.M00.023" H 10450 2425 50  0001 C CNN "Manufacturer_No"
F 8 "EMC,FLOW SENSOR HOUSING,IC15 & IC17 (CUSTOM PART)" H 10450 2425 50  0001 C CNN "Manufacturer_Desc"
	1    10450 2425
	1    0    0    -1  
$EndComp
$Comp
L cpu-board:BLIN-AWM33 BL3
U 1 1 6617CE3C
P 13850 2425
F 0 "BL3" H 13850 2325 56  0000 L BNN
F 1 "BLIN-AWM33" H 13838 2138 42  0001 L BNN
F 2 "10125623A00:BLIN-AWM" H 13850 2425 50  0001 C CNN
F 3 "" H 13850 2425 50  0001 C CNN
F 4 "EMC,FLOW SENSOR HOUSING,IC15 & IC17" H 13850 2425 50  0001 C CNN "Description"
F 5 "4096600.M00.023" H 13850 2425 50  0001 C CNN "Item Number"
F 6 "SUZHOU ACE SHEET MATEL MANUFACTURING CO., LTD" H 13850 2425 50  0001 C CNN "Manufacturer"
F 7 "4096600.M00.023" H 13850 2425 50  0001 C CNN "Manufacturer_No"
F 8 "EMC,FLOW SENSOR HOUSING,IC15 & IC17 (CUSTOM PART)" H 13850 2425 50  0001 C CNN "Manufacturer_Desc"
	1    13850 2425
	1    0    0    -1  
$EndComp
$Comp
L cpu-board:+5VREF #U$0305
U 1 1 7484700F
P 11950 3900
F 0 "#U$0305" H 11950 3900 50  0001 C CNN
F 1 "+5VREF" H 11775 3812 59  0000 L BNN
F 2 "" H 11950 3900 50  0001 C CNN
F 3 "" H 11950 3900 50  0001 C CNN
	1    11950 3900
	-1   0    0    1   
$EndComp
$Comp
L cpu-board:0VANA #U$0306
U 1 1 6A5A32D7
P 11450 3975
F 0 "#U$0306" H 11450 3975 50  0001 C CNN
F 1 "0VANA" H 11338 3812 59  0000 L BNN
F 2 "" H 11450 3975 50  0001 C CNN
F 3 "" H 11450 3975 50  0001 C CNN
	1    11450 3975
	-1   0    0    1   
$EndComp
$Comp
L cpu-board:C0805 C109
U 1 1 FBCF1DE2
P 11650 4200
F 0 "C109" V 11888 4057 64  0000 L BNN
F 1 "100nF" V 11794 4076 42  0000 L BNN
F 2 "AllModules:C0402_1" H 11650 4200 50  0001 C CNN
F 3 "" H 11650 4200 50  0001 C CNN
	1    11650 4200
	0    -1   -1   0   
$EndComp
$Comp
L cpu-board:SQ276 IC35
U 1 1 AFF057CF
P 13900 5350
F 0 "IC35" V 14500 4950 73  0000 L BNN
F 1 "SQ276" V 14400 4925 59  0000 L BNN
F 2 "AllModules:SQ276-05856_1" H 13900 5350 50  0001 C CNN
F 3 "https://www.first-sensor.com/cms/upload/datasheets/DS_Standard-HCLA_E_11629.pdf" H 13900 5350 50  0001 C CNN
	1    13900 5350
	0    -1   -1   0   
$EndComp
$Comp
L cpu-board:+5VREF #U$0316
U 1 1 940283FA
P 14400 3875
F 0 "#U$0316" H 14400 3875 50  0001 C CNN
F 1 "+5VREF" H 14225 3787 59  0000 L BNN
F 2 "" H 14400 3875 50  0001 C CNN
F 3 "" H 14400 3875 50  0001 C CNN
	1    14400 3875
	-1   0    0    1   
$EndComp
$Comp
L cpu-board:0VANA #U$0317
U 1 1 24749F8E
P 13900 3950
F 0 "#U$0317" H 13900 3950 50  0001 C CNN
F 1 "0VANA" H 13775 3787 59  0000 L BNN
F 2 "" H 13900 3950 50  0001 C CNN
F 3 "" H 13900 3950 50  0001 C CNN
	1    13900 3950
	-1   0    0    1   
$EndComp
$Comp
L cpu-board:C0805 C113
U 1 1 8719094B
P 14100 4175
F 0 "C113" V 14325 4044 64  0000 L BNN
F 1 "100nF" V 14231 4063 42  0000 L BNN
F 2 "AllModules:C0402_1" H 14100 4175 50  0001 C CNN
F 3 "" H 14100 4175 50  0001 C CNN
	1    14100 4175
	0    -1   -1   0   
$EndComp
Wire Notes Line
	887  11038 887  850 
Wire Notes Line
	8650 850  887  850 
Wire Notes Line
	8650 8175 8187 8175
Wire Notes Line
	8187 8175 8187 11038
Wire Notes Line
	8187 11038 887  11038
Wire Notes Line
	8650 8175 8650 850 
Wire Notes Line
	15887 6575 8812 6575
Wire Notes Line
	8812 6575 8812 850 
Wire Notes Line
	15887 850  8812 850 
Wire Notes Line
	5600 1025 5600 10575
Wire Notes Line
	9175 3000 15775 3000
Text Notes 950  1163 0    59   ~ 0
Internal pressure Measurement
Text Notes 937  2963 0    59   ~ 0
Valve Pressure Measurement
Text Notes 950  6650 0    59   ~ 0
O² Pressure Measurement
Text Notes 937  4838 0    59   ~ 0
Proximal Pressure Measurement
Text Notes 5700 1800 0    59   ~ 0
Internal Pressure Measurement
Text Notes 5700 7950 0    59   ~ 0
Valve Pressure Measurement
Text Notes 5700 4850 0    59   ~ 0
Proximal Pressure Measurement
Text Notes 3600 2963 0    47   ~ 0
JP2 on ON if SPI Sensor used
Text Notes 3700 4763 0    47   ~ 0
JP2 on ON if SPI Sensor used
Text Notes 3675 6588 0    47   ~ 0
JP2 on ON if SPI Sensor used
Text Notes 9175 1163 0    59   ~ 0
Inspiratory Flow Measurement
Text Notes 12550 1150 0    59   ~ 0
Exhalartion Flow Measurement
Text Notes 9900 3600 0    59   ~ 0
Inspiratory Flow Measurement
Text Notes 12700 3600 0    59   ~ 0
Exhalation Flow Measurement
Text Notes 15750 10775 0    59   ~ 0
A
Text Notes 15987 10775 0    59   ~ 0
05/03/14
Text Notes 16487 10788 0    59   ~ 0
JR
$Comp
L cpu-board:0VANA #U$0303
U 1 1 25FC8843
P 1575 10025
F 0 "#U$0303" H 1575 10025 50  0001 C CNN
F 1 "0VANA" H 1475 9850 59  0000 L BNN
F 2 "" H 1575 10025 50  0001 C CNN
F 3 "" H 1575 10025 50  0001 C CNN
	1    1575 10025
	1    0    0    -1  
$EndComp
$Comp
L cpu-board:C0805 C95
U 1 1 A1AFAF59
P 4325 9550
F 0 "C95" H 4450 9600 64  0000 L CNN
F 1 "100nF" H 4450 9500 42  0000 L CNN
F 2 "AllModules:C0402_1" H 4325 9550 50  0001 C CNN
F 3 "" H 4325 9550 50  0001 C CNN
	1    4325 9550
	1    0    0    -1  
$EndComp
$Comp
L cpu-board:R0805 R51
U 1 1 C00D2805
P 3925 9400
F 0 "R51" H 3938 9650 64  0000 C CNN
F 1 "4.7k" H 3938 9550 42  0000 C CNN
F 2 "AllModules:R0603_1" H 3925 9400 50  0001 C CNN
F 3 "" H 3925 9400 50  0001 C CNN
F 4 "RESISTOR, 4.7 K OHM, 0.063W +/-5%" H 3925 9400 50  0001 C CNN "Description"
F 5 "10022617" H 3925 9400 50  0001 C CNN "Item Number"
F 6 "ASJ" H 3925 9400 50  0001 C CNN "Manufacturer"
F 7 "CR16-472JL" H 3925 9400 50  0001 C CNN "Manufacturer_No"
F 8 "THICK FILM CHIP RESISTOR" H 3925 9400 50  0001 C CNN "Manufacturer_Desc"
F 9 "YAGEO_RMS1" H 3925 9400 50  0001 C CNN "Manufacturer2"
F 10 "232270260472L" H 3925 9400 50  0001 C CNN "Manufacturer_No2"
F 11 "RESISTOR, METAL GLAZE/THICK FILM, 0.1 W, 5 %, 100 PPM, 4700 OHM, SURFACE MOUNT, 0603" H 3925 9400 50  0001 C CNN "Manufacturer_Desc2"
F 12 "YAGEO_RMS1" H 3925 9400 50  0001 C CNN "Manufacturer3"
F 13 "RC0603JR-074K7L" H 3925 9400 50  0001 C CNN "Manufacturer_No3"
F 14 "RESISTOR, METAL GLAZE/THICK FILM, 0.1 W, 5 %, 100 PPM, 4700 OHM, SURFACE MOUNT, 0603" H 3925 9400 50  0001 C CNN "Manufacturer_Desc3"
F 15 "YAGEO_RMS1" H 3925 9400 50  0001 C CNN "Manufacturer4"
F 16 "232270260472" H 3925 9400 50  0001 C CNN "Manufacturer_No4"
F 17 "RESISTOR, METAL GLAZE/THICK FILM, 0.1 W, 5 %, 100 PPM, 4700 OHM, SURFACE MOUNT, 0603" H 3925 9400 50  0001 C CNN "Manufacturer_Desc4"
	1    3925 9400
	1    0    0    -1  
$EndComp
Text Notes 950  8663 0    59   ~ 0
Barometric Pressure Measurement
$Comp
L cpu-board:+5VREF #U$0304
U 1 1 3E8E06BF
P 2575 8575
F 0 "#U$0304" H 2575 8575 50  0001 C CNN
F 1 "+5VREF" H 2688 8538 59  0000 R TNN
F 2 "" H 2575 8575 50  0001 C CNN
F 3 "" H 2575 8575 50  0001 C CNN
	1    2575 8575
	-1   0    0    1   
$EndComp
$Comp
L cpu-board:0VANA #U$0302
U 1 1 7B65148C
P 4325 9750
F 0 "#U$0302" H 4325 9750 50  0001 C CNN
F 1 "0VANA" H 4213 9575 59  0000 L BNN
F 2 "" H 4325 9750 50  0001 C CNN
F 3 "" H 4325 9750 50  0001 C CNN
	1    4325 9750
	1    0    0    -1  
$EndComp
$Comp
L cpu-board:C1206 C94
U 1 1 84DA4059
P 1575 9050
F 0 "C94" H 1488 9113 64  0000 R CNN
F 1 "220nF" H 1488 9013 42  0000 R CNN
F 2 "AllModules:C0805_1" H 1575 9050 50  0001 C CNN
F 3 "" H 1575 9050 50  0001 C CNN
F 4 "CAP CERAMIC,220NF,25V,X7R,+/-10%,0805" H 1575 9050 50  0001 C CNN "Description"
F 5 "10022968" H 1575 9050 50  0001 C CNN "Item Number"
F 6 "AVX_RMS1" H 1575 9050 50  0001 C CNN "Manufacturer"
F 7 "08053C224KAZ2A" H 1575 9050 50  0001 C CNN "Manufacturer_No"
F 8 "SMT MULTILAYER CAPACITOR" H 1575 9050 50  0001 C CNN "Manufacturer_Desc"
F 9 "KEMET_RMS1" H 1575 9050 50  0001 C CNN "Manufacturer2"
F 10 "C0805C224K3RAC" H 1575 9050 50  0001 C CNN "Manufacturer_No2"
F 11 "CERAMIC CHIP CAPACITOR" H 1575 9050 50  0001 C CNN "Manufacturer_Desc2"
F 12 "AVX_RMS1" H 1575 9050 50  0001 C CNN "Manufacturer3"
F 13 "08053C224KAT2A" H 1575 9050 50  0001 C CNN "Manufacturer_No3"
F 14 "X7R DIELECTRIC" H 1575 9050 50  0001 C CNN "Manufacturer_Desc3"
F 15 "KEMET_RMS1" H 1575 9050 50  0001 C CNN "Manufacturer4"
F 16 "C0805C224K3RACTU" H 1575 9050 50  0001 C CNN "Manufacturer_No4"
F 17 "CERAMIC CHIP CAPACITOR" H 1575 9050 50  0001 C CNN "Manufacturer_Desc4"
	1    1575 9050
	1    0    0    -1  
$EndComp
Text HLabel 4875 9400 2    56   Output ~ 0
PRES-ABS
Connection ~ 2575 8750
Connection ~ 1800 8750
Wire Wire Line
	2575 8675 2575 8750
Wire Wire Line
	2575 8750 1800 8750
Wire Wire Line
	3275 8750 2575 8750
Wire Wire Line
	3275 9250 3275 8750
Connection ~ 3275 9700
Wire Wire Line
	3275 9550 3275 9700
$Comp
L cpu-board:ASDX IC33
U 1 1 B100278E
P 2550 9500
F 0 "IC33" H 2538 10100 85  0000 C CNN
F 1 "BSDX0811BARO-X" H 2538 9950 55  0000 C CNN
F 2 "AllModules:BSDX-A2_1" H 2550 9500 50  0001 C CNN
F 3 "" H 2550 9500 50  0001 C CNN
F 4 "IC, BAROMETRIC PRESSURE SENSOR" H 2550 9500 50  0001 C CNN "Description"
F 5 "10023159" H 2550 9500 50  0001 C CNN "Item Number"
F 6 "HONEYWELL_RMS1" H 2550 9500 50  0001 C CNN "Manufacturer"
F 7 "XZ209330-ASDX" H 2550 9500 50  0001 C CNN "Manufacturer_No"
F 8 "IC ABSOLUTE PRESSURE SENSOR WITH ANALOGUE OUTPUT 600 TO 1100 MBAR" H 2550 9500 50  0001 C CNN "Manufacturer_Desc"
F 9 "SENSORTECHNICS" H 2550 9500 50  0001 C CNN "Manufacturer2"
F 10 "BSDX0611BARO-X" H 2550 9500 50  0001 C CNN "Manufacturer_No2"
F 11 "PRESSURE TRANSDUCER" H 2550 9500 50  0001 C CNN "Manufacturer_Desc2"
	1    2550 9500
	1    0    0    -1  
$EndComp
Wire Wire Line
	1800 8750 1800 9250
Wire Wire Line
	1800 9550 2000 9550
Wire Wire Line
	2000 9400 1800 9400
Connection ~ 1800 9400
Wire Wire Line
	1800 9400 1800 9550
Wire Wire Line
	2000 9250 1800 9250
Connection ~ 1800 9250
Wire Wire Line
	1800 9250 1800 9400
Wire Wire Line
	3050 9700 3275 9700
Wire Wire Line
	3050 9550 3275 9550
Wire Wire Line
	3050 9250 3275 9250
Wire Wire Line
	1575 8750 1800 8750
Wire Wire Line
	1575 8750 1575 8950
Wire Wire Line
	1575 9150 1575 9700
Wire Wire Line
	1575 9700 2000 9700
Wire Wire Line
	1575 10025 1575 9700
Connection ~ 1575 9700
Wire Wire Line
	1575 10025 3275 10025
Connection ~ 1575 10025
Wire Wire Line
	3275 9700 3275 10025
$Comp
L cpu-board:C0805 C96
U 1 1 C9A1B3F0
P 3625 9575
F 0 "C96" H 3725 9575 64  0000 L CNN
F 1 "4.7nF" H 3725 9500 42  0000 L CNN
F 2 "AllModules:C0603_1" H 3625 9575 50  0001 C CNN
F 3 "" H 3625 9575 50  0001 C CNN
F 4 "CAPACITOR CERAMIC,4.7NF,+/-10%,50V,0603" H 3625 9575 50  0001 C CNN "Description"
F 5 "10022613" H 3625 9575 50  0001 C CNN "Item Number"
F 6 "KEMET_RMS1" H 3625 9575 50  0001 C CNN "Manufacturer"
F 7 "C0603C472K5RACTU" H 3625 9575 50  0001 C CNN "Manufacturer_No"
F 8 "CAP 4700PF 50V CERAMIC X7R 0603" H 3625 9575 50  0001 C CNN "Manufacturer_Desc"
F 9 "YAGEO_RMS1" H 3625 9575 50  0001 C CNN "Manufacturer2"
F 10 "CC0603KRX7R9BB472" H 3625 9575 50  0001 C CNN "Manufacturer_No2"
F 11 "" H 3625 9575 50  0001 C CNN "Manufacturer_Desc2"
	1    3625 9575
	1    0    0    -1  
$EndComp
Wire Wire Line
	3050 9400 3625 9400
Wire Wire Line
	3625 9475 3625 9400
Connection ~ 3625 9400
Wire Wire Line
	3625 9400 3725 9400
Wire Wire Line
	3525 9750 3575 9775
Wire Wire Line
	3575 9775 3575 10025
Wire Wire Line
	3575 10025 3275 10025
Connection ~ 3275 10025
Wire Wire Line
	3575 9775 3625 9725
Wire Wire Line
	3625 9725 3625 9675
Connection ~ 3575 9775
Wire Wire Line
	4325 9450 4325 9400
Connection ~ 4325 9400
Wire Wire Line
	4325 9400 4875 9400
Wire Wire Line
	4125 9400 4325 9400
Wire Wire Line
	4325 9650 4325 9750
$Comp
L cpu-board:0VANA #U$0179
U 1 1 BD41952C
P 4550 6025
F 0 "#U$0179" H 4550 6025 50  0001 C CNN
F 1 "0VANA" H 4462 5837 59  0000 L BNN
F 2 "" H 4550 6025 50  0001 C CNN
F 3 "" H 4550 6025 50  0001 C CNN
	1    4550 6025
	1    0    0    -1  
$EndComp
Wire Wire Line
	4550 5925 4550 6025
$Comp
L cpu-board:R0805 R42
U 1 1 83169F00
P 4300 5550
F 0 "R42" H 4237 5700 64  0000 L BNN
F 1 "4.7k" H 4250 5625 42  0000 L BNN
F 2 "AllModules:R0603_1" H 4300 5550 50  0001 C CNN
F 3 "" H 4300 5550 50  0001 C CNN
F 4 "RESISTOR, 4.7 K OHM, 0.063W +/-5%" H 4300 5550 50  0001 C CNN "Description"
F 5 "10022617" H 4300 5550 50  0001 C CNN "Item Number"
F 6 "ASJ" H 4300 5550 50  0001 C CNN "Manufacturer"
F 7 "CR16-472JL" H 4300 5550 50  0001 C CNN "Manufacturer_No"
F 8 "THICK FILM CHIP RESISTOR" H 4300 5550 50  0001 C CNN "Manufacturer_Desc"
F 9 "YAGEO_RMS1" H 4300 5550 50  0001 C CNN "Manufacturer2"
F 10 "232270260472L" H 4300 5550 50  0001 C CNN "Manufacturer_No2"
F 11 "RESISTOR, METAL GLAZE/THICK FILM, 0.1 W, 5 %, 100 PPM, 4700 OHM, SURFACE MOUNT, 0603" H 4300 5550 50  0001 C CNN "Manufacturer_Desc2"
F 12 "YAGEO_RMS1" H 4300 5550 50  0001 C CNN "Manufacturer3"
F 13 "RC0603JR-074K7L" H 4300 5550 50  0001 C CNN "Manufacturer_No3"
F 14 "RESISTOR, METAL GLAZE/THICK FILM, 0.1 W, 5 %, 100 PPM, 4700 OHM, SURFACE MOUNT, 0603" H 4300 5550 50  0001 C CNN "Manufacturer_Desc3"
F 15 "YAGEO_RMS1" H 4300 5550 50  0001 C CNN "Manufacturer4"
F 16 "232270260472" H 4300 5550 50  0001 C CNN "Manufacturer_No4"
F 17 "RESISTOR, METAL GLAZE/THICK FILM, 0.1 W, 5 %, 100 PPM, 4700 OHM, SURFACE MOUNT, 0603" H 4300 5550 50  0001 C CNN "Manufacturer_Desc4"
	1    4300 5550
	1    0    0    -1  
$EndComp
$Comp
L cpu-board:C0805 C104
U 1 1 CA435796
P 3550 5725
F 0 "C104" H 3650 5800 64  0000 L CNN
F 1 "4.7nF" H 3675 5700 42  0000 L CNN
F 2 "AllModules:C0603_1" H 3550 5725 50  0001 C CNN
F 3 "" H 3550 5725 50  0001 C CNN
F 4 "CAPACITOR CERAMIC,4.7NF,+/-10%,50V,0603" H 3550 5725 50  0001 C CNN "Description"
F 5 "10022613" H 3550 5725 50  0001 C CNN "Item Number"
F 6 "KEMET_RMS1" H 3550 5725 50  0001 C CNN "Manufacturer"
F 7 "C0603C472K5RACTU" H 3550 5725 50  0001 C CNN "Manufacturer_No"
F 8 "CAP 4700PF 50V CERAMIC X7R 0603" H 3550 5725 50  0001 C CNN "Manufacturer_Desc"
F 9 "YAGEO_RMS1" H 3550 5725 50  0001 C CNN "Manufacturer2"
F 10 "CC0603KRX7R9BB472" H 3550 5725 50  0001 C CNN "Manufacturer_No2"
F 11 "" H 3550 5725 50  0001 C CNN "Manufacturer_Desc2"
	1    3550 5725
	1    0    0    -1  
$EndComp
$Comp
L cpu-board:ASDX IC22
U 1 1 2C1B848F
P 2475 5650
F 0 "IC22" H 2475 6213 85  0000 C CNN
F 1 "ASDX001D44R-SQ04689" H 2475 6113 55  0000 C CNN
F 2 "AllModules:ASDX001D44R_1" H 2475 5650 50  0001 C CNN
F 3 "" H 2475 5650 50  0001 C CNN
F 4 "IC, PRESSURE TRANSDUCER,(-10/+100 MBAR)" H 2475 5650 50  0001 C CNN "Description"
F 5 "10023117" H 2475 5650 50  0001 C CNN "Item Number"
F 6 "SENSYM_RMS1" H 2475 5650 50  0001 C CNN "Manufacturer"
F 7 "ASDX001D44R-SQ04689" H 2475 5650 50  0001 C CNN "Manufacturer_No"
F 8 "PRESSURE TRANSDUCER" H 2475 5650 50  0001 C CNN "Manufacturer_Desc"
F 9 "HONEYWELL_RMS1" H 2475 5650 50  0001 C CNN "Manufacturer2"
F 10 "XZ209766-ASDX" H 2475 5650 50  0001 C CNN "Manufacturer_No2"
F 11 "IC DIFFERENTIAL PRESSURE SENSOR WITH ANALOGUE OUTPUT -10 TO 100 MBAR" H 2475 5650 50  0001 C CNN "Manufacturer_Desc2"
	1    2475 5650
	1    0    0    -1  
$EndComp
$Comp
L cpu-board:C1206 C102
U 1 1 DC61BB42
P 1500 5200
F 0 "C102" H 1181 5212 64  0000 L BNN
F 1 "220nF" H 1187 5143 42  0000 L BNN
F 2 "AllModules:C0805_1" H 1500 5200 50  0001 C CNN
F 3 "" H 1500 5200 50  0001 C CNN
F 4 "CAP CERAMIC,220NF,25V,X7R,+/-10%,0805" H 1500 5200 50  0001 C CNN "Description"
F 5 "10022968" H 1500 5200 50  0001 C CNN "Item Number"
F 6 "AVX_RMS1" H 1500 5200 50  0001 C CNN "Manufacturer"
F 7 "08053C224KAZ2A" H 1500 5200 50  0001 C CNN "Manufacturer_No"
F 8 "SMT MULTILAYER CAPACITOR" H 1500 5200 50  0001 C CNN "Manufacturer_Desc"
F 9 "KEMET_RMS1" H 1500 5200 50  0001 C CNN "Manufacturer2"
F 10 "C0805C224K3RAC" H 1500 5200 50  0001 C CNN "Manufacturer_No2"
F 11 "CERAMIC CHIP CAPACITOR" H 1500 5200 50  0001 C CNN "Manufacturer_Desc2"
F 12 "AVX_RMS1" H 1500 5200 50  0001 C CNN "Manufacturer3"
F 13 "08053C224KAT2A" H 1500 5200 50  0001 C CNN "Manufacturer_No3"
F 14 "X7R DIELECTRIC" H 1500 5200 50  0001 C CNN "Manufacturer_Desc3"
F 15 "KEMET_RMS1" H 1500 5200 50  0001 C CNN "Manufacturer4"
F 16 "C0805C224K3RACTU" H 1500 5200 50  0001 C CNN "Manufacturer_No4"
F 17 "CERAMIC CHIP CAPACITOR" H 1500 5200 50  0001 C CNN "Manufacturer_Desc4"
	1    1500 5200
	1    0    0    -1  
$EndComp
Wire Wire Line
	4325 7350 4900 7350
Wire Wire Line
	4325 7600 4325 7700
Wire Wire Line
	4125 7350 4325 7350
Connection ~ 4325 7350
Wire Wire Line
	4325 7400 4325 7350
Connection ~ 3575 7725
Wire Wire Line
	3625 7675 3625 7625
Wire Wire Line
	3575 7725 3625 7675
Connection ~ 3275 7975
Wire Wire Line
	3575 7975 3275 7975
Wire Wire Line
	3575 7725 3575 7975
Wire Wire Line
	3525 7700 3575 7725
Wire Wire Line
	3450 7700 3525 7700
Wire Wire Line
	3625 7350 3725 7350
Connection ~ 3625 7350
Wire Wire Line
	3625 7425 3625 7350
Wire Wire Line
	3050 7350 3625 7350
Wire Wire Line
	3275 7650 3275 7975
Connection ~ 1575 7975
Wire Wire Line
	1575 7975 3275 7975
Connection ~ 1575 7650
Wire Wire Line
	1575 7975 1575 7650
Wire Wire Line
	1575 7650 2000 7650
Wire Wire Line
	1575 7100 1575 7650
Wire Wire Line
	1575 6700 1575 6900
Wire Wire Line
	1575 6700 1800 6700
Wire Wire Line
	3050 7200 3275 7200
Wire Wire Line
	3050 7500 3275 7500
Wire Wire Line
	3050 7650 3275 7650
Wire Wire Line
	1800 7200 1800 7350
Connection ~ 1800 7200
Wire Wire Line
	2000 7200 1800 7200
Wire Wire Line
	1800 7350 1800 7500
Connection ~ 1800 7350
Wire Wire Line
	2000 7350 1800 7350
Wire Wire Line
	1800 7500 2000 7500
Wire Wire Line
	1800 6700 1800 7200
Wire Wire Line
	3275 7500 3275 7650
Connection ~ 3275 7650
Wire Wire Line
	3275 7200 3275 6700
Wire Wire Line
	3275 6700 2575 6700
Wire Wire Line
	2575 6700 1800 6700
Wire Wire Line
	2575 6625 2575 6700
Connection ~ 1800 6700
Connection ~ 2575 6700
$Comp
L cpu-board:0VANA #U$0114
U 1 1 5ED84200
P 4325 7700
F 0 "#U$0114" H 4325 7700 50  0001 C CNN
F 1 "0VANA" H 4213 7525 59  0000 L BNN
F 2 "" H 4325 7700 50  0001 C CNN
F 3 "" H 4325 7700 50  0001 C CNN
	1    4325 7700
	1    0    0    -1  
$EndComp
$Comp
L cpu-board:+5VREF #U$0115
U 1 1 5ED841FA
P 2575 6525
F 0 "#U$0115" H 2575 6525 50  0001 C CNN
F 1 "+5VREF" H 2688 6488 59  0000 R TNN
F 2 "" H 2575 6525 50  0001 C CNN
F 3 "" H 2575 6525 50  0001 C CNN
	1    2575 6525
	-1   0    0    1   
$EndComp
$Comp
L cpu-board:0VANA #U$0118
U 1 1 5ED841E1
P 1575 7975
F 0 "#U$0118" H 1575 7975 50  0001 C CNN
F 1 "0VANA" H 1475 7800 59  0000 L BNN
F 2 "" H 1575 7975 50  0001 C CNN
F 3 "" H 1575 7975 50  0001 C CNN
	1    1575 7975
	1    0    0    -1  
$EndComp
$Comp
L cpu-board:ASDX IC19
U 1 1 3DB6F2B4
P 2550 7450
F 0 "IC19" H 2525 8025 85  0000 C CNN
F 1 "ASDX100D44R" H 2525 7925 55  0000 C CNN
F 2 "AllModules:ASDX100D44R_1" H 2550 7450 50  0001 C CNN
F 3 "" H 2550 7450 50  0001 C CNN
	1    2550 7450
	1    0    0    -1  
$EndComp
$Comp
L cpu-board:C0805 C73
U 1 1 936D7BF6
P 3625 7525
F 0 "C73" H 3725 7550 64  0000 L CNN
F 1 "4.7nF" H 3725 7475 42  0000 L CNN
F 2 "AllModules:C0603_1" H 3625 7525 50  0001 C CNN
F 3 "" H 3625 7525 50  0001 C CNN
	1    3625 7525
	1    0    0    -1  
$EndComp
$Comp
L cpu-board:C0805 C72
U 1 1 16847C85
P 4325 7500
F 0 "C72" H 4425 7550 64  0000 L CNN
F 1 "100nF" H 4425 7450 42  0000 L CNN
F 2 "AllModules:C0402_1" H 4325 7500 50  0001 C CNN
F 3 "" H 4325 7500 50  0001 C CNN
	1    4325 7500
	1    0    0    -1  
$EndComp
$Comp
L cpu-board:R0805 R39
U 1 1 63F37C0C
P 3925 7350
F 0 "R39" H 3925 7600 64  0000 C CNN
F 1 "4.7k" H 3925 7500 42  0000 C CNN
F 2 "AllModules:R0603_1" H 3925 7350 50  0001 C CNN
F 3 "" H 3925 7350 50  0001 C CNN
	1    3925 7350
	1    0    0    -1  
$EndComp
$Comp
L cpu-board:C1206 C67
U 1 1 6998622D
P 1575 7000
F 0 "C67" H 1268 7013 64  0000 L BNN
F 1 "220nF" H 1275 6931 42  0000 L BNN
F 2 "AllModules:C0805_1" H 1575 7000 50  0001 C CNN
F 3 "" H 1575 7000 50  0001 C CNN
	1    1575 7000
	1    0    0    -1  
$EndComp
Text HLabel 4900 7350 2    56   Output ~ 0
PRES-O2
$Comp
L cpu-board:2XBL-AWM BL2
U 1 1 04E96AC4
P 3350 8400
F 0 "BL2" H 3375 7075 59  0000 L BNN
F 1 "2XBL-AWM" H 3350 8400 50  0001 C CNN
F 2 "AllModules:B2CAP-RB0505_1" H 3350 8400 50  0001 C CNN
F 3 "" H 3350 8400 50  0001 C CNN
F 4 "EMC CASING - CASE 2 PRESSURE SENSORS" H 3350 8400 50  0001 C CNN "Description"
F 5 "4096600.M00.002" H 3350 8400 50  0001 C CNN "Item Number"
F 6 "SUZHOU ACE SHEET MATEL MANUFACTURING CO., LTD" H 3350 8400 50  0001 C CNN "Manufacturer"
F 7 "4096600.M00.002" H 3350 8400 50  0001 C CNN "Manufacturer_No"
F 8 "EMC CASING - CASE 2 PRESSURE SENSORS (CUSTOM PART)" H 3350 8400 50  0001 C CNN "Manufacturer_Desc"
	1    3350 8400
	1    0    0    -1  
$EndComp
Wire Wire Line
	3450 9750 3525 9750
Wire Wire Line
	3450 7200 3450 7700
Connection ~ 3500 5925
Wire Wire Line
	3550 5875 3550 5825
Wire Wire Line
	3500 5925 3550 5875
Connection ~ 3200 6175
Wire Wire Line
	3500 6175 3200 6175
Wire Wire Line
	3500 5925 3500 6175
Wire Wire Line
	3450 5900 3500 5925
Wire Wire Line
	3400 5900 3450 5900
Connection ~ 3550 5550
Wire Wire Line
	3550 5625 3550 5550
Wire Wire Line
	2975 5550 3550 5550
Wire Wire Line
	3200 5850 3200 6175
Connection ~ 1500 6175
Wire Wire Line
	1500 6175 3200 6175
Connection ~ 1500 5850
Wire Wire Line
	1500 6175 1500 5850
Wire Wire Line
	1500 5850 1925 5850
Wire Wire Line
	1500 5300 1500 5850
Wire Wire Line
	1500 4900 1500 5100
Wire Wire Line
	1500 4900 1725 4900
Wire Wire Line
	2975 5400 3200 5400
Wire Wire Line
	2975 5700 3200 5700
Wire Wire Line
	2975 5850 3200 5850
Wire Wire Line
	1725 5400 1725 5550
Connection ~ 1725 5400
Wire Wire Line
	1925 5400 1725 5400
Wire Wire Line
	1725 5550 1725 5700
Connection ~ 1725 5550
Wire Wire Line
	1925 5550 1725 5550
Wire Wire Line
	1725 5700 1925 5700
Wire Wire Line
	1725 4900 1725 5400
Wire Wire Line
	3200 5700 3200 5850
Connection ~ 3200 5850
Wire Wire Line
	3200 5400 3200 4900
Wire Wire Line
	3200 4900 2500 4900
Wire Wire Line
	2500 4900 1725 4900
Connection ~ 1725 4900
Connection ~ 2500 4900
$Comp
L cpu-board:+5VREF #U$0119
U 1 1 5EAFF2A8
P 2500 4750
F 0 "#U$0119" H 2500 4750 50  0001 C CNN
F 1 "+5VREF" H 2613 4713 59  0000 R TNN
F 2 "" H 2500 4750 50  0001 C CNN
F 3 "" H 2500 4750 50  0001 C CNN
	1    2500 4750
	-1   0    0    1   
$EndComp
$Comp
L cpu-board:0VANA #U$0120
U 1 1 5EAFF2AE
P 1500 6175
F 0 "#U$0120" H 1500 6175 50  0001 C CNN
F 1 "0VANA" H 1400 6000 59  0000 L BNN
F 2 "" H 1500 6175 50  0001 C CNN
F 3 "" H 1500 6175 50  0001 C CNN
	1    1500 6175
	1    0    0    -1  
$EndComp
Wire Wire Line
	2500 4850 2500 4900
Wire Wire Line
	3550 5550 3950 5550
Wire Wire Line
	4500 5550 4550 5550
Wire Wire Line
	4550 5725 4550 5550
Connection ~ 4550 5550
Wire Wire Line
	4550 5550 4800 5550
$Comp
L cpu-board:C0805 C103
U 1 1 0E789015
P 4550 5825
F 0 "C103" H 4675 5900 64  0000 L CNN
F 1 "100nF" H 4675 5800 42  0000 L CNN
F 2 "AllModules:C0402_1" H 4550 5825 50  0001 C CNN
F 3 "" H 4550 5825 50  0001 C CNN
	1    4550 5825
	1    0    0    -1  
$EndComp
Wire Wire Line
	3950 5550 3950 5900
Connection ~ 3950 5550
Wire Wire Line
	3950 5550 4100 5550
Wire Wire Line
	3950 6400 4325 6400
Wire Wire Line
	3400 5300 3400 5900
Wire Wire Line
	3950 4475 3950 4575
$Comp
L cpu-board:0VANA #U$0121
U 1 1 5EBBB586
P 4550 4200
F 0 "#U$0121" H 4550 4200 50  0001 C CNN
F 1 "0VANA" H 4462 4012 59  0000 L BNN
F 2 "" H 4550 4200 50  0001 C CNN
F 3 "" H 4550 4200 50  0001 C CNN
	1    4550 4200
	1    0    0    -1  
$EndComp
Wire Wire Line
	4550 4100 4550 4200
Connection ~ 3500 4100
Wire Wire Line
	3550 4050 3550 4000
Wire Wire Line
	3500 4100 3550 4050
Connection ~ 3200 4350
Wire Wire Line
	3500 4350 3200 4350
Wire Wire Line
	3500 4100 3500 4350
Wire Wire Line
	3450 4075 3500 4100
Wire Wire Line
	3400 4000 3450 4075
Connection ~ 3550 3725
Wire Wire Line
	3550 3800 3550 3725
Wire Wire Line
	2975 3725 3550 3725
Wire Wire Line
	3200 4025 3200 4350
Connection ~ 1500 4350
Wire Wire Line
	1500 4350 3200 4350
Connection ~ 1500 4025
Wire Wire Line
	1500 4350 1500 4025
Wire Wire Line
	1500 4025 1925 4025
Wire Wire Line
	1500 3475 1500 4025
Wire Wire Line
	1500 3075 1500 3275
Wire Wire Line
	1500 3075 1725 3075
Wire Wire Line
	2975 3575 3200 3575
Wire Wire Line
	2975 3875 3200 3875
Wire Wire Line
	2975 4025 3200 4025
Wire Wire Line
	1725 3575 1725 3725
Connection ~ 1725 3575
Wire Wire Line
	1925 3575 1725 3575
Wire Wire Line
	1725 3725 1725 3875
Connection ~ 1725 3725
Wire Wire Line
	1925 3725 1725 3725
Wire Wire Line
	1725 3875 1925 3875
Wire Wire Line
	1725 3075 1725 3575
Wire Wire Line
	3200 3875 3200 4025
Connection ~ 3200 4025
Wire Wire Line
	3200 3575 3200 3075
Wire Wire Line
	3200 3075 2500 3075
Wire Wire Line
	2500 3075 1725 3075
Connection ~ 1725 3075
Connection ~ 2500 3075
$Comp
L cpu-board:0VANA #U$0122
U 1 1 5EBBB5D1
P 1500 4350
F 0 "#U$0122" H 1500 4350 50  0001 C CNN
F 1 "0VANA" H 1400 4175 59  0000 L BNN
F 2 "" H 1500 4350 50  0001 C CNN
F 3 "" H 1500 4350 50  0001 C CNN
	1    1500 4350
	1    0    0    -1  
$EndComp
Wire Wire Line
	3550 3725 3950 3725
Wire Wire Line
	4500 3725 4550 3725
Wire Wire Line
	4550 3900 4550 3725
Connection ~ 4550 3725
Wire Wire Line
	3950 3725 3950 4075
Connection ~ 3950 3725
Wire Wire Line
	3950 3725 4100 3725
Wire Wire Line
	3950 4575 4400 4575
Wire Wire Line
	4550 3725 4825 3725
Wire Wire Line
	2500 2975 2500 3075
$Comp
L cpu-board:3XBL-ADSX BL4
U 1 1 2C3F9162
P 3300 1500
F 0 "BL4" H 3325 -2263 59  0000 L BNN
F 1 "3XBL-ADSX" H 3300 1500 50  0001 C CNN
F 2 "AllModules:B3CAP-RB0505_1" H 3300 1500 50  0001 C CNN
F 3 "" H 3300 1500 50  0001 C CNN
F 4 "EMC CASING - CASE 3 PRESSURE SENSORS" H 3300 1500 50  0001 C CNN "Description"
F 5 "4096600.M00.003" H 3300 1500 50  0001 C CNN "Item Number"
F 6 "SUZHOU ACE SHEET MATEL MANUFACTURING CO., LTD" H 3300 1500 50  0001 C CNN "Manufacturer"
F 7 "4096600.M00.003" H 3300 1500 50  0001 C CNN "Manufacturer_No"
F 8 "EMC CASING - CASE 3 PRESSURE SENSORS (CUSTOM PART)" H 3300 1500 50  0001 C CNN "Manufacturer_Desc"
	1    3300 1500
	1    0    0    -1  
$EndComp
$Comp
L cpu-board:ASDX IC16
U 1 1 9EF2916C
P 2500 2000
F 0 "IC16" H 2488 2563 85  0000 C CNN
F 1 "ASDX001D44R-SQ04689" H 2488 2463 55  0000 C CNN
F 2 "AllModules:ASDX001D44R_1" H 2500 2000 50  0001 C CNN
F 3 "" H 2500 2000 50  0001 C CNN
F 4 "IC, PRESSURE TRANSDUCER,(-10/+100 MBAR)" H 2500 2000 50  0001 C CNN "Description"
F 5 "10023117" H 2500 2000 50  0001 C CNN "Item Number"
F 6 "SENSYM_RMS1" H 2500 2000 50  0001 C CNN "Manufacturer"
F 7 "ASDX001D44R-SQ04689" H 2500 2000 50  0001 C CNN "Manufacturer_No"
F 8 "PRESSURE TRANSDUCER" H 2500 2000 50  0001 C CNN "Manufacturer_Desc"
F 9 "HONEYWELL_RMS1" H 2500 2000 50  0001 C CNN "Manufacturer2"
F 10 "XZ209766-ASDX" H 2500 2000 50  0001 C CNN "Manufacturer_No2"
F 11 "IC DIFFERENTIAL PRESSURE SENSOR WITH ANALOGUE OUTPUT -10 TO 100 MBAR" H 2500 2000 50  0001 C CNN "Manufacturer_Desc2"
	1    2500 2000
	1    0    0    -1  
$EndComp
Wire Wire Line
	3400 1500 3425 1500
Wire Wire Line
	1525 1675 1525 2200
Wire Wire Line
	1950 2200 1525 2200
Connection ~ 1525 2200
Wire Wire Line
	1525 2200 1525 2475
Wire Wire Line
	1950 2050 1725 2050
Wire Wire Line
	1725 2050 1725 1900
Wire Wire Line
	1725 1750 1950 1750
Wire Wire Line
	1950 1900 1725 1900
Connection ~ 1725 1900
Wire Wire Line
	1725 1900 1725 1750
Wire Wire Line
	1525 1475 1525 1275
Wire Wire Line
	1525 1275 1725 1275
Wire Wire Line
	1725 1750 1725 1275
Connection ~ 1725 1750
Connection ~ 1725 1275
Wire Wire Line
	1725 1275 3200 1275
Wire Wire Line
	3000 1750 3200 1750
Wire Wire Line
	3200 1750 3200 1275
Connection ~ 3200 1275
Wire Wire Line
	3200 1275 3400 1275
Wire Wire Line
	3550 2000 3550 1900
Wire Wire Line
	3550 1900 3950 1900
Wire Wire Line
	3000 1900 3550 1900
Connection ~ 3550 1900
Wire Wire Line
	4850 1900 4650 1900
Wire Wire Line
	4650 2050 4650 1900
Connection ~ 4650 1900
Wire Wire Line
	4650 1900 4600 1900
Connection ~ 3950 1900
Wire Wire Line
	3950 1900 4200 1900
Wire Wire Line
	3000 2050 3200 2050
Wire Wire Line
	3200 2050 3200 2200
Wire Wire Line
	3200 2200 3000 2200
Wire Wire Line
	3200 2200 3200 2475
Wire Wire Line
	3200 2475 1525 2475
Connection ~ 3200 2200
Connection ~ 1525 2475
Wire Wire Line
	1525 2475 1525 2550
Wire Wire Line
	3200 2475 3500 2475
Wire Wire Line
	3500 2475 3500 2325
Wire Wire Line
	3500 2325 3425 2275
Connection ~ 3200 2475
Wire Wire Line
	3425 1500 3425 2275
Wire Wire Line
	3500 2325 3550 2275
Wire Wire Line
	3550 2275 3550 2200
Connection ~ 3500 2325
Text Label 4400 4575 0    56   ~ 0
VALVE-PRES-MEAS
Text Label 4325 6400 0    50   ~ 0
PROX-PRES-MEAS
$Comp
L cpu-board:SQ276 IC27
U 1 1 3A3F7DCF
P 7550 3450
F 0 "IC27" V 8138 3287 73  0000 R BNN
F 1 "SQ276" V 8038 3275 59  0000 R BNN
F 2 "AllModules:SQ276-05856_1" H 7550 3450 50  0001 C CNN
F 3 "https://www.first-sensor.com/cms/upload/datasheets/DS_Standard-HCLA_E_11629.pdf" H 7550 3450 50  0001 C CNN
	1    7550 3450
	0    -1   -1   0   
$EndComp
Wire Wire Line
	7050 4050 7350 4050
Wire Wire Line
	7350 4050 7350 3950
Wire Wire Line
	7050 4150 7450 4150
Wire Wire Line
	7450 4150 7450 3950
Wire Wire Line
	7050 4250 7650 4250
Wire Wire Line
	7650 4250 7650 3950
NoConn ~ 7550 3950
Wire Wire Line
	7050 2475 7350 2475
Wire Wire Line
	7350 2475 7350 2950
Wire Wire Line
	7050 2375 7450 2375
Wire Wire Line
	7450 2375 7450 2950
Wire Wire Line
	7550 2050 7550 2375
Wire Wire Line
	7700 2375 7550 2375
Connection ~ 7550 2375
Wire Wire Line
	7550 2375 7550 2950
Wire Wire Line
	7900 2375 8050 2375
Wire Wire Line
	8050 2375 8050 2075
Wire Wire Line
	7650 2950 7650 2600
Wire Wire Line
	7650 2600 8050 2600
Wire Wire Line
	8050 2600 8050 2375
Connection ~ 8050 2375
$Comp
L cpu-board:C0805 C57
U 1 1 676BBC9D
P 7800 5425
F 0 "C57" V 8037 5344 64  0000 L BNN
F 1 "100nF" V 7943 5313 42  0000 L BNN
F 2 "AllModules:C0402_1" H 7800 5425 50  0001 C CNN
F 3 "" H 7800 5425 50  0001 C CNN
	1    7800 5425
	0    -1   -1   0   
$EndComp
Connection ~ 8050 5425
Wire Wire Line
	8050 5650 8050 5425
Wire Wire Line
	7650 5650 8050 5650
Wire Wire Line
	7650 6000 7650 5650
Wire Wire Line
	8050 5425 8050 5125
Wire Wire Line
	7900 5425 8050 5425
Wire Wire Line
	7550 5425 7550 6000
Connection ~ 7550 5425
Wire Wire Line
	7700 5425 7550 5425
Wire Wire Line
	7550 5100 7550 5425
Wire Wire Line
	7450 5425 7450 6000
Wire Wire Line
	7050 5425 7450 5425
Wire Wire Line
	7350 5525 7350 6000
Wire Wire Line
	7050 5525 7350 5525
NoConn ~ 7550 7000
Wire Wire Line
	7650 7300 7650 7000
Wire Wire Line
	7050 7300 7650 7300
Wire Wire Line
	7450 7200 7450 7000
Wire Wire Line
	7050 7200 7450 7200
Wire Wire Line
	7350 7100 7350 7000
Wire Wire Line
	7050 7100 7350 7100
$Comp
L cpu-board:+5VREF #U$0123
U 1 1 5F382422
P 8050 5025
F 0 "#U$0123" H 8050 5025 50  0001 C CNN
F 1 "+5VREF" H 7887 4937 59  0000 L BNN
F 2 "" H 8050 5025 50  0001 C CNN
F 3 "" H 8050 5025 50  0001 C CNN
	1    8050 5025
	-1   0    0    1   
$EndComp
Text HLabel 7050 7300 0    56   Input ~ 0
MTSR-SPI-0
Text HLabel 7050 5525 0    56   Output ~ 0
MRST-SPI-0_E
Text HLabel 7050 7100 0    56   Input ~ 0
SCLK-SPI-0
Text Label 7050 5425 2    50   ~ 0
PROX-PRES-MEAS
$Comp
L cpu-board:SQ276 IC30
U 1 1 BCFB88DB
P 7550 6500
F 0 "IC30" V 8125 6350 73  0000 R BNN
F 1 "SQ276" V 8025 6337 59  0000 R BNN
F 2 "AllModules:SQ276-05856_1" H 7550 6500 50  0001 C CNN
F 3 "" H 7550 6500 50  0001 C CNN
	1    7550 6500
	0    -1   -1   0   
$EndComp
Text HLabel 7050 7200 0    56   Input ~ 0
CE\-PROX-PRES-SENS
Connection ~ 8050 8475
Wire Wire Line
	8050 8700 8050 8475
Wire Wire Line
	7650 8700 8050 8700
Wire Wire Line
	7650 9050 7650 8700
Wire Wire Line
	8050 8475 8050 8175
Wire Wire Line
	7900 8475 8050 8475
Wire Wire Line
	7550 8475 7550 9050
Connection ~ 7550 8475
Wire Wire Line
	7700 8475 7550 8475
Wire Wire Line
	7550 8150 7550 8475
Wire Wire Line
	7450 8475 7450 9050
Wire Wire Line
	7050 8475 7450 8475
Wire Wire Line
	7350 8575 7350 9050
Wire Wire Line
	7050 8575 7350 8575
NoConn ~ 7550 10050
Wire Wire Line
	7650 10350 7650 10050
Wire Wire Line
	7050 10350 7650 10350
Wire Wire Line
	7450 10250 7450 10050
Wire Wire Line
	7050 10250 7450 10250
Wire Wire Line
	7350 10150 7350 10050
Wire Wire Line
	7050 10150 7350 10150
Text HLabel 7050 10350 0    56   Input ~ 0
MTSR-SPI-0
Text HLabel 7050 8575 0    56   Output ~ 0
MRST-SPI-0_E
Text HLabel 7050 10150 0    56   Input ~ 0
SCLK-SPI-0
Text Notes 9137 8075 0    59   ~ 0
Dual implantation of Analog and Digital sensor: If SPI sensors are used then the equivalent analog sensors will not be wired
Wire Notes Line
	15325 7838 9012 7838
Wire Notes Line
	15325 8250 15325 7838
Wire Notes Line
	9012 8250 15325 8250
Wire Notes Line
	9012 7838 9012 8250
Wire Wire Line
	10950 6000 11250 6000
Wire Wire Line
	11250 6000 11250 5875
Wire Wire Line
	10950 6100 11350 6100
Wire Wire Line
	11350 6100 11350 5875
Wire Wire Line
	10950 6200 11550 6200
Wire Wire Line
	11550 6200 11550 5875
Wire Wire Line
	11250 4875 11250 4400
Wire Wire Line
	11250 4400 10950 4400
Wire Wire Line
	11450 3975 11450 4200
Wire Wire Line
	11550 4875 11550 4400
Wire Wire Line
	11550 4400 11950 4400
Wire Wire Line
	11950 4400 11950 4200
Wire Wire Line
	11550 4200 11450 4200
Connection ~ 11450 4200
Wire Wire Line
	11450 4200 11450 4875
Wire Wire Line
	11750 4200 11950 4200
Connection ~ 11950 4200
Wire Wire Line
	11950 4200 11950 4000
Text HLabel 13400 5975 0    56   Input ~ 0
SCLK-SPI-0
Text HLabel 13400 4375 0    56   Output ~ 0
MRST-SPI-0_E
Text HLabel 13400 6175 0    56   Input ~ 0
MTSR-SPI-0
Wire Wire Line
	13400 5975 13700 5975
Wire Wire Line
	13700 5975 13700 5850
Wire Wire Line
	13400 6075 13800 6075
Wire Wire Line
	13800 6075 13800 5850
Wire Wire Line
	13400 6175 14000 6175
Wire Wire Line
	14000 6175 14000 5850
Wire Wire Line
	13700 4850 13700 4375
Wire Wire Line
	13700 4375 13400 4375
Wire Wire Line
	13900 3950 13900 4175
Wire Wire Line
	14000 4850 14000 4375
Wire Wire Line
	14000 4375 14400 4375
Wire Wire Line
	14400 4375 14400 4175
Wire Wire Line
	14000 4175 13900 4175
Connection ~ 13900 4175
Wire Wire Line
	13900 4175 13900 4850
Wire Wire Line
	14200 4175 14400 4175
Connection ~ 14400 4175
Wire Wire Line
	14400 4175 14400 3975
NoConn ~ 13900 5850
NoConn ~ 13800 4850
Wire Notes Line
	15887 6575 15887 850 
$Comp
L cpu-board:SQ276 IC34
U 1 1 47725143
P 11450 5375
F 0 "IC34" V 12000 5175 73  0000 R CNN
F 1 "SQ276" V 11900 5175 59  0000 R CNN
F 2 "AllModules:SQ276-05856_1" H 11450 5375 50  0001 C CNN
F 3 "https://www.first-sensor.com/cms/upload/datasheets/DS_Standard-HCLA_E_11629.pdf" H 11450 5375 50  0001 C CNN
	1    11450 5375
	0    -1   -1   0   
$EndComp
NoConn ~ 11350 4875
NoConn ~ 11450 5875
Wire Wire Line
	13375 2625 14050 2625
Wire Wire Line
	14050 2125 14050 2225
Connection ~ 14050 2625
Wire Wire Line
	14050 2625 14200 2625
Connection ~ 14050 2225
Wire Wire Line
	14050 2225 14050 2325
Connection ~ 14050 2325
Wire Wire Line
	14050 2325 14050 2425
Connection ~ 14050 2425
Wire Wire Line
	14050 2425 14050 2625
$Comp
L cpu-board:R0805 R33
U 1 1 05E5179D
P 11225 2050
F 0 "R33" H 11150 2225 64  0000 L BNN
F 1 "4.7k" H 11150 2138 42  0000 L BNN
F 2 "AllModules:R0603_1" H 11225 2050 50  0001 C CNN
F 3 "" H 11225 2050 50  0001 C CNN
F 4 "RESISTOR, 4.7 K OHM, 0.063W +/-5%" H 11225 2050 50  0001 C CNN "Description"
F 5 "10022617" H 11225 2050 50  0001 C CNN "Item Number"
F 6 "ASJ" H 11225 2050 50  0001 C CNN "Manufacturer"
F 7 "CR16-472JL" H 11225 2050 50  0001 C CNN "Manufacturer_No"
F 8 "THICK FILM CHIP RESISTOR" H 11225 2050 50  0001 C CNN "Manufacturer_Desc"
F 9 "YAGEO_RMS1" H 11225 2050 50  0001 C CNN "Manufacturer2"
F 10 "232270260472L" H 11225 2050 50  0001 C CNN "Manufacturer_No2"
F 11 "RESISTOR, METAL GLAZE/THICK FILM, 0.1 W, 5 %, 100 PPM, 4700 OHM, SURFACE MOUNT, 0603" H 11225 2050 50  0001 C CNN "Manufacturer_Desc2"
F 12 "YAGEO_RMS1" H 11225 2050 50  0001 C CNN "Manufacturer3"
F 13 "RC0603JR-074K7L" H 11225 2050 50  0001 C CNN "Manufacturer_No3"
F 14 "RESISTOR, METAL GLAZE/THICK FILM, 0.1 W, 5 %, 100 PPM, 4700 OHM, SURFACE MOUNT, 0603" H 11225 2050 50  0001 C CNN "Manufacturer_Desc3"
F 15 "YAGEO_RMS1" H 11225 2050 50  0001 C CNN "Manufacturer4"
F 16 "232270260472" H 11225 2050 50  0001 C CNN "Manufacturer_No4"
F 17 "RESISTOR, METAL GLAZE/THICK FILM, 0.1 W, 5 %, 100 PPM, 4700 OHM, SURFACE MOUNT, 0603" H 11225 2050 50  0001 C CNN "Manufacturer_Desc4"
	1    11225 2050
	1    0    0    -1  
$EndComp
Wire Wire Line
	10050 2550 10050 2650
Wire Wire Line
	10650 2650 10875 2650
Wire Wire Line
	10875 2650 10875 2375
Wire Wire Line
	10650 2425 10650 2650
Wire Wire Line
	10650 2650 10050 2650
Connection ~ 10650 2650
Connection ~ 10050 2650
Wire Wire Line
	10050 2650 10050 2700
Wire Wire Line
	10050 2650 9500 2650
Wire Wire Line
	9500 2650 9500 2150
Wire Wire Line
	9500 1950 9500 1475
Wire Wire Line
	9500 1475 10050 1475
Wire Wire Line
	10050 1475 10050 1400
Wire Wire Line
	10050 1475 10050 1550
Connection ~ 10050 1475
Wire Wire Line
	10450 2050 10875 2050
Wire Wire Line
	10875 2050 10875 2175
Wire Wire Line
	10875 2050 11025 2050
Connection ~ 10875 2050
Wire Wire Line
	11425 2050 11450 2050
Wire Wire Line
	11450 2375 11450 2450
Wire Wire Line
	11450 2175 11450 2050
Connection ~ 11450 2050
Wire Wire Line
	11450 2050 11600 2050
Wire Wire Line
	3950 1900 3950 2250
Wire Wire Line
	3950 2650 3950 2763
$EndSCHEMATC
