(module SOT23-GSD_1 (layer F.Cu) (tedit 5E991CD2)
  (attr smd)
  (fp_text reference T5 (at 1.44077 -1.59568 unlocked) (layer F.SilkS)
    (effects (font (size 1.0496 1.104) (thickness 0.18)))
  )
  (fp_text value Q-BC-SOT23-GSD (at 5.6 -0.8 unlocked) (layer F.SilkS) hide
    (effects (font (size 1.0496 1.104) (thickness 0.18)))
  )
  (fp_line (start -0.24374 1.8) (end 0.24374 1.8) (layer F.SilkS) (width 0.18))
  (fp_line (start -1.7 0.30942) (end -1.7 -0.7) (layer F.SilkS) (width 0.18))
  (fp_line (start -1.7 -0.7) (end -0.7488 -0.7) (layer F.SilkS) (width 0.18))
  (fp_line (start -1.7 1.8) (end -1.68666 1.8) (layer F.SilkS) (width 0.18))
  (fp_line (start -1.7 1.8) (end -1.7 1.77338) (layer F.SilkS) (width 0.18))
  (fp_line (start 0.7488 -0.7) (end 1.7 -0.7) (layer F.SilkS) (width 0.18))
  (fp_line (start 1.7 0.30942) (end 1.7 -0.7) (layer F.SilkS) (width 0.18))
  (fp_line (start -0.2032 -1.2446) (end 0.2032 -1.2446) (layer F.Fab) (width 0.1))
  (fp_line (start 0.762 1.2446) (end 1.1684 1.2446) (layer F.Fab) (width 0.1))
  (fp_line (start -1.1684 1.2446) (end -0.762 1.2446) (layer F.Fab) (width 0.1))
  (fp_line (start 0.2032 -0.6604) (end 0.2032 -1.2446) (layer F.Fab) (width 0.1))
  (fp_line (start -1.1684 1.2446) (end -1.1684 0.6604) (layer F.Fab) (width 0.1))
  (fp_line (start -0.2032 -0.6604) (end -0.2032 -1.2446) (layer F.Fab) (width 0.1))
  (fp_line (start -0.762 1.2446) (end -0.762 0.6604) (layer F.Fab) (width 0.1))
  (fp_line (start -1.4478 0.6604) (end 1.4478 0.6604) (layer F.Fab) (width 0.1))
  (fp_line (start 1.1684 1.2446) (end 1.1684 0.6604) (layer F.Fab) (width 0.1))
  (fp_line (start -1.4478 0.6604) (end -1.4478 -0.6604) (layer F.Fab) (width 0.1))
  (fp_line (start 0.762 1.2446) (end 0.762 0.6604) (layer F.Fab) (width 0.1))
  (fp_line (start 1.4478 0.6604) (end 1.4478 -0.6604) (layer F.Fab) (width 0.1))
  (fp_line (start -1.4478 -0.6604) (end 1.4478 -0.6604) (layer F.Fab) (width 0.1))
  (pad S smd rect (at 0.9652 1.0414) (size 0.9144 1.1176) (layers F.Cu F.Paste F.Mask))
  (pad G smd rect (at -0.9652 1.0414) (size 0.9144 1.1176) (layers F.Cu F.Paste F.Mask))
  (pad D smd rect (at 0 -1.0414) (size 0.9144 1.1176) (layers F.Cu F.Paste F.Mask))
  (model ${KISYS3DMOD}/Package_TO_SOT_SMD.3dshapes/SOT-23.wrl
    (at (xyz 0 0 0))
    (scale (xyz 1 1 1))
    (rotate (xyz 0 0 -90))
  )
)
