EESchema Schematic File Version 4
EELAYER 30 0
EELAYER END
$Descr User 17335 11946
encoding utf-8
Sheet 6 8
Title "RB0505 CPU Board"
Date "2020-04-15"
Rev ""
Comp ""
Comment1 ""
Comment2 ""
Comment3 ""
Comment4 ""
$EndDescr
Wire Wire Line
	7800 7900 7800 8000
Wire Wire Line
	7800 8000 7800 8100
Wire Wire Line
	7800 8100 7800 8200
Wire Wire Line
	7800 8200 7800 8300
Wire Wire Line
	7800 8300 7800 8400
Wire Wire Line
	7800 8400 7800 8500
Wire Wire Line
	7800 8500 7800 8600
Wire Wire Line
	7800 8600 7800 8700
Wire Wire Line
	7800 8700 7800 8800
Wire Wire Line
	7800 8800 7800 8900
Wire Wire Line
	7800 8900 7800 9000
Wire Wire Line
	7800 9000 7800 9100
Wire Wire Line
	7800 9100 7800 9200
Wire Wire Line
	7800 9200 7800 9300
Wire Wire Line
	7800 9300 7800 9400
Wire Wire Line
	7800 9400 7800 9500
Wire Wire Line
	7800 9500 7800 9600
Wire Wire Line
	7800 9600 7800 9700
Wire Wire Line
	7800 9700 7800 9800
Wire Wire Line
	7800 9800 7800 9900
Wire Wire Line
	7800 9900 7800 10000
Wire Wire Line
	7800 10000 7800 10100
Wire Wire Line
	7800 10100 7800 10200
Wire Wire Line
	7700 10100 7800 10100
Wire Wire Line
	7700 10000 7800 10000
Wire Wire Line
	7700 9900 7800 9900
Wire Wire Line
	7800 9800 7700 9800
Wire Wire Line
	7700 9700 7800 9700
Wire Wire Line
	7800 9600 7700 9600
Wire Wire Line
	7700 9500 7800 9500
Wire Wire Line
	7800 9400 7700 9400
Wire Wire Line
	7700 9300 7800 9300
Wire Wire Line
	7800 9200 7700 9200
Wire Wire Line
	7700 9100 7800 9100
Wire Wire Line
	7800 9000 7700 9000
Wire Wire Line
	7700 8900 7800 8900
Wire Wire Line
	7700 8800 7800 8800
Wire Wire Line
	7700 8700 7800 8700
Wire Wire Line
	7700 8600 7800 8600
Wire Wire Line
	7700 8500 7800 8500
Wire Wire Line
	7700 8400 7800 8400
Wire Wire Line
	7700 8300 7800 8300
Wire Wire Line
	7800 8200 7700 8200
Wire Wire Line
	7700 8100 7800 8100
Wire Wire Line
	7800 8000 7700 8000
Wire Wire Line
	7700 7900 7800 7900
Connection ~ 7800 10100
Connection ~ 7800 10000
Connection ~ 7800 9900
Connection ~ 7800 9800
Connection ~ 7800 9700
Connection ~ 7800 9600
Connection ~ 7800 9500
Connection ~ 7800 9400
Connection ~ 7800 9300
Connection ~ 7800 9200
Connection ~ 7800 9100
Connection ~ 7800 9000
Connection ~ 7800 8900
Connection ~ 7800 8800
Connection ~ 7800 8700
Connection ~ 7800 8600
Connection ~ 7800 8500
Connection ~ 7800 8400
Connection ~ 7800 8300
Connection ~ 7800 8200
Connection ~ 7800 8100
Connection ~ 7800 8000
Wire Wire Line
	6600 6600 6600 6800
Wire Wire Line
	6600 6800 6600 7100
Wire Wire Line
	6700 7100 6700 6800
Wire Wire Line
	6700 6800 6600 6800
Wire Wire Line
	6700 6800 6800 6800
Connection ~ 6600 6800
Connection ~ 6700 6800
Wire Wire Line
	7000 6800 7200 6800
Wire Wire Line
	7200 6800 7200 7100
Wire Wire Line
	7300 6600 7300 6800
Wire Wire Line
	7300 6800 7300 7100
Wire Wire Line
	7200 6800 7300 6800
Connection ~ 7200 6800
Connection ~ 7300 6800
$Comp
L cpu-board:+5V #U$033
U 1 1 6953EFA5
P 3325 6600
F 0 "#U$033" H 3325 6600 50  0001 C CNN
F 1 "+5V" H 3250 6525 59  0000 L BNN
F 2 "" H 3325 6600 50  0001 C CNN
F 3 "" H 3325 6600 50  0001 C CNN
	1    3325 6600
	-1   0    0    1   
$EndComp
$Comp
L cpu-board:+3,3V #U$073
U 1 1 0D6BAA89
P 4725 6750
F 0 "#U$073" H 4725 6750 50  0001 C CNN
F 1 "+3,3V" H 4613 6975 59  0000 L BNN
F 2 "" H 4725 6750 50  0001 C CNN
F 3 "" H 4725 6750 50  0001 C CNN
	1    4725 6750
	1    0    0    -1  
$EndComp
$Comp
L cpu-board:GND #U$078
U 1 1 7A2675AF
P 4775 5175
F 0 "#U$078" H 4775 5175 50  0001 C CNN
F 1 "GND" H 4687 5088 59  0000 L BNN
F 2 "" H 4775 5175 50  0001 C CNN
F 3 "" H 4775 5175 50  0001 C CNN
	1    4775 5175
	1    0    0    -1  
$EndComp
$Comp
L cpu-board:+5V #U$079
U 1 1 A488A5D8
P 4775 1250
F 0 "#U$079" H 4775 1250 50  0001 C CNN
F 1 "+5V" H 4700 1175 59  0000 L BNN
F 2 "" H 4775 1250 50  0001 C CNN
F 3 "" H 4775 1250 50  0001 C CNN
	1    4775 1250
	-1   0    0    1   
$EndComp
$Comp
L cpu-board:C0805 C33
U 1 1 C9502F30
P 4225 1700
F 0 "C33" V 4450 1594 64  0000 L BNN
F 1 "100nF" V 4356 1601 42  0000 L BNN
F 2 "AllModules:C0402_1" H 4225 1700 50  0001 C CNN
F 3 "" H 4225 1700 50  0001 C CNN
F 4 "CAPACITOR,100NF,16V,+/-10%,X7R,0402" H 4225 1700 50  0001 C CNN "Description"
F 5 "10022607" H 4225 1700 50  0001 C CNN "Item Number"
F 6 "MURATA" H 4225 1700 50  0001 C CNN "Manufacturer"
F 7 "GRM155R71C104JA88J" H 4225 1700 50  0001 C CNN "Manufacturer_No"
F 8 "CAPACITOR, CERAMIC, MULTILAYER, 16V, X7R, 0.1UF, 0402" H 4225 1700 50  0001 C CNN "Manufacturer_Desc"
F 9 "YAGEO_RMS1" H 4225 1700 50  0001 C CNN "Manufacturer2"
F 10 "CC0402KRX7R7BB104" H 4225 1700 50  0001 C CNN "Manufacturer_No2"
F 11 "CAP CER 0.1uF 16V X7R 10% 0402" H 4225 1700 50  0001 C CNN "Manufacturer_Desc2"
F 12 "YAGEO_RMS1" H 4225 1700 50  0001 C CNN "Manufacturer3"
F 13 "223878715649" H 4225 1700 50  0001 C CNN "Manufacturer_No3"
F 14 "CAPACITOR, CERAMIC, MULTILAYER, 16 V, X7R, 0.1 UF, SURFACE MOUNT, 0402" H 4225 1700 50  0001 C CNN "Manufacturer_Desc3"
F 15 "MURATA MANUFACTURING CO., LTD." H 4225 1700 50  0001 C CNN "Manufacturer4"
F 16 "GRM155R71C104KA88D" H 4225 1700 50  0001 C CNN "Manufacturer_No4"
F 17 "MONOLITHIC CERAMIC CAPACITOR" H 4225 1700 50  0001 C CNN "Manufacturer_Desc4"
	1    4225 1700
	0    -1   -1   0   
$EndComp
$Comp
L cpu-board:C0805 C37
U 1 1 235E1F38
P 5225 1700
F 0 "C37" V 5450 1607 64  0000 L BNN
F 1 "100nF" V 5356 1601 42  0000 L BNN
F 2 "AllModules:C0402_1" H 5225 1700 50  0001 C CNN
F 3 "" H 5225 1700 50  0001 C CNN
F 4 "CAPACITOR,100NF,16V,+/-10%,X7R,0402" H 5225 1700 50  0001 C CNN "Description"
F 5 "10022607" H 5225 1700 50  0001 C CNN "Item Number"
F 6 "MURATA" H 5225 1700 50  0001 C CNN "Manufacturer"
F 7 "GRM155R71C104JA88J" H 5225 1700 50  0001 C CNN "Manufacturer_No"
F 8 "CAPACITOR, CERAMIC, MULTILAYER, 16V, X7R, 0.1UF, 0402" H 5225 1700 50  0001 C CNN "Manufacturer_Desc"
F 9 "YAGEO_RMS1" H 5225 1700 50  0001 C CNN "Manufacturer2"
F 10 "CC0402KRX7R7BB104" H 5225 1700 50  0001 C CNN "Manufacturer_No2"
F 11 "CAP CER 0.1uF 16V X7R 10% 0402" H 5225 1700 50  0001 C CNN "Manufacturer_Desc2"
F 12 "YAGEO_RMS1" H 5225 1700 50  0001 C CNN "Manufacturer3"
F 13 "223878715649" H 5225 1700 50  0001 C CNN "Manufacturer_No3"
F 14 "CAPACITOR, CERAMIC, MULTILAYER, 16 V, X7R, 0.1 UF, SURFACE MOUNT, 0402" H 5225 1700 50  0001 C CNN "Manufacturer_Desc3"
F 15 "MURATA MANUFACTURING CO., LTD." H 5225 1700 50  0001 C CNN "Manufacturer4"
F 16 "GRM155R71C104KA88D" H 5225 1700 50  0001 C CNN "Manufacturer_No4"
F 17 "MONOLITHIC CERAMIC CAPACITOR" H 5225 1700 50  0001 C CNN "Manufacturer_Desc4"
	1    5225 1700
	0    -1   -1   0   
$EndComp
$Comp
L cpu-board:GND #U$080
U 1 1 6E5A9549
P 5550 1700
F 0 "#U$080" H 5550 1700 50  0001 C CNN
F 1 "GND" H 5462 1625 59  0000 L BNN
F 2 "" H 5550 1700 50  0001 C CNN
F 3 "" H 5550 1700 50  0001 C CNN
	1    5550 1700
	0    -1   -1   0   
$EndComp
$Comp
L cpu-board:GND #U$082
U 1 1 C66F0688
P 3925 1250
F 0 "#U$082" H 3925 1250 50  0001 C CNN
F 1 "GND" H 3850 1175 59  0000 L BNN
F 2 "" H 3925 1250 50  0001 C CNN
F 3 "" H 3925 1250 50  0001 C CNN
	1    3925 1250
	-1   0    0    1   
$EndComp
$Comp
L cpu-board:C0805 C2
U 1 1 6D294609
P 12325 1325
F 0 "C2" V 12487 1394 64  0000 R TNN
F 1 "100nF" V 12418 1387 42  0000 R TNN
F 2 "AllModules:C0402_1" H 12325 1325 50  0001 C CNN
F 3 "" H 12325 1325 50  0001 C CNN
F 4 "CAPACITOR,100NF,16V,+/-10%,X7R,0402" H 12325 1325 50  0001 C CNN "Description"
F 5 "10022607" H 12325 1325 50  0001 C CNN "Item Number"
F 6 "MURATA" H 12325 1325 50  0001 C CNN "Manufacturer"
F 7 "GRM155R71C104JA88J" H 12325 1325 50  0001 C CNN "Manufacturer_No"
F 8 "CAPACITOR, CERAMIC, MULTILAYER, 16V, X7R, 0.1UF, 0402" H 12325 1325 50  0001 C CNN "Manufacturer_Desc"
F 9 "YAGEO_RMS1" H 12325 1325 50  0001 C CNN "Manufacturer2"
F 10 "CC0402KRX7R7BB104" H 12325 1325 50  0001 C CNN "Manufacturer_No2"
F 11 "CAP CER 0.1uF 16V X7R 10% 0402" H 12325 1325 50  0001 C CNN "Manufacturer_Desc2"
F 12 "YAGEO_RMS1" H 12325 1325 50  0001 C CNN "Manufacturer3"
F 13 "223878715649" H 12325 1325 50  0001 C CNN "Manufacturer_No3"
F 14 "CAPACITOR, CERAMIC, MULTILAYER, 16 V, X7R, 0.1 UF, SURFACE MOUNT, 0402" H 12325 1325 50  0001 C CNN "Manufacturer_Desc3"
F 15 "MURATA MANUFACTURING CO., LTD." H 12325 1325 50  0001 C CNN "Manufacturer4"
F 16 "GRM155R71C104KA88D" H 12325 1325 50  0001 C CNN "Manufacturer_No4"
F 17 "MONOLITHIC CERAMIC CAPACITOR" H 12325 1325 50  0001 C CNN "Manufacturer_Desc4"
	1    12325 1325
	0    -1   -1   0   
$EndComp
$Comp
L cpu-board:+5V #U$031
U 1 1 BD08BF3C
P 12550 925
F 0 "#U$031" H 12550 925 50  0001 C CNN
F 1 "+5V" H 12463 838 59  0000 L BNN
F 2 "" H 12550 925 50  0001 C CNN
F 3 "" H 12550 925 50  0001 C CNN
	1    12550 925 
	-1   0    0    1   
$EndComp
$Comp
L cpu-board:GND #U$050
U 1 1 1C85CEBD
P 12100 975
F 0 "#U$050" H 12100 975 50  0001 C CNN
F 1 "GND" H 12013 888 59  0000 L BNN
F 2 "" H 12100 975 50  0001 C CNN
F 3 "" H 12100 975 50  0001 C CNN
	1    12100 975 
	-1   0    0    1   
$EndComp
$Comp
L cpu-board:HC49UP Q2
U 1 1 53ABB1EB
P 13775 1750
F 0 "Q2" V 13690 1950 64  0000 R TNN
F 1 "3.6864MHz" V 13775 2188 42  0000 R TNN
F 2 "AllModules:HC49-4HSMX_1" H 13775 1750 50  0001 C CNN
F 3 "" H 13775 1750 50  0001 C CNN
F 4 "CRYSTAL, QUARTZ, 3.6864MHZ" H 13775 1750 50  0001 C CNN "Description"
F 5 "10023291" H 13775 1750 50  0001 C CNN "Item Number"
F 6 "IQD" H 13775 1750 50  0001 C CNN "Manufacturer"
F 7 "LFXTAL003260REEL" H 13775 1750 50  0001 C CNN "Manufacturer_No"
F 8 "" H 13775 1750 50  0001 C CNN "Manufacturer_Desc"
	1    13775 1750
	0    1    1    0   
$EndComp
$Comp
L cpu-board:C0805 C15
U 1 1 58269073
P 14075 1950
F 0 "C15" V 14162 2043 64  0000 R TNN
F 1 "47pF" V 14256 2037 42  0000 R TNN
F 2 "AllModules:C0402_1" H 14075 1950 50  0001 C CNN
F 3 "" H 14075 1950 50  0001 C CNN
F 4 "CAPACITOR,47 PF,+/-5%,50V,0402" H 14075 1950 50  0001 C CNN "Description"
F 5 "10022623" H 14075 1950 50  0001 C CNN "Item Number"
F 6 "SAMSUNG_RMS1" H 14075 1950 50  0001 C CNN "Manufacturer"
F 7 "CL05C470JB5NNNC" H 14075 1950 50  0001 C CNN "Manufacturer_No"
F 8 "CAP CER 47PF 50V 5% NP0 0402" H 14075 1950 50  0001 C CNN "Manufacturer_Desc"
F 9 "KEMET_RMS1" H 14075 1950 50  0001 C CNN "Manufacturer2"
F 10 "C0402C470J5GACTU" H 14075 1950 50  0001 C CNN "Manufacturer_No2"
F 11 "CAP,CER,SMT,0402,5%,50V,47PF" H 14075 1950 50  0001 C CNN "Manufacturer_Desc2"
F 12 "MURATA MANUFACTURING CO., LTD." H 14075 1950 50  0001 C CNN "Manufacturer3"
F 13 "GRM1555C1H470JZ01D" H 14075 1950 50  0001 C CNN "Manufacturer_No3"
F 14 "MONOLITHIC CERAMIC CAPACITOR" H 14075 1950 50  0001 C CNN "Manufacturer_Desc3"
F 15 "KEMET_RMS1" H 14075 1950 50  0001 C CNN "Manufacturer4"
F 16 "C0402C470J5GAC" H 14075 1950 50  0001 C CNN "Manufacturer_No4"
F 17 "CAP,CER,SMT,0402,5%,50V,47PF" H 14075 1950 50  0001 C CNN "Manufacturer_Desc4"
F 18 "MURATA MANUFACTURING CO., LTD." H 14075 1950 50  0001 C CNN "Manufacturer5"
F 19 "GRM1555C1H470JA01D" H 14075 1950 50  0001 C CNN "Manufacturer_No5"
F 20 "CAP CER 47PF 50V 5% NP0 0402" H 14075 1950 50  0001 C CNN "Manufacturer_Desc5"
	1    14075 1950
	0    1    1    0   
$EndComp
$Comp
L cpu-board:C0805 C16
U 1 1 8F520983
P 14200 1525
F 0 "C16" V 14450 1432 64  0000 L BNN
F 1 "22pF" V 14356 1438 42  0000 L BNN
F 2 "AllModules:C0603_1" H 14200 1525 50  0001 C CNN
F 3 "" H 14200 1525 50  0001 C CNN
F 4 "CAPACITOR CERAMIC,22PF,+/-5%,50V,0603" H 14200 1525 50  0001 C CNN "Description"
F 5 "10022632" H 14200 1525 50  0001 C CNN "Item Number"
F 6 "SAMSUNG_RMS1" H 14200 1525 50  0001 C CNN "Manufacturer"
F 7 "CL10C220JB8NNNC" H 14200 1525 50  0001 C CNN "Manufacturer_No"
F 8 "MULTILAYER CERAMIC CAPACITOR" H 14200 1525 50  0001 C CNN "Manufacturer_Desc"
F 9 "YAGEO_RMS1" H 14200 1525 50  0001 C CNN "Manufacturer2"
F 10 "CC0603JRNPO9BN220" H 14200 1525 50  0001 C CNN "Manufacturer_No2"
F 11 "CAP CER 22PF 50V C0G 5% 0603" H 14200 1525 50  0001 C CNN "Manufacturer_Desc2"
F 12 "YAGEO_RMS1" H 14200 1525 50  0001 C CNN "Manufacturer3"
F 13 "223886715229" H 14200 1525 50  0001 C CNN "Manufacturer_No3"
F 14 "CAPACITOR, CERAMIC, MULTILAYER, 50 V, C0G, 0.000022 UF, SURFACE MOUNT, 0603" H 14200 1525 50  0001 C CNN "Manufacturer_Desc3"
	1    14200 1525
	0    -1   -1   0   
$EndComp
$Comp
L cpu-board:GND #U$051
U 1 1 773EFA15
P 14525 1750
F 0 "#U$051" H 14525 1750 50  0001 C CNN
F 1 "GND" H 14438 1663 59  0000 L BNN
F 2 "" H 14525 1750 50  0001 C CNN
F 3 "" H 14525 1750 50  0001 C CNN
	1    14525 1750
	0    -1   -1   0   
$EndComp
$Comp
L cpu-board:R0805 R2
U 1 1 986554BD
P 13300 1950
F 0 "R2" H 13225 1800 64  0000 L BNN
F 1 "1.5k" H 13225 1738 42  0000 L BNN
F 2 "AllModules:R0603_1" H 13300 1950 50  0001 C CNN
F 3 "" H 13300 1950 50  0001 C CNN
F 4 "RESISTOR 1.5K OHM, 0603, +/-5%" H 13300 1950 50  0001 C CNN "Description"
F 5 "10023187" H 13300 1950 50  0001 C CNN "Item Number"
F 6 "YAGEO_RMS1" H 13300 1950 50  0001 C CNN "Manufacturer"
F 7 "232270260152L" H 13300 1950 50  0001 C CNN "Manufacturer_No"
F 8 "RESISTOR, METAL GLAZE/THICK FILM, 0.1 W, 5 %, 100 PPM, 1500 OHM, SURFACE MOUNT, 0603" H 13300 1950 50  0001 C CNN "Manufacturer_Desc"
F 9 "YAGEO_RMS1" H 13300 1950 50  0001 C CNN "Manufacturer2"
F 10 "232270260152" H 13300 1950 50  0001 C CNN "Manufacturer_No2"
F 11 "RESISTOR, METAL GLAZE/THICK FILM, 0.1 W, 5 %, 100 PPM, 1500 OHM, SURFACE MOUNT, 0603" H 13300 1950 50  0001 C CNN "Manufacturer_Desc2"
F 12 "YAGEO_RMS1" H 13300 1950 50  0001 C CNN "Manufacturer3"
F 13 "RC0603JR-071K5L" H 13300 1950 50  0001 C CNN "Manufacturer_No3"
F 14 "RESISTOR, METAL GLAZE/THICK FILM, 0.1 W, 5 %, 100 PPM, 1500 OHM, SURFACE MOUNT, 0603" H 13300 1950 50  0001 C CNN "Manufacturer_Desc3"
F 15 "KOA SPEER" H 13300 1950 50  0001 C CNN "Manufacturer4"
F 16 "RK73B1JTTD152J" H 13300 1950 50  0001 C CNN "Manufacturer_No4"
F 17 "THICK FILM CHIP RESISTOR" H 13300 1950 50  0001 C CNN "Manufacturer_Desc4"
	1    13300 1950
	1    0    0    -1  
$EndComp
$Comp
L cpu-board:GND #U$052
U 1 1 065004B8
P 11275 5450
F 0 "#U$052" H 11275 5450 50  0001 C CNN
F 1 "GND" H 11188 5362 59  0000 L BNN
F 2 "" H 11275 5450 50  0001 C CNN
F 3 "" H 11275 5450 50  0001 C CNN
	1    11275 5450
	1    0    0    -1  
$EndComp
$Comp
L cpu-board:+5V #U$053
U 1 1 2725C90F
P 11275 1575
F 0 "#U$053" H 11275 1575 50  0001 C CNN
F 1 "+5V" H 11188 1488 59  0000 L BNN
F 2 "" H 11275 1575 50  0001 C CNN
F 3 "" H 11275 1575 50  0001 C CNN
	1    11275 1575
	-1   0    0    1   
$EndComp
$Comp
L cpu-board:GND #U$061
U 1 1 95A06B3D
P 11075 2250
F 0 "#U$061" H 11075 2250 50  0001 C CNN
F 1 "GND" H 10987 2162 59  0000 L BNN
F 2 "" H 11075 2250 50  0001 C CNN
F 3 "" H 11075 2250 50  0001 C CNN
	1    11075 2250
	0    1    1    0   
$EndComp
$Comp
L cpu-board:TL16C750IPM IC1
U 1 1 22F7723E
P 12200 3000
F 0 "IC1" H 12650 4625 59  0000 L BNN
F 1 "TL16C750IPM" H 12650 4538 42  0000 L BNN
F 2 "AllModules:TQFP64_1" H 12200 3000 50  0001 C CNN
F 3 "" H 12200 3000 50  0001 C CNN
F 4 "UART, LQFP64" H 12200 3000 50  0001 C CNN "Description"
F 5 "10022505" H 12200 3000 50  0001 C CNN "Item Number"
F 6 "TEXAS INSTRUMENTS_RMS1" H 12200 3000 50  0001 C CNN "Manufacturer"
F 7 "TL16C750IPM" H 12200 3000 50  0001 C CNN "Manufacturer_No"
F 8 "UART" H 12200 3000 50  0001 C CNN "Manufacturer_Desc"
	1    12200 3000
	1    0    0    -1  
$EndComp
$Comp
L cpu-board:RES_4R_BCN RS8
U 1 1 887C726F
P 13350 3200
F 0 "RS8" V 13425 3425 59  0000 L BNN
F 1 "6.8k" V 13338 3425 59  0000 L BNN
F 2 "AllModules:BCN16_1" H 13350 3200 50  0001 C CNN
F 3 "" H 13350 3200 50  0001 C CNN
F 4 "RESISTOR ARRAY, 6.8K OHM, +/-5%, 1206" H 13350 3200 50  0001 C CNN "Description"
F 5 "10023253" H 13350 3200 50  0001 C CNN "Item Number"
F 6 "BI TECHNOLOGIES CORPORATION" H 13350 3200 50  0001 C CNN "Manufacturer"
F 7 "BCN164AB682J7" H 13350 3200 50  0001 C CNN "Manufacturer_No"
F 8 "RESISTOR ARRAY" H 13350 3200 50  0001 C CNN "Manufacturer_Desc"
F 9 "YAGEO_RMS1" H 13350 3200 50  0001 C CNN "Manufacturer2"
F 10 "TC164-JR-076K8L" H 13350 3200 50  0001 C CNN "Manufacturer_No2"
F 11 "RESISTOR, NETWORK, FILM, ISOLATED, 0.0625 W, SURFACE MOUNT" H 13350 3200 50  0001 C CNN "Manufacturer_Desc2"
F 12 "YAGEO_RMS1" H 13350 3200 50  0001 C CNN "Manufacturer3"
F 13 "235003410682" H 13350 3200 50  0001 C CNN "Manufacturer_No3"
F 14 "RESISTOR, NETWORK, FILM, ISOLATED, SURFACE MOUNT" H 13350 3200 50  0001 C CNN "Manufacturer_Desc3"
F 15 "BOURNS_RMS1" H 13350 3200 50  0001 C CNN "Manufacturer4"
F 16 "CAY16-682J4LF" H 13350 3200 50  0001 C CNN "Manufacturer_No4"
F 17 "CHIP RESISTOR ARRAY" H 13350 3200 50  0001 C CNN "Manufacturer_Desc4"
F 18 "YAGEO_RMS1" H 13350 3200 50  0001 C CNN "Manufacturer5"
F 19 "235003410682L" H 13350 3200 50  0001 C CNN "Manufacturer_No5"
F 20 "RESISTOR, NETWORK, FILM, ISOLATED, 0.0625 W, SURFACE MOUNT" H 13350 3200 50  0001 C CNN "Manufacturer_Desc5"
	1    13350 3200
	0    1    -1   0   
$EndComp
$Comp
L cpu-board:+5V #U$066
U 1 1 32421C70
P 13200 2625
F 0 "#U$066" H 13200 2625 50  0001 C CNN
F 1 "+5V" H 13112 2538 59  0000 L BNN
F 2 "" H 13200 2625 50  0001 C CNN
F 3 "" H 13200 2625 50  0001 C CNN
	1    13200 2625
	-1   0    0    1   
$EndComp
$Comp
L cpu-board:LVC1G07DBVT IC8
U 1 1 45D38355
P 14250 6650
F 0 "IC8" H 14600 7112 64  0000 L BNN
F 1 "SN74LVC1G07DBVT" H 14575 7025 42  0000 L BNN
F 2 "AllModules:SOT23-5_1" H 14250 6650 50  0001 C CNN
F 3 "" H 14250 6650 50  0001 C CNN
F 4 "BUFFER WITH OPEN DRAIN OUTPUT,SOT23" H 14250 6650 50  0001 C CNN "Description"
F 5 "10022964" H 14250 6650 50  0001 C CNN "Item Number"
F 6 "TEXAS INSTRUMENTS_RMS1" H 14250 6650 50  0001 C CNN "Manufacturer"
F 7 "SN74LVC1G07DBVT" H 14250 6650 50  0001 C CNN "Manufacturer_No"
F 8 "SINGLE BUFFER DRIVER" H 14250 6650 50  0001 C CNN "Manufacturer_Desc"
F 9 "NXP SEMICONDUCTORS_RMS1" H 14250 6650 50  0001 C CNN "Manufacturer2"
F 10 "74LVC1G07GV,125" H 14250 6650 50  0001 C CNN "Manufacturer_No2"
F 11 "" H 14250 6650 50  0001 C CNN "Manufacturer_Desc2"
F 12 "NXP SEMICONDUCTORS_RMS1" H 14250 6650 50  0001 C CNN "Manufacturer3"
F 13 "74LVC1G07GV" H 14250 6650 50  0001 C CNN "Manufacturer_No3"
F 14 "BUFFER WITH OPEN DRAIN OUTPUT" H 14250 6650 50  0001 C CNN "Manufacturer_Desc3"
	1    14250 6650
	1    0    0    -1  
$EndComp
$Comp
L cpu-board:GND #U$068
U 1 1 BE4DCE1E
P 14400 4850
F 0 "#U$068" H 14400 4850 50  0001 C CNN
F 1 "GND" H 14300 4763 59  0000 L BNN
F 2 "" H 14400 4850 50  0001 C CNN
F 3 "" H 14400 4850 50  0001 C CNN
	1    14400 4850
	1    0    0    -1  
$EndComp
$Comp
L cpu-board:GND #U$069
U 1 1 82C3E2B3
P 14250 6050
F 0 "#U$069" H 14250 6050 50  0001 C CNN
F 1 "GND" H 14163 5963 59  0000 L BNN
F 2 "" H 14250 6050 50  0001 C CNN
F 3 "" H 14250 6050 50  0001 C CNN
	1    14250 6050
	-1   0    0    1   
$EndComp
$Comp
L cpu-board:R0805 R5
U 1 1 40871C63
P 13600 4000
F 0 "R5" V 13613 3925 64  0000 R TNN
F 1 "10k" V 13550 3925 42  0000 R TNN
F 2 "AllModules:R0603_1" H 13600 4000 50  0001 C CNN
F 3 "" H 13600 4000 50  0001 C CNN
F 4 "RESISTOR,10K OHM, 0.063W,+/-5%,0603" H 13600 4000 50  0001 C CNN "Description"
F 5 "10097266" H 13600 4000 50  0001 C CNN "Item Number"
F 6 "YAGEO_RMS1" H 13600 4000 50  0001 C CNN "Manufacturer"
F 7 "232270260103L" H 13600 4000 50  0001 C CNN "Manufacturer_No"
F 8 "RESISTOR, METAL GLAZE/THICK FILM, 0.1 W, 5 %, 100 PPM, 10000 OHM, SURFACE MOUNT, 0603" H 13600 4000 50  0001 C CNN "Manufacturer_Desc"
F 9 "YAGEO_RMS1" H 13600 4000 50  0001 C CNN "Manufacturer2"
F 10 "232270260103" H 13600 4000 50  0001 C CNN "Manufacturer_No2"
F 11 "RESISTOR, METAL GLAZE/THICK FILM, 0.1 W, 5 %, 100 PPM, 10000 OHM, SURFACE MOUNT, 0603" H 13600 4000 50  0001 C CNN "Manufacturer_Desc2"
F 12 "VISHAY_RMS1" H 13600 4000 50  0001 C CNN "Manufacturer3"
F 13 "CRCW060310K0JNEA" H 13600 4000 50  0001 C CNN "Manufacturer_No3"
F 14 "THICK FILM RECTANGULAR CHIP RESISTOR" H 13600 4000 50  0001 C CNN "Manufacturer_Desc3"
F 15 "ASJ" H 13600 4000 50  0001 C CNN "Manufacturer4"
F 16 "CR16-103JL" H 13600 4000 50  0001 C CNN "Manufacturer_No4"
F 17 "THICK FILM CHIP RESISTOR" H 13600 4000 50  0001 C CNN "Manufacturer_Desc4"
F 18 "YAGEO_RMS1" H 13600 4000 50  0001 C CNN "Manufacturer5"
F 19 "RC0603JR-0710KL" H 13600 4000 50  0001 C CNN "Manufacturer_No5"
F 20 "RESISTOR, METAL GLAZE/THICK FILM, 0.1 W, 5 %, 100 PPM, 10000 OHM, SURFACE MOUNT, 0603" H 13600 4000 50  0001 C CNN "Manufacturer_Desc5"
	1    13600 4000
	0    -1   -1   0   
$EndComp
$Comp
L cpu-board:R0805 R6
U 1 1 91847459
P 15275 6350
F 0 "R6" V 15300 6200 64  0000 R TNN
F 1 "10k" V 15225 6200 42  0000 R TNN
F 2 "AllModules:R0603_1" H 15275 6350 50  0001 C CNN
F 3 "" H 15275 6350 50  0001 C CNN
F 4 "RESISTOR,10K OHM, 0.063W,+/-5%,0603" H 15275 6350 50  0001 C CNN "Description"
F 5 "10097266" H 15275 6350 50  0001 C CNN "Item Number"
F 6 "YAGEO_RMS1" H 15275 6350 50  0001 C CNN "Manufacturer"
F 7 "232270260103L" H 15275 6350 50  0001 C CNN "Manufacturer_No"
F 8 "RESISTOR, METAL GLAZE/THICK FILM, 0.1 W, 5 %, 100 PPM, 10000 OHM, SURFACE MOUNT, 0603" H 15275 6350 50  0001 C CNN "Manufacturer_Desc"
F 9 "YAGEO_RMS1" H 15275 6350 50  0001 C CNN "Manufacturer2"
F 10 "232270260103" H 15275 6350 50  0001 C CNN "Manufacturer_No2"
F 11 "RESISTOR, METAL GLAZE/THICK FILM, 0.1 W, 5 %, 100 PPM, 10000 OHM, SURFACE MOUNT, 0603" H 15275 6350 50  0001 C CNN "Manufacturer_Desc2"
F 12 "VISHAY_RMS1" H 15275 6350 50  0001 C CNN "Manufacturer3"
F 13 "CRCW060310K0JNEA" H 15275 6350 50  0001 C CNN "Manufacturer_No3"
F 14 "THICK FILM RECTANGULAR CHIP RESISTOR" H 15275 6350 50  0001 C CNN "Manufacturer_Desc3"
F 15 "ASJ" H 15275 6350 50  0001 C CNN "Manufacturer4"
F 16 "CR16-103JL" H 15275 6350 50  0001 C CNN "Manufacturer_No4"
F 17 "THICK FILM CHIP RESISTOR" H 15275 6350 50  0001 C CNN "Manufacturer_Desc4"
F 18 "YAGEO_RMS1" H 15275 6350 50  0001 C CNN "Manufacturer5"
F 19 "RC0603JR-0710KL" H 15275 6350 50  0001 C CNN "Manufacturer_No5"
F 20 "RESISTOR, METAL GLAZE/THICK FILM, 0.1 W, 5 %, 100 PPM, 10000 OHM, SURFACE MOUNT, 0603" H 15275 6350 50  0001 C CNN "Manufacturer_Desc5"
	1    15275 6350
	0    -1   -1   0   
$EndComp
$Comp
L cpu-board:+3,3V #U$072
U 1 1 12B0E286
P 14300 5325
F 0 "#U$072" H 14300 5325 50  0001 C CNN
F 1 "+3,3V" H 14188 5538 59  0000 L BNN
F 2 "" H 14300 5325 50  0001 C CNN
F 3 "" H 14300 5325 50  0001 C CNN
	1    14300 5325
	1    0    0    -1  
$EndComp
$Comp
L cpu-board:+5V #U$0116
U 1 1 3927A1D0
P 13600 3675
F 0 "#U$0116" H 13600 3675 50  0001 C CNN
F 1 "+5V" H 13650 3650 59  0000 R TNN
F 2 "" H 13600 3675 50  0001 C CNN
F 3 "" H 13600 3675 50  0001 C CNN
	1    13600 3675
	-1   0    0    1   
$EndComp
$Comp
L cpu-board:+5V #U$0124
U 1 1 3DC1F79A
P 14550 5125
F 0 "#U$0124" H 14550 5125 50  0001 C CNN
F 1 "+5V" H 14625 5100 59  0000 R TNN
F 2 "" H 14550 5125 50  0001 C CNN
F 3 "" H 14550 5125 50  0001 C CNN
	1    14550 5125
	-1   0    0    1   
$EndComp
$Comp
L cpu-board:C0805 C140
U 1 1 63F00A8C
P 3150 1725
F 0 "C140" V 3000 1606 64  0000 L BNN
F 1 "100nF" V 3069 1625 42  0000 L BNN
F 2 "AllModules:C0402_1" H 3150 1725 50  0001 C CNN
F 3 "" H 3150 1725 50  0001 C CNN
	1    3150 1725
	0    1    1    0   
$EndComp
$Comp
L cpu-board:GND #U$054
U 1 1 7B689AD0
P 2875 9600
F 0 "#U$054" H 2875 9600 50  0001 C CNN
F 1 "GND" H 2800 9525 59  0000 L BNN
F 2 "" H 2875 9600 50  0001 C CNN
F 3 "" H 2875 9600 50  0001 C CNN
	1    2875 9600
	1    0    0    -1  
$EndComp
$Comp
L cpu-board:GND #U$0134
U 1 1 8BC7A6EC
P 4625 10150
F 0 "#U$0134" H 4625 10150 50  0001 C CNN
F 1 "GND" H 4550 10075 59  0000 L BNN
F 2 "" H 4625 10150 50  0001 C CNN
F 3 "" H 4625 10150 50  0001 C CNN
	1    4625 10150
	1    0    0    -1  
$EndComp
$Comp
L cpu-board:GND #U$0106
U 1 1 4085D8D9
P 7800 10300
F 0 "#U$0106" H 7800 10300 50  0001 C CNN
F 1 "GND" H 7725 10225 59  0000 L BNN
F 2 "" H 7800 10300 50  0001 C CNN
F 3 "" H 7800 10300 50  0001 C CNN
	1    7800 10300
	1    0    0    -1  
$EndComp
$Comp
L cpu-board:+3,3V #U$0155
U 1 1 696DB67A
P 6150 9000
F 0 "#U$0155" H 6150 9000 50  0001 C CNN
F 1 "+3,3V" V 6237 9137 59  0000 L BNN
F 2 "" H 6150 9000 50  0001 C CNN
F 3 "" H 6150 9000 50  0001 C CNN
	1    6150 9000
	0    -1   -1   0   
$EndComp
$Comp
L cpu-board:C0805 C4
U 1 1 A60240AA
P 6900 6800
F 0 "C4" V 7125 6719 64  0000 L BNN
F 1 "100nF" V 7031 6676 42  0000 L BNN
F 2 "AllModules:C0402_1" H 6900 6800 50  0001 C CNN
F 3 "" H 6900 6800 50  0001 C CNN
F 4 "CAPACITOR,100NF,16V,+/-10%,X7R,0402" H 6900 6800 50  0001 C CNN "Description"
F 5 "10022607" H 6900 6800 50  0001 C CNN "Item Number"
F 6 "MURATA" H 6900 6800 50  0001 C CNN "Manufacturer"
F 7 "GRM155R71C104JA88J" H 6900 6800 50  0001 C CNN "Manufacturer_No"
F 8 "CAPACITOR, CERAMIC, MULTILAYER, 16V, X7R, 0.1UF, 0402" H 6900 6800 50  0001 C CNN "Manufacturer_Desc"
F 9 "YAGEO_RMS1" H 6900 6800 50  0001 C CNN "Manufacturer2"
F 10 "CC0402KRX7R7BB104" H 6900 6800 50  0001 C CNN "Manufacturer_No2"
F 11 "CAP CER 0.1uF 16V X7R 10% 0402" H 6900 6800 50  0001 C CNN "Manufacturer_Desc2"
F 12 "YAGEO_RMS1" H 6900 6800 50  0001 C CNN "Manufacturer3"
F 13 "223878715649" H 6900 6800 50  0001 C CNN "Manufacturer_No3"
F 14 "CAPACITOR, CERAMIC, MULTILAYER, 16 V, X7R, 0.1 UF, SURFACE MOUNT, 0402" H 6900 6800 50  0001 C CNN "Manufacturer_Desc3"
F 15 "MURATA MANUFACTURING CO., LTD." H 6900 6800 50  0001 C CNN "Manufacturer4"
F 16 "GRM155R71C104KA88D" H 6900 6800 50  0001 C CNN "Manufacturer_No4"
F 17 "MONOLITHIC CERAMIC CAPACITOR" H 6900 6800 50  0001 C CNN "Manufacturer_Desc4"
	1    6900 6800
	0    -1   -1   0   
$EndComp
$Comp
L cpu-board:+3,3V #U$077
U 1 1 9A1B0C17
P 7300 6700
F 0 "#U$077" H 7300 6700 50  0001 C CNN
F 1 "+3,3V" H 7187 6925 59  0000 L BNN
F 2 "" H 7300 6700 50  0001 C CNN
F 3 "" H 7300 6700 50  0001 C CNN
	1    7300 6700
	1    0    0    -1  
$EndComp
$Comp
L cpu-board:GND #U$085
U 1 1 B088C125
P 6600 6500
F 0 "#U$085" H 6600 6500 50  0001 C CNN
F 1 "GND" H 6513 6413 59  0000 L BNN
F 2 "" H 6600 6500 50  0001 C CNN
F 3 "" H 6600 6500 50  0001 C CNN
	1    6600 6500
	-1   0    0    1   
$EndComp
$Comp
L cpu-board:+5V #U$0293
U 1 1 EE6706A4
P 10925 6400
F 0 "#U$0293" H 10925 6400 50  0001 C CNN
F 1 "+5V" H 10838 6312 59  0000 L BNN
F 2 "" H 10925 6400 50  0001 C CNN
F 3 "" H 10925 6400 50  0001 C CNN
	1    10925 6400
	-1   0    0    1   
$EndComp
$Comp
L cpu-board:GND #U$0294
U 1 1 6EBC0E60
P 10525 6425
F 0 "#U$0294" H 10525 6425 50  0001 C CNN
F 1 "GND" H 10438 6337 59  0000 L BNN
F 2 "" H 10525 6425 50  0001 C CNN
F 3 "" H 10525 6425 50  0001 C CNN
	1    10525 6425
	-1   0    0    1   
$EndComp
$Comp
L cpu-board:C0805 C24
U 1 1 7752927D
P 10725 6725
F 0 "C24" V 10887 6819 64  0000 R TNN
F 1 "100nF" V 10818 6813 42  0000 R TNN
F 2 "AllModules:C0402_1" H 10725 6725 50  0001 C CNN
F 3 "" H 10725 6725 50  0001 C CNN
F 4 "CAPACITOR,100NF,16V,+/-10%,X7R,0402" H 10725 6725 50  0001 C CNN "Description"
F 5 "10022607" H 10725 6725 50  0001 C CNN "Item Number"
F 6 "MURATA" H 10725 6725 50  0001 C CNN "Manufacturer"
F 7 "GRM155R71C104JA88J" H 10725 6725 50  0001 C CNN "Manufacturer_No"
F 8 "CAPACITOR, CERAMIC, MULTILAYER, 16V, X7R, 0.1UF, 0402" H 10725 6725 50  0001 C CNN "Manufacturer_Desc"
F 9 "YAGEO_RMS1" H 10725 6725 50  0001 C CNN "Manufacturer2"
F 10 "CC0402KRX7R7BB104" H 10725 6725 50  0001 C CNN "Manufacturer_No2"
F 11 "CAP CER 0.1uF 16V X7R 10% 0402" H 10725 6725 50  0001 C CNN "Manufacturer_Desc2"
F 12 "YAGEO_RMS1" H 10725 6725 50  0001 C CNN "Manufacturer3"
F 13 "223878715649" H 10725 6725 50  0001 C CNN "Manufacturer_No3"
F 14 "CAPACITOR, CERAMIC, MULTILAYER, 16 V, X7R, 0.1 UF, SURFACE MOUNT, 0402" H 10725 6725 50  0001 C CNN "Manufacturer_Desc3"
F 15 "MURATA MANUFACTURING CO., LTD." H 10725 6725 50  0001 C CNN "Manufacturer4"
F 16 "GRM155R71C104KA88D" H 10725 6725 50  0001 C CNN "Manufacturer_No4"
F 17 "MONOLITHIC CERAMIC CAPACITOR" H 10725 6725 50  0001 C CNN "Manufacturer_Desc4"
	1    10725 6725
	0    -1   -1   0   
$EndComp
$Comp
L cpu-board:+5V #U$0325
U 1 1 444B25E3
P 2150 1250
F 0 "#U$0325" H 2150 1250 50  0001 C CNN
F 1 "+5V" H 2062 1175 59  0000 L BNN
F 2 "" H 2150 1250 50  0001 C CNN
F 3 "" H 2150 1250 50  0001 C CNN
	1    2150 1250
	-1   0    0    1   
$EndComp
$Comp
L cpu-board:GND #U$0326
U 1 1 E28CED9F
P 1850 1250
F 0 "#U$0326" H 1850 1250 50  0001 C CNN
F 1 "GND" H 1762 1175 59  0000 L BNN
F 2 "" H 1850 1250 50  0001 C CNN
F 3 "" H 1850 1250 50  0001 C CNN
	1    1850 1250
	-1   0    0    1   
$EndComp
$Comp
L cpu-board:C0603 C5
U 1 1 8E04CE4C
P 3600 6900
F 0 "C5" V 3825 6857 64  0000 L BNN
F 1 "100nF" V 3731 6788 42  0000 L BNN
F 2 "AllModules:C0402_1" H 3600 6900 50  0001 C CNN
F 3 "" H 3600 6900 50  0001 C CNN
F 4 "CAPACITOR,100NF,16V,+/-10%,X7R,0402" H 3600 6900 50  0001 C CNN "Description"
F 5 "10022607" H 3600 6900 50  0001 C CNN "Item Number"
F 6 "MURATA" H 3600 6900 50  0001 C CNN "Manufacturer"
F 7 "GRM155R71C104JA88J" H 3600 6900 50  0001 C CNN "Manufacturer_No"
F 8 "CAPACITOR, CERAMIC, MULTILAYER, 16V, X7R, 0.1UF, 0402" H 3600 6900 50  0001 C CNN "Manufacturer_Desc"
F 9 "YAGEO_RMS1" H 3600 6900 50  0001 C CNN "Manufacturer2"
F 10 "CC0402KRX7R7BB104" H 3600 6900 50  0001 C CNN "Manufacturer_No2"
F 11 "CAP CER 0.1uF 16V X7R 10% 0402" H 3600 6900 50  0001 C CNN "Manufacturer_Desc2"
F 12 "YAGEO_RMS1" H 3600 6900 50  0001 C CNN "Manufacturer3"
F 13 "223878715649" H 3600 6900 50  0001 C CNN "Manufacturer_No3"
F 14 "CAPACITOR, CERAMIC, MULTILAYER, 16 V, X7R, 0.1 UF, SURFACE MOUNT, 0402" H 3600 6900 50  0001 C CNN "Manufacturer_Desc3"
F 15 "MURATA MANUFACTURING CO., LTD." H 3600 6900 50  0001 C CNN "Manufacturer4"
F 16 "GRM155R71C104KA88D" H 3600 6900 50  0001 C CNN "Manufacturer_No4"
F 17 "MONOLITHIC CERAMIC CAPACITOR" H 3600 6900 50  0001 C CNN "Manufacturer_Desc4"
	1    3600 6900
	0    -1   -1   0   
$EndComp
$Comp
L cpu-board:C0603 C20
U 1 1 D1510C23
P 4575 6900
F 0 "C20" V 4800 6844 64  0000 L BNN
F 1 "100nF" V 4706 6826 42  0000 L BNN
F 2 "AllModules:C0402_1" H 4575 6900 50  0001 C CNN
F 3 "" H 4575 6900 50  0001 C CNN
F 4 "CAPACITOR,100NF,16V,+/-10%,X7R,0402" H 4575 6900 50  0001 C CNN "Description"
F 5 "10022607" H 4575 6900 50  0001 C CNN "Item Number"
F 6 "MURATA" H 4575 6900 50  0001 C CNN "Manufacturer"
F 7 "GRM155R71C104JA88J" H 4575 6900 50  0001 C CNN "Manufacturer_No"
F 8 "CAPACITOR, CERAMIC, MULTILAYER, 16V, X7R, 0.1UF, 0402" H 4575 6900 50  0001 C CNN "Manufacturer_Desc"
F 9 "YAGEO_RMS1" H 4575 6900 50  0001 C CNN "Manufacturer2"
F 10 "CC0402KRX7R7BB104" H 4575 6900 50  0001 C CNN "Manufacturer_No2"
F 11 "CAP CER 0.1uF 16V X7R 10% 0402" H 4575 6900 50  0001 C CNN "Manufacturer_Desc2"
F 12 "YAGEO_RMS1" H 4575 6900 50  0001 C CNN "Manufacturer3"
F 13 "223878715649" H 4575 6900 50  0001 C CNN "Manufacturer_No3"
F 14 "CAPACITOR, CERAMIC, MULTILAYER, 16 V, X7R, 0.1 UF, SURFACE MOUNT, 0402" H 4575 6900 50  0001 C CNN "Manufacturer_Desc3"
F 15 "MURATA MANUFACTURING CO., LTD." H 4575 6900 50  0001 C CNN "Manufacturer4"
F 16 "GRM155R71C104KA88D" H 4575 6900 50  0001 C CNN "Manufacturer_No4"
F 17 "MONOLITHIC CERAMIC CAPACITOR" H 4575 6900 50  0001 C CNN "Manufacturer_Desc4"
	1    4575 6900
	0    -1   -1   0   
$EndComp
$Comp
L cpu-board:GND #U$032
U 1 1 F4AAF165
P 3725 6600
F 0 "#U$032" H 3725 6600 50  0001 C CNN
F 1 "GND" H 3650 6525 59  0000 L BNN
F 2 "" H 3725 6600 50  0001 C CNN
F 3 "" H 3725 6600 50  0001 C CNN
	1    3725 6600
	-1   0    0    1   
$EndComp
$Comp
L cpu-board:JUMP_0U JP6
U 1 1 A21E5090
P 14550 5450
F 0 "JP6" H 14475 5525 51  0000 L BNN
F 1 "JUMP_0U" H 14000 5525 51  0001 L BNN
F 2 "AllModules:R0603_1" H 14550 5450 50  0001 C CNN
F 3 "" H 14550 5450 50  0001 C CNN
F 4 "RESISTANCE, 0 OHM,0603" H 14550 5450 50  0001 C CNN "Description"
F 5 "10023185" H 14550 5450 50  0001 C CNN "Item Number"
F 6 "YAGEO_RMS1" H 14550 5450 50  0001 C CNN "Manufacturer"
F 7 "RC0603JR-070RL" H 14550 5450 50  0001 C CNN "Manufacturer_No"
F 8 "RES 0.0 OHM 1/10W 0603 SMD" H 14550 5450 50  0001 C CNN "Manufacturer_Desc"
F 9 "YAGEO_RMS1" H 14550 5450 50  0001 C CNN "Manufacturer2"
F 10 "232270296001" H 14550 5450 50  0001 C CNN "Manufacturer_No2"
F 11 "JUMPER, METAL GLAZE/THICK FILM, 0.1 W, 0 OHM, SURFACE MOUNT, 0603" H 14550 5450 50  0001 C CNN "Manufacturer_Desc2"
F 12 "YAGEO_RMS1" H 14550 5450 50  0001 C CNN "Manufacturer3"
F 13 "232270296001L" H 14550 5450 50  0001 C CNN "Manufacturer_No3"
F 14 "JUMPER, METAL GLAZE/THICK FILM, 0.1 W, 0 OHM, SURFACE MOUNT, 0603" H 14550 5450 50  0001 C CNN "Manufacturer_Desc3"
F 15 "ASJ" H 14550 5450 50  0001 C CNN "Manufacturer4"
F 16 "CR16000ZL" H 14550 5450 50  0001 C CNN "Manufacturer_No4"
F 17 "THICK FILM CHIP RESISTOR" H 14550 5450 50  0001 C CNN "Manufacturer_Desc4"
F 18 "KAMAYA                          (049580)" H 14550 5450 50  0001 C CNN "Manufacturer5"
F 19 "RMC1/16JPTP" H 14550 5450 50  0001 C CNN "Manufacturer_No5"
F 20 "JUMPER" H 14550 5450 50  0001 C CNN "Manufacturer_Desc5"
	1    14550 5450
	0    -1   -1   0   
$EndComp
$Comp
L cpu-board:K9F4G08U0M-PCB000 IC13
U 1 1 B5257A37
P 6400 7900
F 0 "IC13" H 7350 8625 64  0000 L BNN
F 1 "K9F1G08UOA-PCB0" H 7350 8537 42  0000 L BNN
F 2 "AllModules:TSOP48-ENT9.965_1" H 6400 7900 50  0001 C CNN
F 3 "" H 6400 7900 50  0001 C CNN
F 4 "MEMORY NAND FLASH, 1G, 2.7 TO 3.6V, BUS X 8,TSOP" H 6400 7900 50  0001 C CNN "Description"
F 5 "10023251" H 6400 7900 50  0001 C CNN "Item Number"
F 6 "SAMSUNG_RMS1" H 6400 7900 50  0001 C CNN "Manufacturer"
F 7 "K9F1G08U0C-PIB0T" H 6400 7900 50  0001 C CNN "Manufacturer_No"
F 8 "" H 6400 7900 50  0001 C CNN "Manufacturer_Desc"
F 9 "SAMSUNG_RMS1" H 6400 7900 50  0001 C CNN "Manufacturer2"
F 10 "K9F1G08U0C-PCB0T00" H 6400 7900 50  0001 C CNN "Manufacturer_No2"
F 11 "" H 6400 7900 50  0001 C CNN "Manufacturer_Desc2"
F 12 "SAMSUNG_RMS1" H 6400 7900 50  0001 C CNN "Manufacturer3"
F 13 "K9F1G08U0C-PCB0T" H 6400 7900 50  0001 C CNN "Manufacturer_No3"
F 14 "" H 6400 7900 50  0001 C CNN "Manufacturer_Desc3"
F 15 "NUMONYX_RMS1" H 6400 7900 50  0001 C CNN "Manufacturer4"
F 16 "NAND01GW3B2BN6F" H 6400 7900 50  0001 C CNN "Manufacturer_No4"
F 17 "" H 6400 7900 50  0001 C CNN "Manufacturer_Desc4"
	1    6400 7900
	1    0    0    -1  
$EndComp
$Comp
L cpu-board:74HCT1G04GW IC39
U 1 1 6BD6C1A1
P 1650 2175
F 0 "IC39" H 2238 2925 67  0000 L BNN
F 1 "74HCT04GW" H 2238 2850 42  0000 L BNN
F 2 "AllModules:SC70-5_1" H 1650 2175 50  0001 C CNN
F 3 "" H 1650 2175 50  0001 C CNN
F 4 "IC, INVERTER,SOT353" H 1650 2175 50  0001 C CNN "Description"
F 5 "10023118" H 1650 2175 50  0001 C CNN "Item Number"
F 6 "NXP SEMICONDUCTORS_RMS1" H 1650 2175 50  0001 C CNN "Manufacturer"
F 7 "74HCT1G04GW,125" H 1650 2175 50  0001 C CNN "Manufacturer_No"
F 8 "" H 1650 2175 50  0001 C CNN "Manufacturer_Desc"
F 9 "NXP SEMICONDUCTORS_RMS1" H 1650 2175 50  0001 C CNN "Manufacturer2"
F 10 "74HCT1G04GW" H 1650 2175 50  0001 C CNN "Manufacturer_No2"
F 11 "INVERTER" H 1650 2175 50  0001 C CNN "Manufacturer_Desc2"
	1    1650 2175
	1    0    0    -1  
$EndComp
$Comp
L cpu-board:GND #U$0433
U 1 1 69397AC8
P 3000 1250
F 0 "#U$0433" H 3000 1250 50  0001 C CNN
F 1 "GND" H 2925 1188 59  0000 L BNN
F 2 "" H 3000 1250 50  0001 C CNN
F 3 "" H 3000 1250 50  0001 C CNN
	1    3000 1250
	-1   0    0    1   
$EndComp
$Comp
L cpu-board:+5V #U$0434
U 1 1 EB37BF0C
P 3300 1225
F 0 "#U$0434" H 3300 1225 50  0001 C CNN
F 1 "+5V" H 3213 1163 59  0000 L BNN
F 2 "" H 3300 1225 50  0001 C CNN
F 3 "" H 3300 1225 50  0001 C CNN
	1    3300 1225
	-1   0    0    1   
$EndComp
$Comp
L cpu-board:+5V #U$0437
U 1 1 70A3BE0B
P 2200 7400
F 0 "#U$0437" H 2200 7400 50  0001 C CNN
F 1 "+5V" H 2125 7325 59  0000 L BNN
F 2 "" H 2200 7400 50  0001 C CNN
F 3 "" H 2200 7400 50  0001 C CNN
	1    2200 7400
	-1   0    0    1   
$EndComp
$Comp
L cpu-board:GND #U$0438
U 1 1 AC44E056
P 1900 7400
F 0 "#U$0438" H 1900 7400 50  0001 C CNN
F 1 "GND" H 1825 7338 59  0000 L BNN
F 2 "" H 1900 7400 50  0001 C CNN
F 3 "" H 1900 7400 50  0001 C CNN
	1    1900 7400
	-1   0    0    1   
$EndComp
$Comp
L cpu-board:+5V #U$08
U 1 1 59F585D1
P 8875 1125
F 0 "#U$08" H 8875 1125 50  0001 C CNN
F 1 "+5V" H 8800 1050 59  0000 L BNN
F 2 "" H 8875 1125 50  0001 C CNN
F 3 "" H 8875 1125 50  0001 C CNN
	1    8875 1125
	-1   0    0    1   
$EndComp
$Comp
L cpu-board:C0805 C30
U 1 1 107458DA
P 8600 1300
F 0 "C30" V 8763 1356 64  0000 R TNN
F 1 "100nF" V 8694 1350 42  0000 R TNN
F 2 "AllModules:C0402_1" H 8600 1300 50  0001 C CNN
F 3 "" H 8600 1300 50  0001 C CNN
F 4 "CAPACITOR,100NF,16V,+/-10%,X7R,0402" H 8600 1300 50  0001 C CNN "Description"
F 5 "10022607" H 8600 1300 50  0001 C CNN "Item Number"
F 6 "MURATA" H 8600 1300 50  0001 C CNN "Manufacturer"
F 7 "GRM155R71C104JA88J" H 8600 1300 50  0001 C CNN "Manufacturer_No"
F 8 "CAPACITOR, CERAMIC, MULTILAYER, 16V, X7R, 0.1UF, 0402" H 8600 1300 50  0001 C CNN "Manufacturer_Desc"
F 9 "YAGEO_RMS1" H 8600 1300 50  0001 C CNN "Manufacturer2"
F 10 "CC0402KRX7R7BB104" H 8600 1300 50  0001 C CNN "Manufacturer_No2"
F 11 "CAP CER 0.1uF 16V X7R 10% 0402" H 8600 1300 50  0001 C CNN "Manufacturer_Desc2"
F 12 "YAGEO_RMS1" H 8600 1300 50  0001 C CNN "Manufacturer3"
F 13 "223878715649" H 8600 1300 50  0001 C CNN "Manufacturer_No3"
F 14 "CAPACITOR, CERAMIC, MULTILAYER, 16 V, X7R, 0.1 UF, SURFACE MOUNT, 0402" H 8600 1300 50  0001 C CNN "Manufacturer_Desc3"
F 15 "MURATA MANUFACTURING CO., LTD." H 8600 1300 50  0001 C CNN "Manufacturer4"
F 16 "GRM155R71C104KA88D" H 8600 1300 50  0001 C CNN "Manufacturer_No4"
F 17 "MONOLITHIC CERAMIC CAPACITOR" H 8600 1300 50  0001 C CNN "Manufacturer_Desc4"
	1    8600 1300
	0    -1   -1   0   
$EndComp
$Comp
L cpu-board:+5V #U$09
U 1 1 9E0009A5
P 8675 5050
F 0 "#U$09" H 8675 5050 50  0001 C CNN
F 1 "+5V" H 8600 4962 59  0000 L BNN
F 2 "" H 8675 5050 50  0001 C CNN
F 3 "" H 8675 5050 50  0001 C CNN
	1    8675 5050
	1    0    0    -1  
$EndComp
$Comp
L cpu-board:GND #U$027
U 1 1 88B45EA1
P 8275 1125
F 0 "#U$027" H 8275 1125 50  0001 C CNN
F 1 "GND" H 8200 1062 59  0000 L BNN
F 2 "" H 8275 1125 50  0001 C CNN
F 3 "" H 8275 1125 50  0001 C CNN
	1    8275 1125
	-1   0    0    1   
$EndComp
$Comp
L cpu-board:29F800 IC7
U 1 1 270F9871
P 8575 3125
F 0 "IC7" H 8975 4725 64  0000 L BNN
F 1 "29F400-70EC" H 8975 4650 42  0000 L BNN
F 2 "AllModules:TSOP48-ENT9.965_1" H 8575 3125 50  0001 C CNN
F 3 "" H 8575 3125 50  0001 C CNN
F 4 "IC, FLASH MEMORY,TSOP48" H 8575 3125 50  0001 C CNN "Description"
F 5 "10022961" H 8575 3125 50  0001 C CNN "Item Number"
F 6 "Macronix" H 8575 3125 50  0001 C CNN "Manufacturer"
F 7 "MX29F400CBTI-70GTR" H 8575 3125 50  0001 C CNN "Manufacturer_No"
F 8 "FLASH MEMORY 5V" H 8575 3125 50  0001 C CNN "Manufacturer_Desc"
F 9 "Macronix" H 8575 3125 50  0001 C CNN "Manufacturer2"
F 10 "MX29F400CBTI-70G" H 8575 3125 50  0001 C CNN "Manufacturer_No2"
F 11 "FLASH MEMORY 5V" H 8575 3125 50  0001 C CNN "Manufacturer_Desc2"
F 12 "STMICROELECTRONICS" H 8575 3125 50  0001 C CNN "Manufacturer3"
F 13 "M29F400BB-70N6F" H 8575 3125 50  0001 C CNN "Manufacturer_No3"
F 14 "FLASH MEMORY" H 8575 3125 50  0001 C CNN "Manufacturer_Desc3"
F 15 "SPANSION LLC" H 8575 3125 50  0001 C CNN "Manufacturer4"
F 16 "AM29F400BB-70EF" H 8575 3125 50  0001 C CNN "Manufacturer_No4"
F 17 "CMOS 5 VOLT BOOT SECTOR FLASH MEMORY" H 8575 3125 50  0001 C CNN "Manufacturer_Desc4"
F 18 "STMICROELECTRONICS" H 8575 3125 50  0001 C CNN "Manufacturer5"
F 19 "M29F400BB-70N6E" H 8575 3125 50  0001 C CNN "Manufacturer_No5"
F 20 "FLASH MEMORY" H 8575 3125 50  0001 C CNN "Manufacturer_Desc5"
F 21 "SPANSION LLC" H 8575 3125 50  0001 C CNN "Manufacturer6"
F 22 "AM29F400BB-70EK" H 8575 3125 50  0001 C CNN "Manufacturer_No6"
F 23 "CMOS 5V BOOT SECTOR FLASH MEMORY" H 8575 3125 50  0001 C CNN "Manufacturer_Desc6"
	1    8575 3125
	1    0    0    -1  
$EndComp
Wire Notes Line
	8187 10932 8187 6232
Wire Notes Line
	8187 6232 1012 6232
Wire Notes Line
	1012 6232 1012 10932
Wire Notes Line
	1012 10932 8187 10932
Wire Notes Line
	1000 5782 6787 5782
Wire Notes Line
	6787 744  1000 744 
Wire Notes Line
	1000 744  1000 5782
Wire Notes Line
	6787 5782 6787 744 
Wire Notes Line
	10500 738  16150 738 
Wire Notes Line
	16150 738  16150 7163
Wire Notes Line
	16150 7163 13075 7163
Wire Notes Line
	13075 7163 13075 5800
Wire Notes Line
	13075 5800 10500 5800
Wire Notes Line
	10500 5800 10500 738 
Wire Notes Line
	14675 4988 16125 4988
Wire Notes Line
	16125 4988 16125 5825
Wire Notes Line
	16125 5825 14675 5825
Wire Notes Line
	14675 5825 14675 4988
Wire Notes Line
	6050 3150 6075 3175
Wire Notes Line
	6075 3175 6075 3225
Wire Notes Line
	6075 3225 6100 3250
Wire Notes Line
	6100 3250 6075 3275
Wire Notes Line
	6075 3275 6075 3313
Wire Notes Line
	6075 3313 6050 3338
Wire Notes Line
	8531 5957 11868 5957
Wire Notes Line
	11868 5957 11868 8132
Wire Notes Line
	11868 8132 8531 8132
Wire Notes Line
	8531 8132 8531 5957
Wire Notes Line
	9350 7100 9337 7100
Wire Notes Line
	9337 7100 9312 7125
Wire Notes Line
	9312 7125 9312 7463
Wire Notes Line
	9312 7463 9287 7488
Wire Notes Line
	9287 7488 9287 7500
Wire Notes Line
	9287 7500 9312 7525
Wire Notes Line
	9312 7525 9312 7863
Wire Notes Line
	9312 7863 9350 7900
Wire Notes Line
	7329 744  10445 742 
Wire Notes Line
	7329 744  7322 5796
Wire Notes Line
	7322 5796 10447 5796
Wire Notes Line
	10447 5796 10445 742 
Text Notes 1112 6444 0    56   ~ 0
MONITORING MEMORY
Text Notes 1075 875  0    56   ~ 0
16 PIN PORT OUT
Text Notes 10562 875  0    56   ~ 0
UART FONCTION
Text Notes 14712 5150 0    56   ~ 0
SJ1 = on, SJ2 = off,
Text Notes 14712 5288 0    56   ~ 0
if TX_RAP_AL between 0V...3.3V
Text Notes 14700 5538 0    56   ~ 0
SJ1 = off, SJ2 = on,
Text Notes 14700 5675 0    56   ~ 0
if TX_RAP_AL between 0V...5V
Text Notes 9250 7600 1    47   ~ 0
BUS SPI
Text Notes 8618 6107 0    56   ~ 0
SETTINGS MEMORY
Text Notes 15900 10738 0    59   ~ 0
A
Text Notes 16175 10738 0    59   ~ 0
05/03/14
Text Notes 16675 10750 0    59   ~ 0
JR
Text Notes 7372 884  0    56   ~ 0
EVENT MEMORY
Wire Wire Line
	2150 1350 2150 1425
Wire Wire Line
	1850 1350 1850 1425
Wire Wire Line
	1400 1875 1550 1875
Wire Wire Line
	2700 1875 2450 1875
Wire Wire Line
	1600 2525 2700 2525
$Comp
L cpu-board:74HCT1G08GW IC38
U 1 1 E1DA1C65
P 2800 2675
F 0 "IC38" H 3350 3425 67  0000 L BNN
F 1 "74HCT1G08GW" H 3337 3350 42  0000 L BNN
F 2 "AllModules:SC70-5_1" H 2800 2675 50  0001 C CNN
F 3 "" H 2800 2675 50  0001 C CNN
F 4 "2 INPUT AND-GATE,SOT353" H 2800 2675 50  0001 C CNN "Description"
F 5 "10023119" H 2800 2675 50  0001 C CNN "Item Number"
F 6 "NXP SEMICONDUCTORS_RMS1" H 2800 2675 50  0001 C CNN "Manufacturer"
F 7 "74HCT1G08GW,125" H 2800 2675 50  0001 C CNN "Manufacturer_No"
F 8 "" H 2800 2675 50  0001 C CNN "Manufacturer_Desc"
F 9 "NXP SEMICONDUCTORS_RMS1" H 2800 2675 50  0001 C CNN "Manufacturer2"
F 10 "74HCT1G08GW" H 2800 2675 50  0001 C CNN "Manufacturer_No2"
F 11 "2-INPUT AND-GATE" H 2800 2675 50  0001 C CNN "Manufacturer_Desc2"
	1    2800 2675
	1    0    0    -1  
$EndComp
Wire Wire Line
	3000 1350 3000 1725
Wire Wire Line
	3050 1725 3000 1725
Connection ~ 3000 1725
Wire Wire Line
	3000 1725 3000 1925
Wire Wire Line
	3300 1325 3300 1725
Wire Wire Line
	3250 1725 3300 1725
Connection ~ 3300 1725
Wire Wire Line
	3300 1725 3300 1925
Wire Wire Line
	3600 2375 3750 2375
$Comp
L cpu-board:74ACT16373 IC14
U 1 1 6BA2D255
P 4875 3400
F 0 "IC14" H 5150 4900 67  0000 L BNN
F 1 "74ACT16373" H 5150 4825 42  0000 L BNN
F 2 "AllModules:SSOP48_1" H 4875 3400 50  0001 C CNN
F 3 "" H 4875 3400 50  0001 C CNN
F 4 "IC,16 BIT D TYPE 3STATE OP, LATCHES,SSOP" H 4875 3400 50  0001 C CNN "Description"
F 5 "10022705" H 4875 3400 50  0001 C CNN "Item Number"
F 6 "TEXAS INSTRUMENTS_RMS1" H 4875 3400 50  0001 C CNN "Manufacturer"
F 7 "74ACT16373DLR" H 4875 3400 50  0001 C CNN "Manufacturer_No"
F 8 "" H 4875 3400 50  0001 C CNN "Manufacturer_Desc"
F 9 "TEXAS INSTRUMENTS_RMS1" H 4875 3400 50  0001 C CNN "Manufacturer2"
F 10 "74ACT16373DL" H 4875 3400 50  0001 C CNN "Manufacturer_No2"
F 11 "16BIT D TYPE TRANSPARENT LATCHES" H 4875 3400 50  0001 C CNN "Manufacturer_Desc2"
	1    4875 3400
	1    0    0    -1  
$EndComp
Wire Wire Line
	2700 1875 2700 2175
Wire Wire Line
	5175 4900 5075 4900
Connection ~ 4575 4900
Wire Wire Line
	4575 4900 4475 4900
Connection ~ 4675 4900
Wire Wire Line
	4675 4900 4575 4900
Connection ~ 4775 4900
Wire Wire Line
	4775 4900 4675 4900
Connection ~ 4875 4900
Wire Wire Line
	4875 4900 4775 4900
Connection ~ 4975 4900
Wire Wire Line
	4975 4900 4875 4900
Connection ~ 5075 4900
Wire Wire Line
	5075 4900 4975 4900
Wire Wire Line
	4775 4900 4775 5075
Wire Wire Line
	4175 2500 3750 2500
Wire Wire Line
	3750 2375 3750 2500
Wire Wire Line
	4175 2300 3750 2300
Wire Wire Line
	3750 2300 3750 2375
Connection ~ 3750 2375
Wire Wire Line
	4175 2400 3925 2400
Wire Wire Line
	3925 2400 3925 2200
Wire Wire Line
	4175 2200 3925 2200
Connection ~ 3925 2200
Wire Wire Line
	3925 2200 3925 1700
Wire Wire Line
	4125 1700 3925 1700
Connection ~ 3925 1700
Wire Wire Line
	3925 1700 3925 1350
Wire Wire Line
	5125 1700 5075 1700
Wire Wire Line
	4775 1800 4775 1700
Connection ~ 4775 1700
Wire Wire Line
	4775 1700 4325 1700
Wire Wire Line
	5075 1800 5075 1700
Connection ~ 5075 1700
Wire Wire Line
	5075 1700 4975 1700
Connection ~ 4975 1700
Wire Wire Line
	4975 1700 4875 1700
Wire Wire Line
	4975 1700 4975 1800
Wire Wire Line
	4875 1800 4875 1700
Connection ~ 4875 1700
Wire Wire Line
	4875 1700 4775 1700
Wire Wire Line
	5325 1700 5450 1700
Wire Wire Line
	4775 1350 4775 1700
Wire Wire Line
	3875 2800 4175 2800
Wire Wire Line
	4175 4300 3875 4300
Wire Wire Line
	4175 4200 3875 4200
Wire Wire Line
	3875 4100 4175 4100
Wire Wire Line
	4175 4000 3875 4000
Wire Wire Line
	3875 3900 4175 3900
Wire Wire Line
	3875 3700 4175 3700
Wire Wire Line
	3875 3800 4175 3800
Wire Wire Line
	3875 3600 4175 3600
Wire Wire Line
	4175 3500 3875 3500
Wire Wire Line
	3875 3400 4175 3400
Wire Wire Line
	4175 3300 3875 3300
Wire Wire Line
	3875 3200 4175 3200
Wire Wire Line
	4175 3100 3875 3100
Wire Wire Line
	3875 3000 4175 3000
Wire Wire Line
	4175 2900 3875 2900
Text HLabel 5625 2800 2    50   Output ~ 0
LED-VENTIL
Text HLabel 5625 2900 2    50   Output ~ 0
LED-O2
Text HLabel 5625 3100 2    50   Output ~ 0
CE\-EEP
NoConn ~ 5475 3000
Text HLabel 5625 3200 2    50   Output ~ 0
CE-RTC1
Text HLabel 5625 3300 2    50   Output ~ 0
CE\-RTC2
Text HLabel 5625 3400 2    50   Output ~ 0
CE\-INT-PRES-SENS
Text HLabel 5625 3500 2    50   Output ~ 0
CE\-PROX-PRES-SENS
Text HLabel 5625 3600 2    50   Output ~ 0
CE\-VALV-PRES-SENS
Text HLabel 5625 3700 2    50   Output ~ 0
CE-SPI-USB
Text HLabel 5625 3800 2    50   Output ~ 0
CE-SPI-PIC
Text HLabel 5625 3900 2    50   Output ~ 0
CE\-FLOW-INSP-SENS
Text HLabel 5625 4000 2    50   Output ~ 0
CE\-FLOW-EXP-SENS
Text HLabel 5625 4100 2    50   Output ~ 0
CE-SPI-PIC-IC44
NoConn ~ 5475 4200
NoConn ~ 5475 4300
Wire Wire Line
	5625 3200 5475 3200
Wire Wire Line
	5625 3300 5475 3300
Wire Wire Line
	5625 3400 5475 3400
Wire Wire Line
	5625 3500 5475 3500
Wire Wire Line
	5625 3600 5475 3600
Wire Wire Line
	5625 3700 5475 3700
Wire Wire Line
	5625 3800 5475 3800
Wire Wire Line
	5625 3900 5475 3900
Wire Wire Line
	5625 4000 5475 4000
Wire Wire Line
	5625 4100 5475 4100
Wire Wire Line
	5625 3100 5475 3100
Wire Wire Line
	5475 2900 5625 2900
Wire Wire Line
	5625 2800 5475 2800
Wire Wire Line
	8275 1525 8275 1300
Wire Wire Line
	8275 1300 8375 1300
Connection ~ 8275 1300
Wire Wire Line
	8275 1300 8275 1225
Wire Wire Line
	8375 1525 8375 1300
Connection ~ 8375 1300
Wire Wire Line
	8375 1300 8500 1300
Wire Wire Line
	8700 1300 8875 1300
Wire Wire Line
	8875 1300 8875 1225
Wire Wire Line
	8875 1300 8875 1525
Connection ~ 8875 1300
Text HLabel 8975 4575 3    50   Input ~ 0
BUSY-ME2
Text HLabel 8375 4575 3    50   Input ~ 0
RD\
Text HLabel 8275 4575 3    50   Input ~ 0
CS1\
Text HLabel 8575 4575 3    50   Input ~ 0
RESET\
Text HLabel 8475 4575 3    50   Input ~ 0
WR\
Wire Wire Line
	8675 4425 8675 4950
Wire Wire Line
	8275 4425 8275 4575
Wire Wire Line
	8375 4425 8375 4575
Wire Wire Line
	8475 4425 8475 4575
Wire Wire Line
	8575 4425 8575 4575
Wire Wire Line
	8975 4425 8975 4575
$Comp
L cpu-board:LVC1G07DBVT IC9
U 1 1 5F7D4A82
P 14400 4250
F 0 "IC9" H 14275 3775 64  0000 L BNN
F 1 "SN74LVC1G07DBVT" H 13825 3875 42  0000 L BNN
F 2 "AllModules:SOT23-5_1" H 14400 4250 50  0001 C CNN
F 3 "" H 14400 4250 50  0001 C CNN
F 4 "BUFFER WITH OPEN DRAIN OUTPUT,SOT23" H 14400 4250 50  0001 C CNN "Description"
F 5 "10022964" H 14400 4250 50  0001 C CNN "Item Number"
F 6 "TEXAS INSTRUMENTS_RMS1" H 14400 4250 50  0001 C CNN "Manufacturer"
F 7 "SN74LVC1G07DBVT" H 14400 4250 50  0001 C CNN "Manufacturer_No"
F 8 "SINGLE BUFFER DRIVER" H 14400 4250 50  0001 C CNN "Manufacturer_Desc"
F 9 "NXP SEMICONDUCTORS_RMS1" H 14400 4250 50  0001 C CNN "Manufacturer2"
F 10 "74LVC1G07GV,125" H 14400 4250 50  0001 C CNN "Manufacturer_No2"
F 11 "" H 14400 4250 50  0001 C CNN "Manufacturer_Desc2"
F 12 "NXP SEMICONDUCTORS_RMS1" H 14400 4250 50  0001 C CNN "Manufacturer3"
F 13 "74LVC1G07GV" H 14400 4250 50  0001 C CNN "Manufacturer_No3"
F 14 "BUFFER WITH OPEN DRAIN OUTPUT" H 14400 4250 50  0001 C CNN "Manufacturer_Desc3"
	1    14400 4250
	-1   0    0    1   
$EndComp
$Comp
L cpu-board:JUMP_0U JP5
U 1 1 056852D9
P 14300 5450
F 0 "JP5" H 14225 5525 51  0000 L BNN
F 1 "JUMP_0U" H 13875 5800 51  0001 L BNN
F 2 "AllModules:R0603_1" H 14300 5450 50  0001 C CNN
F 3 "" H 14300 5450 50  0001 C CNN
	1    14300 5450
	0    -1   -1   0   
$EndComp
Wire Wire Line
	12100 1075 12100 1325
Wire Wire Line
	12550 1025 12550 1325
Wire Wire Line
	12425 1325 12550 1325
Connection ~ 12550 1325
Wire Wire Line
	12550 1325 12550 1400
Wire Wire Line
	12225 1325 12100 1325
Connection ~ 12100 1325
Wire Wire Line
	12100 1325 12100 1400
Wire Wire Line
	11275 1675 11275 1750
Wire Wire Line
	11275 1750 11500 1750
Wire Wire Line
	11275 1750 11275 1950
Wire Wire Line
	11275 1950 11500 1950
Connection ~ 11275 1750
Text HLabel 11075 2050 0    50   Input ~ 0
CS3\
Text HLabel 11075 2450 0    50   Output ~ 0
IRQ-UART
Text HLabel 11075 2550 0    50   Input ~ 0
RESET
Wire Wire Line
	11075 2550 11500 2550
Wire Wire Line
	11500 2450 11075 2450
Wire Wire Line
	11075 2050 11500 2050
Wire Wire Line
	11175 2250 11500 2250
Wire Wire Line
	14550 5225 14550 5250
Wire Wire Line
	14300 5225 14300 5250
Wire Wire Line
	13050 4550 13550 4550
Wire Wire Line
	14300 5650 14550 5650
Wire Wire Line
	14850 6650 15275 6650
Wire Wire Line
	15275 6550 15275 6650
Connection ~ 15275 6650
Wire Wire Line
	15275 6650 15450 6650
Text HLabel 15450 6650 2    50   Output ~ 0
TX-AL-RP
Text HLabel 15450 6075 2    50   Output ~ 0
SUPPLY-AL-RP
Wire Wire Line
	15450 6075 15275 6075
Wire Wire Line
	15275 6075 15275 6150
Wire Wire Line
	15275 6075 14550 6075
Wire Wire Line
	14550 6075 14550 6200
Connection ~ 15275 6075
Wire Wire Line
	14550 5650 14550 6075
Connection ~ 14550 5650
Connection ~ 14550 6075
Wire Wire Line
	14250 6150 14250 6200
Text HLabel 15025 4250 2    50   Input ~ 0
RX-AL-RP
Wire Wire Line
	14700 4250 15025 4250
Wire Wire Line
	13600 3775 13600 3800
Wire Wire Line
	14100 5650 14300 5650
Connection ~ 14300 5650
Wire Wire Line
	13950 6650 13550 6650
Wire Wire Line
	13550 4550 13550 6650
NoConn ~ 13050 4850
NoConn ~ 13050 4750
NoConn ~ 13050 5050
Wire Wire Line
	13050 4250 13600 4250
Wire Wire Line
	13600 4200 13600 4250
Connection ~ 13600 4250
Wire Wire Line
	13600 4250 13800 4250
Wire Wire Line
	14400 4700 14400 4750
Wire Wire Line
	14100 4700 14100 5650
Wire Wire Line
	13050 3450 13200 3450
Wire Wire Line
	13200 3450 13200 3400
Wire Wire Line
	13300 3400 13300 3650
Wire Wire Line
	13300 3650 13050 3650
Wire Wire Line
	13050 3750 13400 3750
Wire Wire Line
	13400 3750 13400 3400
Wire Wire Line
	13500 3400 13500 4000
Wire Wire Line
	13500 4000 13050 4000
NoConn ~ 13050 2750
NoConn ~ 13050 2650
NoConn ~ 13050 3150
NoConn ~ 13050 2950
Wire Wire Line
	13050 2200 13175 2200
Wire Wire Line
	13175 2200 13175 2400
Wire Wire Line
	13175 2400 13050 2400
Wire Wire Line
	13200 2725 13200 2775
Wire Wire Line
	13500 2775 13500 3000
Wire Wire Line
	13400 3000 13400 2775
Wire Wire Line
	13200 2775 13300 2775
Connection ~ 13400 2775
Wire Wire Line
	13400 2775 13500 2775
Wire Wire Line
	13300 3000 13300 2775
Connection ~ 13300 2775
Wire Wire Line
	13300 2775 13400 2775
Wire Wire Line
	13200 3000 13200 2775
Connection ~ 13200 2775
$Comp
L cpu-board:R0805 R4
U 1 1 BADBB996
P 13550 1750
F 0 "R4" V 13625 1838 64  0000 L BNN
F 1 "1M" V 13538 1875 42  0000 L BNN
F 2 "AllModules:R0603_1" H 13550 1750 50  0001 C CNN
F 3 "" H 13550 1750 50  0001 C CNN
F 4 "RESISTOR,1M OHM,0.063W,+/-1%,0603" H 13550 1750 50  0001 C CNN "Description"
F 5 "10022736" H 13550 1750 50  0001 C CNN "Item Number"
F 6 "YAGEO_RMS1" H 13550 1750 50  0001 C CNN "Manufacturer"
F 7 "232270461005L" H 13550 1750 50  0001 C CNN "Manufacturer_No"
F 8 "RESISTOR, METAL GLAZE/THICK FILM, 0.1 W, 1 %, 100 PPM, 1000000 OHM, SURFACE MOUNT, 0603" H 13550 1750 50  0001 C CNN "Manufacturer_Desc"
F 9 "YAGEO_RMS1" H 13550 1750 50  0001 C CNN "Manufacturer2"
F 10 "RC0603FR-071ML" H 13550 1750 50  0001 C CNN "Manufacturer_No2"
F 11 "RESISTOR, METAL GLAZE/THICK FILM, 0.1 W, 1 %, 100 PPM, 1000000 OHM, SURFACE MOUNT, 0603" H 13550 1750 50  0001 C CNN "Manufacturer_Desc2"
F 12 "VISHAY_RMS1" H 13550 1750 50  0001 C CNN "Manufacturer3"
F 13 "CRCW06031M00FKEA" H 13550 1750 50  0001 C CNN "Manufacturer_No3"
F 14 "THICK FILM RECTANGULAR CHIP RESISTOR" H 13550 1750 50  0001 C CNN "Manufacturer_Desc3"
F 15 "YAGEO_RMS1" H 13550 1750 50  0001 C CNN "Manufacturer4"
F 16 "232270461005" H 13550 1750 50  0001 C CNN "Manufacturer_No4"
F 17 "RESISTOR, METAL GLAZE/THICK FILM, 0.1 W, 1 %, 100 PPM, 1000000 OHM, SURFACE MOUNT, 0603" H 13550 1750 50  0001 C CNN "Manufacturer_Desc4"
	1    13550 1750
	0    -1   -1   0   
$EndComp
Wire Wire Line
	13100 1950 13050 1950
Wire Wire Line
	13500 1950 13550 1950
Wire Wire Line
	13550 1950 13775 1950
Wire Wire Line
	13775 1950 13775 1850
Connection ~ 13550 1950
Wire Wire Line
	13775 1950 13975 1950
Connection ~ 13775 1950
Wire Wire Line
	13550 1550 13550 1525
Wire Wire Line
	13550 1525 13775 1525
Wire Wire Line
	13775 1650 13775 1525
Connection ~ 13775 1525
Wire Wire Line
	13775 1525 14100 1525
Wire Wire Line
	14300 1525 14425 1525
Wire Wire Line
	14425 1525 14425 1750
Wire Wire Line
	14425 1750 14425 1950
Wire Wire Line
	14425 1950 14175 1950
Connection ~ 14425 1750
Wire Wire Line
	13050 1800 13225 1800
Wire Wire Line
	13225 1800 13225 1525
Wire Wire Line
	13225 1525 13550 1525
Connection ~ 13550 1525
Wire Wire Line
	11500 5150 11275 5150
Wire Wire Line
	11275 5150 11275 5350
Wire Wire Line
	11500 4650 11275 4650
Wire Wire Line
	11275 4650 11275 5150
Connection ~ 11275 5150
Text HLabel 11175 4550 0    50   Input ~ 0
RD\
Text HLabel 11175 4950 0    50   Input ~ 0
WR\
Wire Wire Line
	11175 4950 11500 4950
Wire Wire Line
	11175 4550 11500 4550
Text HLabel 1700 8700 0    50   Input ~ 0
RD\
Text HLabel 1700 8800 0    50   Input ~ 0
WR\
Text HLabel 1700 8900 0    50   Input ~ 0
CMD_ALE1
Text HLabel 1700 9000 0    50   Input ~ 0
CMD_ME1
Text HLabel 1475 7850 0    50   Input ~ 0
CS0\
$Comp
L cpu-board:SN74ALVC164245 IC2
U 1 1 BC34DC86
P 3225 7700
F 0 "IC2" H 5100 8275 67  0000 R TNN
F 1 "SN74ALVC164245" H 5500 8175 42  0000 R TNN
F 2 "AllModules:TSSOP48_1" H 3225 7700 50  0001 C CNN
F 3 "" H 3225 7700 50  0001 C CNN
F 4 "TRANSCEIVER, 3.3V TO 5V,TSSOP" H 3225 7700 50  0001 C CNN "Description"
F 5 "10022511" H 3225 7700 50  0001 C CNN "Item Number"
F 6 "TEXAS INSTRUMENTS_RMS1" H 3225 7700 50  0001 C CNN "Manufacturer"
F 7 "SN74ALVC164245DGGR" H 3225 7700 50  0001 C CNN "Manufacturer_No"
F 8 "" H 3225 7700 50  0001 C CNN "Manufacturer_Desc"
F 9 "TEXAS INSTRUMENTS_RMS1" H 3225 7700 50  0001 C CNN "Manufacturer2"
F 10 "74ALVC164245DGGTE4" H 3225 7700 50  0001 C CNN "Manufacturer_No2"
F 11 "TRANSCEIVER" H 3225 7700 50  0001 C CNN "Manufacturer_Desc2"
F 12 "TEXAS INSTRUMENTS_RMS1" H 3225 7700 50  0001 C CNN "Manufacturer3"
F 13 "SN74ALVC164245DGGT" H 3225 7700 50  0001 C CNN "Manufacturer_No3"
F 14 "TRANSCEIVER 3.3V TO 5V" H 3225 7700 50  0001 C CNN "Manufacturer_Desc3"
F 15 "TEXAS INSTRUMENTS_RMS1" H 3225 7700 50  0001 C CNN "Manufacturer4"
F 16 "74ALVC164245DGGRG4" H 3225 7700 50  0001 C CNN "Manufacturer_No4"
F 17 "" H 3225 7700 50  0001 C CNN "Manufacturer_Desc4"
	1    3225 7700
	1    0    0    -1  
$EndComp
$Comp
L cpu-board:+3,3V #U$0435
U 1 1 35824EB4
P 6175 10500
F 0 "#U$0435" H 6175 10500 50  0001 C CNN
F 1 "+3,3V" V 6287 10600 59  0000 L BNN
F 2 "" H 6175 10500 50  0001 C CNN
F 3 "" H 6175 10500 50  0001 C CNN
	1    6175 10500
	0    -1   -1   0   
$EndComp
Wire Wire Line
	10625 6725 10525 6725
Wire Wire Line
	10525 6525 10525 6725
Connection ~ 10525 6725
Wire Wire Line
	10525 6725 10525 6875
Wire Wire Line
	10925 6500 10925 6725
Wire Wire Line
	10825 6725 10925 6725
Connection ~ 10925 6725
Wire Wire Line
	10925 6725 10925 6875
Wire Wire Line
	11225 7675 11350 7675
Wire Wire Line
	11350 7675 11350 7375
Wire Wire Line
	11350 6725 10925 6725
Wire Wire Line
	11225 7375 11350 7375
Connection ~ 11350 7375
Wire Wire Line
	11350 7375 11350 6725
Text HLabel 10000 7775 0    50   Input ~ 0
CE\-EEP
Text HLabel 10000 7575 0    50   Input ~ 0
SCLK-SPI-0
Text HLabel 10000 7375 0    50   Output ~ 0
MRST-SPI-0_E
Text HLabel 10000 7175 0    50   Input ~ 0
MTSR-SPI-0
Wire Wire Line
	10000 7175 10125 7175
Wire Wire Line
	10125 7375 10000 7375
Wire Wire Line
	10000 7575 10125 7575
Wire Wire Line
	10125 7775 10000 7775
Wire Wire Line
	5125 7700 6200 7700
Wire Wire Line
	6200 7800 5125 7800
Wire Wire Line
	5125 7900 6200 7900
Wire Wire Line
	6200 8000 5125 8000
Wire Wire Line
	5125 8100 6200 8100
Wire Wire Line
	6200 8200 5125 8200
Wire Wire Line
	5125 8300 6200 8300
Wire Wire Line
	6200 8400 5125 8400
Wire Wire Line
	6075 10500 6200 10500
Text HLabel 6125 9300 0    50   Output ~ 0
BUSY-ME1
NoConn ~ 6200 9400
NoConn ~ 6200 9500
NoConn ~ 6200 9600
Wire Wire Line
	6200 9000 6050 9000
Wire Wire Line
	6200 9300 6125 9300
NoConn ~ 5125 9300
NoConn ~ 5125 9200
NoConn ~ 5125 9100
Wire Wire Line
	5125 9000 5400 9000
Wire Wire Line
	5400 9000 5400 10100
Wire Wire Line
	5400 10100 6200 10100
Wire Wire Line
	5625 8700 5625 10200
Wire Wire Line
	5625 10200 6200 10200
Wire Wire Line
	5125 8900 5475 8900
Wire Wire Line
	5475 8900 5475 10000
Wire Wire Line
	5475 10000 6200 10000
Wire Wire Line
	5125 8800 5325 8800
Wire Wire Line
	5550 8800 5550 9900
Wire Wire Line
	5550 9900 6200 9900
Wire Wire Line
	5700 8600 5700 8700
Wire Wire Line
	5700 8700 6200 8700
Wire Wire Line
	6200 8800 6200 8900
Wire Wire Line
	6200 8900 6200 9000
Connection ~ 6200 8900
Connection ~ 6200 9000
Wire Wire Line
	5125 8600 5250 8600
Wire Wire Line
	4625 9900 4525 9900
Wire Wire Line
	4625 9900 4625 10050
Connection ~ 4625 9900
Wire Wire Line
	3525 9900 3525 10425
Wire Wire Line
	3525 10425 5325 10425
Wire Wire Line
	5325 10425 5325 8800
Connection ~ 5325 8800
Wire Wire Line
	5325 8800 5550 8800
Wire Wire Line
	5250 10350 3625 10350
Wire Wire Line
	3625 10350 3625 9900
Wire Wire Line
	3025 9100 2875 9100
Wire Wire Line
	2875 9100 2875 9200
Wire Wire Line
	3025 9200 2875 9200
Connection ~ 2875 9200
Wire Wire Line
	2875 9200 2875 9300
Wire Wire Line
	3025 9300 2875 9300
Connection ~ 2875 9300
Wire Wire Line
	2875 9300 2875 9500
Wire Wire Line
	1700 9000 3025 9000
Wire Wire Line
	3025 8900 1700 8900
Wire Wire Line
	1700 8800 3025 8800
Wire Wire Line
	3025 8700 1700 8700
Wire Wire Line
	2500 8050 2650 8050
Wire Wire Line
	2650 8050 2650 8600
Wire Wire Line
	2650 8600 3025 8600
Wire Wire Line
	1475 7850 1600 7850
Wire Wire Line
	1600 8200 1475 8200
Wire Wire Line
	1900 7500 1900 7600
Wire Wire Line
	2200 7500 2200 7600
Wire Wire Line
	3325 6700 3325 6900
Wire Wire Line
	3325 6900 3425 6900
Connection ~ 3325 6900
Wire Wire Line
	3325 6900 3325 7000
Wire Wire Line
	3700 6900 3725 6900
Wire Wire Line
	3725 6900 3725 6700
Wire Wire Line
	3725 6900 3725 7000
Connection ~ 3725 6900
Wire Wire Line
	3725 6900 3825 6900
Wire Wire Line
	3825 6900 3825 7000
Wire Wire Line
	3425 7000 3425 6900
Connection ~ 3425 6900
Wire Wire Line
	3425 6900 3500 6900
Wire Wire Line
	3825 6900 3925 6900
Connection ~ 3825 6900
Wire Wire Line
	4425 7000 4425 6900
Connection ~ 4425 6900
Wire Wire Line
	4425 6900 4475 6900
Wire Wire Line
	4325 7000 4325 6900
Connection ~ 4325 6900
Wire Wire Line
	4325 6900 4425 6900
Wire Wire Line
	4225 7000 4225 6900
Connection ~ 4225 6900
Wire Wire Line
	4225 6900 4325 6900
Wire Wire Line
	4125 7000 4125 6900
Connection ~ 4125 6900
Wire Wire Line
	4125 6900 4225 6900
Wire Wire Line
	4025 7000 4025 6900
Connection ~ 4025 6900
Wire Wire Line
	4025 6900 4125 6900
Wire Wire Line
	3925 7000 3925 6900
Connection ~ 3925 6900
Wire Wire Line
	3925 6900 4025 6900
Wire Wire Line
	4725 6650 4725 6900
Wire Wire Line
	4675 6900 4725 6900
Connection ~ 4725 6900
Wire Wire Line
	4725 6900 4725 7000
Wire Wire Line
	4725 6900 4825 6900
Wire Wire Line
	4825 6900 4825 7000
Connection ~ 5250 8600
Wire Wire Line
	5250 8600 5700 8600
Wire Wire Line
	5125 8700 5625 8700
Wire Wire Line
	5250 8600 5250 10350
Text HLabel 1400 1875 0    50   Input ~ 0
WR\
$Comp
L cpu-board:74HCT1G32GW IC5
U 1 1 E8297B24
P 1700 8350
F 0 "IC5" H 2250 9113 64  0000 L BNN
F 1 "74HCT1G32GW" H 2250 9038 42  0000 L BNN
F 2 "AllModules:SC70-5_1" H 1700 8350 50  0001 C CNN
F 3 "" H 1700 8350 50  0001 C CNN
F 4 "IC, 2 INPUT OR-GATE,SOT353" H 1700 8350 50  0001 C CNN "Description"
F 5 "10022960" H 1700 8350 50  0001 C CNN "Item Number"
F 6 "NXP SEMICONDUCTORS_RMS1" H 1700 8350 50  0001 C CNN "Manufacturer"
F 7 "74HCT1G32GW" H 1700 8350 50  0001 C CNN "Manufacturer_No"
F 8 "2 INPUT OR-GATE" H 1700 8350 50  0001 C CNN "Manufacturer_Desc"
F 9 "NXP SEMICONDUCTORS_RMS1" H 1700 8350 50  0001 C CNN "Manufacturer2"
F 10 "74HCT1G32GW,125" H 1700 8350 50  0001 C CNN "Manufacturer_No2"
F 11 "" H 1700 8350 50  0001 C CNN "Manufacturer_Desc2"
	1    1700 8350
	1    0    0    -1  
$EndComp
Text Label 9500 2225 0    50   ~ 0
D0
Text Label 9500 2325 0    50   ~ 0
D1
Text Label 9500 2425 0    50   ~ 0
D2
Text Label 9500 2525 0    50   ~ 0
D3
Text Label 9500 2625 0    50   ~ 0
D4
Text Label 9500 2725 0    50   ~ 0
D5
Text Label 9500 2825 0    50   ~ 0
D6
Text Label 9500 2925 0    50   ~ 0
D7
Text Label 9500 3025 0    50   ~ 0
D8
Text Label 9500 3125 0    50   ~ 0
D9
Text Label 9500 3225 0    50   ~ 0
D10
Text Label 9500 3325 0    50   ~ 0
D11
Text Label 9500 3425 0    50   ~ 0
D12
Text Label 9500 3525 0    50   ~ 0
D13
Text Label 9500 3625 0    50   ~ 0
D14
Text Label 9500 3725 0    50   ~ 0
D15
Wire Wire Line
	9375 3725 9650 3725
Wire Wire Line
	9375 2225 9650 2225
Wire Wire Line
	9375 2325 9650 2325
Wire Wire Line
	9375 2425 9650 2425
Wire Wire Line
	9375 2525 9650 2525
Wire Wire Line
	9375 2625 9650 2625
Wire Wire Line
	9375 2725 9650 2725
Wire Wire Line
	9375 2825 9650 2825
Wire Wire Line
	9375 2925 9650 2925
Wire Wire Line
	9375 3025 9650 3025
Wire Wire Line
	9375 3125 9650 3125
Wire Wire Line
	9375 3225 9650 3225
Wire Wire Line
	9375 3325 9650 3325
Wire Wire Line
	9375 3425 9650 3425
Wire Wire Line
	9375 3525 9650 3525
Wire Wire Line
	9375 3625 9650 3625
Text Label 11375 2700 0    50   ~ 0
A0
Text Label 11375 2900 0    50   ~ 0
A1
Text Label 11375 3000 0    50   ~ 0
A2
Wire Wire Line
	11375 2700 11500 2700
Text Label 11375 3250 0    50   ~ 0
D0
Wire Wire Line
	11375 3250 11500 3250
Text Label 11375 3350 0    50   ~ 0
D1
Wire Wire Line
	11375 3350 11500 3350
Text Label 11375 3550 0    50   ~ 0
D2
Wire Wire Line
	11375 3550 11500 3550
Text Label 11375 3650 0    50   ~ 0
D3
Wire Wire Line
	11375 3650 11500 3650
Text Label 11375 3850 0    50   ~ 0
D4
Wire Wire Line
	11375 3850 11500 3850
Text Label 11375 4050 0    50   ~ 0
D5
Wire Wire Line
	11375 4050 11500 4050
Text Label 11375 4150 0    50   ~ 0
D6
Wire Wire Line
	11375 4150 11500 4150
Text Label 11375 4250 0    50   ~ 0
D7
Wire Wire Line
	11375 4250 11500 4250
Wire Wire Line
	11375 3000 11500 3000
Wire Wire Line
	11375 2900 11500 2900
Wire Wire Line
	7575 1725 7775 1725
Wire Wire Line
	7575 1825 7775 1825
Wire Wire Line
	7575 1925 7775 1925
Wire Wire Line
	7575 2025 7775 2025
Wire Wire Line
	7575 2125 7775 2125
Wire Wire Line
	7575 2225 7775 2225
Wire Wire Line
	7575 2325 7775 2325
Wire Wire Line
	7575 2425 7775 2425
Wire Wire Line
	7575 2525 7775 2525
Wire Wire Line
	7575 2625 7775 2625
Wire Wire Line
	7575 2725 7775 2725
Wire Wire Line
	7575 2825 7775 2825
Wire Wire Line
	7575 2925 7775 2925
Wire Wire Line
	7575 3025 7775 3025
Wire Wire Line
	7575 3125 7775 3125
Wire Wire Line
	7575 3225 7775 3225
Wire Wire Line
	7575 3325 7775 3325
Wire Wire Line
	7575 3425 7775 3425
Wire Wire Line
	7575 3525 7775 3525
Text Label 7575 1725 0    50   ~ 0
A1
Text Label 7575 1825 0    50   ~ 0
A2
Text Label 7575 1925 0    50   ~ 0
A3
Text Label 7575 2025 0    50   ~ 0
A4
Text Label 7575 2125 0    50   ~ 0
A5
Text Label 7575 2225 0    50   ~ 0
A6
Text Label 7575 2325 0    50   ~ 0
A7
Text Label 7575 2425 0    50   ~ 0
A8
Text Label 7575 2525 0    50   ~ 0
A9
Text Label 7575 2625 0    50   ~ 0
A10
Text Label 7575 2725 0    50   ~ 0
A11
Text Label 7575 2825 0    50   ~ 0
A12
Text Label 7575 2925 0    50   ~ 0
A13
Text Label 7575 3025 0    50   ~ 0
A14
Text Label 7575 3125 0    50   ~ 0
A15
Text Label 7575 3225 0    50   ~ 0
A16
Text Label 7575 3325 0    50   ~ 0
A17
Text Label 7575 3425 0    50   ~ 0
A18
Text Label 7575 3525 0    50   ~ 0
A19
Entry Wire Line
	7475 1625 7575 1725
Entry Wire Line
	7475 1725 7575 1825
Entry Wire Line
	7475 1825 7575 1925
Entry Wire Line
	7475 1925 7575 2025
Entry Wire Line
	7475 2025 7575 2125
Entry Wire Line
	7475 2125 7575 2225
Entry Wire Line
	7475 2225 7575 2325
Entry Wire Line
	7475 2325 7575 2425
Entry Wire Line
	7475 2425 7575 2525
Entry Wire Line
	7475 2525 7575 2625
Entry Wire Line
	7475 2625 7575 2725
Entry Wire Line
	7475 2725 7575 2825
Entry Wire Line
	7475 2825 7575 2925
Entry Wire Line
	7475 2925 7575 3025
Entry Wire Line
	7475 3025 7575 3125
Entry Wire Line
	7475 3125 7575 3225
Entry Wire Line
	7475 3225 7575 3325
Entry Wire Line
	7475 3325 7575 3425
Entry Wire Line
	7475 3425 7575 3525
Text HLabel 7475 1525 2    50   Input ~ 0
A[0..19]
Text Label 3975 2800 0    50   ~ 0
D0
Text Label 3975 2900 0    50   ~ 0
D1
Text Label 3975 3000 0    50   ~ 0
D2
Text Label 3975 3100 0    50   ~ 0
D3
Text Label 3975 3200 0    50   ~ 0
D4
Text Label 3975 3300 0    50   ~ 0
D5
Text Label 3975 3400 0    50   ~ 0
D6
Text Label 3975 3500 0    50   ~ 0
D7
Text Label 3975 3600 0    50   ~ 0
D8
Text Label 3975 3700 0    50   ~ 0
D9
Text Label 3975 3800 0    50   ~ 0
D10
Text Label 3975 3900 0    50   ~ 0
D11
Text Label 3975 4000 0    50   ~ 0
D12
Text Label 3975 4100 0    50   ~ 0
D13
Text Label 3975 4200 0    50   ~ 0
D14
Text Label 3975 4300 0    50   ~ 0
D15
Entry Wire Line
	3775 2700 3875 2800
Entry Wire Line
	3775 2800 3875 2900
Entry Wire Line
	3775 2900 3875 3000
Entry Wire Line
	3775 3000 3875 3100
Entry Wire Line
	3775 3100 3875 3200
Entry Wire Line
	3775 3200 3875 3300
Entry Wire Line
	3775 3300 3875 3400
Entry Wire Line
	3775 3400 3875 3500
Entry Wire Line
	3775 3500 3875 3600
Entry Wire Line
	3775 3600 3875 3700
Entry Wire Line
	3775 3700 3875 3800
Entry Wire Line
	3775 3800 3875 3900
Entry Wire Line
	3775 3900 3875 4000
Entry Wire Line
	3775 4000 3875 4100
Entry Wire Line
	3775 4100 3875 4200
Entry Wire Line
	3775 4200 3875 4300
Text HLabel 3775 2625 2    50   BiDi ~ 0
D[0..15]
Entry Wire Line
	9750 2125 9650 2225
Entry Wire Line
	9750 2225 9650 2325
Entry Wire Line
	9750 2325 9650 2425
Entry Wire Line
	9750 2425 9650 2525
Entry Wire Line
	9750 2525 9650 2625
Entry Wire Line
	9750 2625 9650 2725
Entry Wire Line
	9750 2725 9650 2825
Entry Wire Line
	9750 2825 9650 2925
Entry Wire Line
	9750 2925 9650 3025
Entry Wire Line
	9750 3025 9650 3125
Entry Wire Line
	9750 3125 9650 3225
Entry Wire Line
	9750 3225 9650 3325
Entry Wire Line
	9750 3325 9650 3425
Entry Wire Line
	9750 3425 9650 3525
Entry Wire Line
	9750 3525 9650 3625
Entry Wire Line
	9750 3625 9650 3725
Text HLabel 9750 2050 2    50   BiDi ~ 0
D[0..15]
Entry Wire Line
	11275 2600 11375 2700
Entry Wire Line
	11275 2800 11375 2900
Entry Wire Line
	11275 2900 11375 3000
Text HLabel 11275 2950 0    50   Input ~ 0
A[0..19]
Entry Wire Line
	11275 3150 11375 3250
Entry Wire Line
	11275 3250 11375 3350
Entry Wire Line
	11275 3450 11375 3550
Entry Wire Line
	11275 3550 11375 3650
Entry Wire Line
	11275 3750 11375 3850
Entry Wire Line
	11275 3950 11375 4050
Entry Wire Line
	11275 4050 11375 4150
Entry Wire Line
	11275 4150 11375 4250
Text HLabel 11275 3100 0    50   BiDi ~ 0
D[0..15]
$Comp
L cpu-board:AT25--- IC32
U 1 1 1703D4A9
P 10325 7575
F 0 "IC32" H 10987 8287 67  0000 L BNN
F 1 "25LC320" H 10987 8212 42  0000 L BNN
F 2 "AllModules:MX.A8_COMPOSANT_1" H 10325 7575 50  0001 C CNN
F 3 "" H 10325 7575 50  0001 C CNN
F 4 "EEPROM, SOIC8" H 10325 7575 50  0001 C CNN "Description"
F 5 "10023158" H 10325 7575 50  0001 C CNN "Item Number"
F 6 "MICROCHIP TECHNOLOGY_RMS1" H 10325 7575 50  0001 C CNN "Manufacturer"
F 7 "25LC320-I/SN" H 10325 7575 50  0001 C CNN "Manufacturer_No"
F 8 "EEPROM" H 10325 7575 50  0001 C CNN "Manufacturer_Desc"
F 9 "MICROCHIP TECHNOLOGY_RMS1" H 10325 7575 50  0001 C CNN "Manufacturer2"
F 10 "25LC320T-E/SN" H 10325 7575 50  0001 C CNN "Manufacturer_No2"
F 11 "EEPROM" H 10325 7575 50  0001 C CNN "Manufacturer_Desc2"
F 12 "MICROCHIP TECHNOLOGY_RMS1" H 10325 7575 50  0001 C CNN "Manufacturer3"
F 13 "25LC320T-I/SN" H 10325 7575 50  0001 C CNN "Manufacturer_No3"
F 14 "EEPROM" H 10325 7575 50  0001 C CNN "Manufacturer_Desc3"
F 15 "MICROCHIP TECHNOLOGY_RMS1" H 10325 7575 50  0001 C CNN "Manufacturer4"
F 16 "25LC320-E/SN" H 10325 7575 50  0001 C CNN "Manufacturer_No4"
F 17 "EEPROM" H 10325 7575 50  0001 C CNN "Manufacturer_Desc4"
	1    10325 7575
	1    0    0    -1  
$EndComp
Text Label 3000 8400 2    50   ~ 0
D7
Text Label 3000 8300 2    50   ~ 0
D6
Text Label 3000 8200 2    50   ~ 0
D5
Text Label 3000 8100 2    50   ~ 0
D4
Text Label 3000 8000 2    50   ~ 0
D3
Text Label 3000 7900 2    50   ~ 0
D2
Text Label 3000 7800 2    50   ~ 0
D1
Text Label 3000 7700 2    50   ~ 0
D0
Entry Wire Line
	2800 7600 2900 7700
Entry Wire Line
	2800 7700 2900 7800
Entry Wire Line
	2800 7800 2900 7900
Entry Wire Line
	2800 7900 2900 8000
Entry Wire Line
	2800 8000 2900 8100
Entry Wire Line
	2800 8100 2900 8200
Entry Wire Line
	2800 8200 2900 8300
Entry Wire Line
	2800 8300 2900 8400
Wire Wire Line
	2900 7700 3025 7700
Wire Wire Line
	2900 7800 3025 7800
Wire Wire Line
	2900 7900 3025 7900
Wire Wire Line
	2900 8000 3025 8000
Wire Wire Line
	2900 8100 3025 8100
Wire Wire Line
	2900 8200 3025 8200
Wire Wire Line
	2900 8300 3025 8300
Wire Wire Line
	2900 8400 3025 8400
Text HLabel 2800 7550 2    50   BiDi ~ 0
D[0..15]
Text HLabel 1600 2525 0    50   Input ~ 0
A23
Text HLabel 1475 8200 0    50   Input ~ 0
A23
Wire Bus Line
	11275 2600 11275 2950
Wire Bus Line
	11275 3100 11275 4325
Wire Bus Line
	2800 7550 2800 8375
Wire Bus Line
	9750 2050 9750 3775
Wire Bus Line
	3775 2625 3775 4375
Wire Bus Line
	7475 1525 7475 3575
$EndSCHEMATC
