EESchema Schematic File Version 4
EELAYER 30 0
EELAYER END
$Descr A3 16535 11693
encoding utf-8
Sheet 1 2
Title ""
Date "2020-04-06"
Rev "1"
Comp ""
Comment1 "Design for OSHPark 4-Layer Service"
Comment2 ""
Comment3 ""
Comment4 ""
$EndDescr
$Comp
L Device:D_Zener D1
U 1 1 5E878DFE
P 2750 2300
F 0 "D1" H 2875 2250 50  0000 C CNN
F 1 "NC" H 2875 2350 45  0000 C CNN
F 2 "AllModules:DO216AA_1" H 2750 2300 50  0001 C CNN
F 3 "~" H 2750 2300 50  0001 C CNN
    1    2750 2300
    1    0    0    1
$EndComp
$Comp
L power:+12V #PWR019
U 1 1 5E881F7D
P 1475 5175
F 0 "#PWR019" H 1475 5025 50  0001 C CNN
F 1 "+12V" H 1490 5348 50  0000 C CNN
F 2 "" H 1475 5175 50  0001 C CNN
F 3 "" H 1475 5175 50  0001 C CNN
    1    1475 5175
    1    0    0    -1
$EndComp
$Comp
L Device:C C4
U 1 1 5E88308B
P 5950 3275
F 0 "C4" H 6000 3375 50  0000 L CNN
F 1 "680pF" H 5975 3175 50  0000 L CNN
F 2 "AllModules:C0402_1b" H 5988 3125 50  0001 C CNN
F 3 "~" H 5950 3275 50  0001 C CNN
    1    5950 3275
    1    0    0    -1
$EndComp
$Comp
L power:-12V #PWR029
U 1 1 5E8857C8
P 1475 6375
F 0 "#PWR029" H 1475 6475 50  0001 C CNN
F 1 "-12V" H 1490 6548 50  0000 C CNN
F 2 "" H 1475 6375 50  0001 C CNN
F 3 "" H 1475 6375 50  0001 C CNN
    1    1475 6375
    -1   0    0    1
$EndComp
$Comp
L power:GND #PWR011
U 1 1 5E88A1EF
P 2600 4400
F 0 "#PWR011" H 2600 4150 50  0001 C CNN
F 1 "GND" H 2605 4227 50  0000 C CNN
F 2 "" H 2600 4400 50  0001 C CNN
F 3 "" H 2600 4400 50  0001 C CNN
    1    2600 4400
    1    0    0    -1
$EndComp
$Comp
L Transistor_BJT:BC857 T2
U 1 1 5E89FAAA
P 9375 3500
F 0 "T2" H 9250 3350 50  0000 L CNN
F 1 "BC857" H 9550 3600 50  0000 L CNN
F 2 "AllModules:SOT23-BEC_1" H 9575 3425 50  0001 L CIN
F 3 "http://www.fairchildsemi.com/ds/BC/BC856.pdf" H 9375 3500 50  0001 L CNN
    1    9375 3500
    1    0    0    1
$EndComp
$Comp
L Transistor_BJT:BC847 T1
U 1 1 5E8A044B
P 9375 2100
F 0 "T1" H 9275 2250 50  0000 L CNN
F 1 "BC847" H 9550 2025 50  0000 L CNN
F 2 "AllModules:SOT23-BEC_1" H 9575 2025 50  0001 L CIN
F 3 "http://www.infineon.com/dgdl/Infineon-BC847SERIES_BC848SERIES_BC849SERIES_BC850SERIES-DS-v01_01-en.pdf?fileId=db3a304314dca389011541d4630a1657" H 9375 2100 50  0001 L CNN
    1    9375 2100
    1    0    0    -1
$EndComp
$Comp
L Diode:BAT54S D3
U 1 1 5E8A85AF
P 11000 2500
F 0 "D3" V 11000 2525 50  0000 L CNN
F 1 "BAT54S" H 10675 2375 50  0000 L CNN
F 2 "AllModules:SOT23-1G_1" H 11075 2625 50  0001 L CNN
F 3 "https://www.diodes.com/assets/Datasheets/ds11005.pdf" H 10880 2500 50  0001 C CNN
    1    11000 2500
    0    1    -1   0
$EndComp
$Comp
L Device:C C10
U 1 1 5E8CCB53
P 1875 5350
F 0 "C10" V 2025 5300 50  0000 L CNN
F 1 "100nF" V 1725 5200 50  0000 L CNN
F 2 "AllModules:C0402_1b" H 1913 5200 50  0001 C CNN
F 3 "~" H 1875 5350 50  0001 C CNN
    1    1875 5350
    0    -1   -1   0
$EndComp
$Comp
L Device:C C5
U 1 1 5E8CCB59
P 6125 4250
F 0 "C5" V 6050 4325 50  0000 L CNN
F 1 "100nF" V 6275 4150 50  0000 L CNN
F 2 "AllModules:C0402_1b" H 6163 4100 50  0001 C CNN
F 3 "~" H 6125 4250 50  0001 C CNN
    1    6125 4250
    0    1    1    0
$EndComp
$Comp
L Device:C C3
U 1 1 5E8D63CA
P 5350 5900
F 0 "C3" H 5400 6000 50  0000 L CNN
F 1 "10nF" H 5400 5800 50  0000 L CNN
F 2 "AllModules:C0805_1b" H 5388 5750 50  0001 C CNN
F 3 "~" H 5350 5900 50  0001 C CNN
    1    5350 5900
    1    0    0    -1
$EndComp
$Comp
L Diode:BAT54C D2
U 1 1 5E8DB0E0
P 7150 4450
F 0 "D2" V 7250 4600 50  0000 L CNN
F 1 "BAT54C" V 7075 4550 50  0000 L CNN
F 2 "AllModules:SOT23-1G_1" H 7225 4575 50  0001 L CNN
F 3 "http://www.diodes.com/_files/datasheets/ds11005.pdf" H 7070 4450 50  0001 C CNN
    1    7150 4450
    0    -1   -1   0
$EndComp
$Comp
L Device:C C9
U 1 1 5E8DEB54
P 7625 4450
F 0 "C9" V 7775 4375 50  0000 L CNN
F 1 "100nF" V 7475 4325 50  0000 L CNN
F 2 "AllModules:C0402_1b" H 7663 4300 50  0001 C CNN
F 3 "~" H 7625 4450 50  0001 C CNN
    1    7625 4450
    0    -1   -1   0
$EndComp
$Comp
L Device:C C30
U 1 1 5EA0990A
P 14325 6575
F 0 "C30" V 14475 6425 50  0000 L CNN
F 1 "100nF" V 14150 6475 50  0000 L CNN
F 2 "AllModules:C0402_1b" H 14363 6425 50  0001 C CNN
F 3 "~" H 14325 6575 50  0001 C CNN
    1    14325 6575
    0    -1   -1   0
$EndComp
$Comp
L Device:D_Zener D5
U 1 1 5EA18B6F
P 12500 7350
F 0 "D5" V 12454 7429 50  0000 L CNN
F 1 "BZX84C2V7" V 12600 7400 50  0000 L CNN
F 2 "AllModules:SOT23-1G_1" H 12500 7350 50  0001 C CNN
F 3 "~" H 12500 7350 50  0001 C CNN
    1    12500 7350
    0    1    1    0
$EndComp
$Comp
L Device:R R25
U 1 1 5EA20431
P 13250 7900
F 0 "R25" V 13150 7825 50  0000 L CNN
F 1 "NC" V 13250 7850 50  0000 L CNN
F 2 "AllModules:R0402_1" V 13180 7900 50  0001 C CNN
F 3 "~" H 13250 7900 50  0001 C CNN
    1    13250 7900
    0    1    1    0
$EndComp
$Comp
L power:GND #PWR032
U 1 1 5EA22D9C
P 13500 8500
F 0 "#PWR032" H 13500 8250 50  0001 C CNN
F 1 "GND" H 13505 8327 50  0000 C CNN
F 2 "" H 13500 8500 50  0001 C CNN
F 3 "" H 13500 8500 50  0001 C CNN
    1    13500 8500
    1    0    0    -1
$EndComp
$Comp
L Device:C C13
U 1 1 5EA46C5B
P 11800 7050
F 0 "C13" H 11625 6950 50  0000 L CNN
F 1 "33nF" H 11575 7175 50  0000 L CNN
F 2 "AllModules:C0603_1b" H 11838 6900 50  0001 C CNN
F 3 "~" H 11800 7050 50  0001 C CNN
    1    11800 7050
    -1   0    0    1
$EndComp
$Comp
L power:GND #PWR025
U 1 1 5EA48DDB
P 11800 7500
F 0 "#PWR025" H 11800 7250 50  0001 C CNN
F 1 "GND" H 11805 7327 50  0000 C CNN
F 2 "" H 11800 7500 50  0001 C CNN
F 3 "" H 11800 7500 50  0001 C CNN
    1    11800 7500
    1    0    0    -1
$EndComp
$Comp
L Device:C C14
U 1 1 5EA56715
P 12250 5500
F 0 "C14" V 12100 5425 50  0000 L CNN
F 1 "33nF" V 12400 5425 50  0000 L CNN
F 2 "AllModules:C0603_1b" H 12288 5350 50  0001 C CNN
F 3 "~" H 12250 5500 50  0001 C CNN
    1    12250 5500
    0    1    1    0
$EndComp
$Comp
L power:GND #PWR017
U 1 1 5EA70AEB
P 13325 6300
F 0 "#PWR017" H 13325 6050 50  0001 C CNN
F 1 "GND" H 13330 6127 50  0000 C CNN
F 2 "" H 13325 6300 50  0001 C CNN
F 3 "" H 13325 6300 50  0001 C CNN
    1    13325 6300
    1    0    0    -1
$EndComp
Wire Wire Line
    14175 6575 14100 6575
Wire Wire Line
    14475 6575 14525 6575
$Comp
L power:+5V #PWR018
U 1 1 5EA917AB
P 14100 6525
F 0 "#PWR018" H 14100 6375 50  0001 C CNN
F 1 "+5V" H 14115 6698 50  0000 C CNN
F 2 "" H 14100 6525 50  0001 C CNN
F 3 "" H 14100 6525 50  0001 C CNN
    1    14100 6525
    1    0    0    -1
$EndComp
Wire Wire Line
    14550 6225 14700 6225
Wire Wire Line
    14250 6225 13825 6225
Connection ~ 13825 6225
Wire Wire Line
    13825 6225 13700 6225
Wire Wire Line
    13400 6225 13325 6225
Wire Wire Line
    13325 6225 13325 6300
Wire Wire Line
    13400 7900 13500 7900
Wire Wire Line
    13700 7900 13600 7900
Connection ~ 13600 7900
Wire Wire Line
    13400 7000 13600 7000
$Comp
L power:GND #PWR026
U 1 1 5EAE4D06
P 12500 7600
F 0 "#PWR026" H 12500 7350 50  0001 C CNN
F 1 "GND" H 12505 7427 50  0000 C CNN
F 2 "" H 12500 7600 50  0001 C CNN
F 3 "" H 12500 7600 50  0001 C CNN
    1    12500 7600
    1    0    0    -1
$EndComp
$Comp
L Amplifier_Operational:LM358 IC2
U 2 1 5EA35D87
P 12200 6500
F 0 "IC2" H 12275 6675 50  0000 C CNN
F 1 "MC33172" H 12350 6325 50  0000 C CNN
F 2 "AllModules:MX.A8_COMPOSANT_1" H 12200 6500 50  0001 C CNN
F 3 "http://www.ti.com/lit/ds/symlink/lm2904-n.pdf" H 12200 6500 50  0001 C CNN
    2    12200 6500
    1    0    0    1
$EndComp
Wire Wire Line
    10075 2675 10075 2825
Wire Wire Line
    10250 2825 10075 2825
Connection ~ 10075 2825
Wire Wire Line
    10075 2825 10075 2975
Wire Wire Line
    9875 2675 9875 2825
$Comp
L power:-12V #PWR09
U 1 1 5EB6DA94
P 9475 3775
F 0 "#PWR09" H 9475 3875 50  0001 C CNN
F 1 "-12V" H 9490 3948 50  0000 C CNN
F 2 "" H 9475 3775 50  0001 C CNN
F 3 "" H 9475 3775 50  0001 C CNN
    1    9475 3775
    -1   0    0    1
$EndComp
$Comp
L power:+12V #PWR02
U 1 1 5EB6F4DC
P 9475 1800
F 0 "#PWR02" H 9475 1650 50  0001 C CNN
F 1 "+12V" H 9490 1973 50  0000 C CNN
F 2 "" H 9475 1800 50  0001 C CNN
F 3 "" H 9475 1800 50  0001 C CNN
    1    9475 1800
    1    0    0    -1
$EndComp
Wire Wire Line
    9475 2700 9475 2825
Wire Wire Line
    9875 2825 9475 2825
Connection ~ 9875 2825
Wire Wire Line
    9875 2825 9875 2975
Connection ~ 9475 2825
Wire Wire Line
    9475 2825 9475 2925
Wire Wire Line
    9475 3775 9475 3700
Wire Wire Line
    9475 3300 9475 3225
Wire Wire Line
    9475 2400 9475 2300
Wire Wire Line
    9475 1800 9475 1900
Wire Wire Line
    9475 2825 9375 2825
Wire Wire Line
    8950 3500 8950 2825
Wire Wire Line
    8950 2100 9175 2100
Wire Wire Line
    9075 2825 8950 2825
Connection ~ 8950 2825
Wire Wire Line
    8950 2825 8950 2100
Wire Wire Line
    8775 2825 8850 2825
Wire Wire Line
    8175 2725 8125 2725
Wire Wire Line
    8125 2725 8125 2375
Connection ~ 8125 2375
Wire Wire Line
    8125 2375 8300 2375
Wire Wire Line
    8600 2375 8850 2375
Wire Wire Line
    8850 2375 8850 2825
Connection ~ 8850 2825
Wire Wire Line
    8850 2825 8950 2825
$Comp
L power:GND #PWR03
U 1 1 5ED65B6D
P 7450 2500
F 0 "#PWR03" H 7450 2250 50  0001 C CNN
F 1 "GND" H 7455 2327 50  0000 C CNN
F 2 "" H 7450 2500 50  0001 C CNN
F 3 "" H 7450 2500 50  0001 C CNN
    1    7450 2500
    1    0    0    -1
$EndComp
Wire Wire Line
    7525 2375 7450 2375
Wire Wire Line
    7450 2375 7450 2500
$Comp
L Amplifier_Operational:LM358 IC2
U 1 1 5EDFDF3B
P 6725 3000
F 0 "IC2" H 6800 3175 50  0000 C CNN
F 1 "MC33172" H 6800 2800 50  0000 C CNN
F 2 "AllModules:MX.A8_COMPOSANT_1" H 6725 3000 50  0001 C CNN
F 3 "http://www.ti.com/lit/ds/symlink/lm2904-n.pdf" H 6725 3000 50  0001 C CNN
    1    6725 3000
    1    0    0    -1
$EndComp
Wire Wire Line
    7025 3000 7150 3000
Wire Wire Line
    7150 3000 7150 3475
Wire Wire Line
    5500 4750 5350 4750
Wire Wire Line
    4950 4750 4950 4650
Wire Wire Line
    4950 4850 4950 4750
Connection ~ 4950 4750
$Comp
L power:GND #PWR015
U 1 1 5EE5EBD1
P 4950 5300
F 0 "#PWR015" H 4950 5050 50  0001 C CNN
F 1 "GND" H 4955 5127 50  0000 C CNN
F 2 "" H 4950 5300 50  0001 C CNN
F 3 "" H 4950 5300 50  0001 C CNN
    1    4950 5300
    1    0    0    -1
$EndComp
Wire Wire Line
    4950 5150 4950 5300
$Comp
L power:GND #PWR016
U 1 1 5EE6684B
P 5900 5325
F 0 "#PWR016" H 5900 5075 50  0001 C CNN
F 1 "GND" H 5905 5152 50  0000 C CNN
F 2 "" H 5900 5325 50  0001 C CNN
F 3 "" H 5900 5325 50  0001 C CNN
    1    5900 5325
    1    0    0    -1
$EndComp
$Comp
L power:GND #PWR024
U 1 1 5EE6AC54
P 5350 6125
F 0 "#PWR024" H 5350 5875 50  0001 C CNN
F 1 "GND" H 5355 5952 50  0000 C CNN
F 2 "" H 5350 6125 50  0001 C CNN
F 3 "" H 5350 6125 50  0001 C CNN
    1    5350 6125
    1    0    0    -1
$EndComp
Wire Wire Line
    5500 4950 5350 4950
Wire Wire Line
    5350 4950 5350 5625
Wire Wire Line
    5350 6125 5350 6050
Wire Wire Line
    5900 5250 5900 5325
Wire Wire Line
    5350 5625 6625 5625
Wire Wire Line
    6625 5625 6625 5375
Connection ~ 5350 5625
Wire Wire Line
    5350 5625 5350 5750
Wire Wire Line
    6300 4850 6625 4850
Wire Wire Line
    6625 4850 6625 5075
Wire Wire Line
    5975 4250 5900 4250
Wire Wire Line
    4950 4250 4950 4350
Wire Wire Line
    4950 4250 4300 4250
Connection ~ 4950 4250
Wire Wire Line
    5900 4450 5900 4250
Connection ~ 5900 4250
Wire Wire Line
    5900 4250 4950 4250
$Comp
L power:GND #PWR012
U 1 1 5EECCC0C
P 6400 4475
F 0 "#PWR012" H 6400 4225 50  0001 C CNN
F 1 "GND" H 6405 4302 50  0000 C CNN
F 2 "" H 6400 4475 50  0001 C CNN
F 3 "" H 6400 4475 50  0001 C CNN
    1    6400 4475
    1    0    0    -1
$EndComp
Wire Wire Line
    6275 4250 6400 4250
Wire Wire Line
    6400 4250 6400 4475
Wire Wire Line
    5975 3975 6625 3975
Wire Wire Line
    6625 3975 6625 4850
Connection ~ 6625 4850
Wire Wire Line
    5675 3975 5350 3975
Wire Wire Line
    5350 3975 5350 4750
Connection ~ 5350 4750
Wire Wire Line
    5350 4750 4950 4750
Wire Wire Line
    7150 4750 7150 4850
Wire Wire Line
    7150 4850 6625 4850
$Comp
L power:GND #PWR013
U 1 1 5EF0B672
P 7400 5250
F 0 "#PWR013" H 7400 5000 50  0001 C CNN
F 1 "GND" H 7405 5077 50  0000 C CNN
F 2 "" H 7400 5250 50  0001 C CNN
F 3 "" H 7400 5250 50  0001 C CNN
    1    7400 5250
    1    0    0    -1
$EndComp
$Comp
L power:GND #PWR014
U 1 1 5EF0B9B2
P 7900 5275
F 0 "#PWR014" H 7900 5025 50  0001 C CNN
F 1 "GND" H 7905 5102 50  0000 C CNN
F 2 "" H 7900 5275 50  0001 C CNN
F 3 "" H 7900 5275 50  0001 C CNN
    1    7900 5275
    1    0    0    -1
$EndComp
Wire Wire Line
    7400 5250 7400 5150
Wire Wire Line
    7900 4300 7900 4450
Wire Wire Line
    7900 5275 7900 5175
$Comp
L Connector_Generic:Conn_01x07 J1
U 1 1 5EFBAE64
P 1800 2500
F 0 "J1" H 1800 2075 50  0000 C CNN
F 1 "to CPU board" H 1825 2925 50  0000 C CNN
F 2 "AllModules:BAR7-3-2-COVIDIEN_1" H 1800 2500 50  0001 C CNN
F 3 "~" H 1800 2500 50  0001 C CNN
    1    1800 2500
    -1   0    0    1
$EndComp
Text Notes 875  2225 0    50   ~ 0
INHIB-STOP-INV-CPU
Text Notes 875  2325 0    50   ~ 0
SUPPLY-BUZ-CPU
Text Notes 875  2425 0    50   ~ 0
TEST-BUZZER-CPU
Text Notes 875  2525 0    50   ~ 0
STOP-INV-CPU
Text Notes 875  2625 0    50   ~ 0
PWM-BUZZER-CPU
Text Notes 875  2725 0    50   ~ 0
+5V_CPU
Text Notes 875  2825 0    50   ~ 0
GND
Wire Wire Line
    2000 2600 2600 2600
Wire Wire Line
    2000 2500 2800 2500
Wire Wire Line
    2000 2400 3000 2400
Wire Wire Line
    2600 2300 2000 2300
Wire Wire Line
    2000 2200 3200 2200
Wire Wire Line
    2400 2700 2000 2700
Wire Wire Line
    2200 2800 2000 2800
Wire Wire Line
    2900 2300 4900 2300
Wire Wire Line
    6425 2900 5950 2900
Wire Wire Line
    5950 2900 5950 3125
Wire Wire Line
    6425 3100 6325 3100
Wire Wire Line
    6325 3100 6325 3475
Wire Wire Line
    6325 3475 7150 3475
$Comp
L power:GND #PWR06
U 1 1 5F3608D2
P 5950 3500
F 0 "#PWR06" H 5950 3250 50  0001 C CNN
F 1 "GND" H 5955 3327 50  0000 C CNN
F 2 "" H 5950 3500 50  0001 C CNN
F 3 "" H 5950 3500 50  0001 C CNN
    1    5950 3500
    1    0    0    -1
$EndComp
Wire Wire Line
    5950 3425 5950 3500
$Comp
L Device:C C6
U 1 1 5F37E1A4
P 6600 2400
F 0 "C6" V 6750 2325 50  0000 L CNN
F 1 "680pF" V 6425 2275 50  0000 L CNN
F 2 "AllModules:C0402_1b" H 6638 2250 50  0001 C CNN
F 3 "~" H 6600 2400 50  0001 C CNN
    1    6600 2400
    0    -1   -1   0
$EndComp
Wire Wire Line
    7150 2400 7150 3000
Connection ~ 7150 3000
Wire Wire Line
    6750 2400 7150 2400
$Comp
L power:GND #PWR07
U 1 1 5F3CF03A
P 4900 3500
F 0 "#PWR07" H 4900 3250 50  0001 C CNN
F 1 "GND" H 4905 3327 50  0000 C CNN
F 2 "" H 4900 3500 50  0001 C CNN
F 3 "" H 4900 3500 50  0001 C CNN
    1    4900 3500
    1    0    0    -1
$EndComp
Connection ~ 5950 2900
Wire Wire Line
    5400 2900 5475 2900
Wire Wire Line
    5875 2900 5950 2900
Wire Wire Line
    5475 2900 5475 2400
Wire Wire Line
    5475 2400 6450 2400
Connection ~ 5475 2900
Wire Wire Line
    5475 2900 5575 2900
Wire Wire Line
    7350 4450 7400 4450
Wire Wire Line
    7400 4850 7400 4450
Connection ~ 7400 4450
Wire Wire Line
    7400 4450 7475 4450
Wire Wire Line
    7150 3475 7150 4150
Connection ~ 7150 3475
$Comp
L Amplifier_Operational:LM358 IC3
U 3 1 5F9FC870
P 1575 5825
F 0 "IC3" H 1275 5975 50  0000 C CNN
F 1 "MC33172" H 1225 5625 50  0000 C CNN
F 2 "AllModules:MX.A8_COMPOSANT_1" H 1575 5825 50  0001 C CNN
F 3 "http://www.ti.com/lit/ds/symlink/lm2904-n.pdf" H 1575 5825 50  0001 C CNN
    3    1575 5825
    1    0    0    -1
$EndComp
Wire Wire Line
    1475 6125 1475 6250
Wire Wire Line
    1475 5175 1475 5350
$Comp
L Device:C C11
U 1 1 5FA59D9B
P 1875 6250
F 0 "C11" V 2025 6200 50  0000 L CNN
F 1 "100nF" V 1725 6125 50  0000 L CNN
F 2 "AllModules:C0402_1b" H 1913 6100 50  0001 C CNN
F 3 "~" H 1875 6250 50  0001 C CNN
    1    1875 6250
    0    -1   -1   0
$EndComp
Wire Wire Line
    1725 6250 1475 6250
Connection ~ 1475 6250
Wire Wire Line
    1475 6250 1475 6375
Wire Wire Line
    1725 5350 1475 5350
Connection ~ 1475 5350
Wire Wire Line
    1475 5350 1475 5525
$Comp
L power:GND #PWR022
U 1 1 5FAA2BE8
P 2200 5475
F 0 "#PWR022" H 2200 5225 50  0001 C CNN
F 1 "GND" H 2205 5302 50  0000 C CNN
F 2 "" H 2200 5475 50  0001 C CNN
F 3 "" H 2200 5475 50  0001 C CNN
    1    2200 5475
    1    0    0    -1
$EndComp
$Comp
L power:GND #PWR028
U 1 1 5FAA3129
P 2175 6350
F 0 "#PWR028" H 2175 6100 50  0001 C CNN
F 1 "GND" H 2180 6177 50  0000 C CNN
F 2 "" H 2175 6350 50  0001 C CNN
F 3 "" H 2175 6350 50  0001 C CNN
    1    2175 6350
    1    0    0    -1
$EndComp
Wire Wire Line
    2200 5350 2200 5475
Wire Wire Line
    2025 5350 2200 5350
Wire Wire Line
    2025 6250 2175 6250
Wire Wire Line
    2175 6250 2175 6350
$Comp
L power:+12V #PWR020
U 1 1 5FB28637
P 3050 5175
F 0 "#PWR020" H 3050 5025 50  0001 C CNN
F 1 "+12V" H 3065 5348 50  0000 C CNN
F 2 "" H 3050 5175 50  0001 C CNN
F 3 "" H 3050 5175 50  0001 C CNN
    1    3050 5175
    1    0    0    -1
$EndComp
$Comp
L power:-12V #PWR031
U 1 1 5FB2863D
P 3050 6375
F 0 "#PWR031" H 3050 6475 50  0001 C CNN
F 1 "-12V" H 3065 6548 50  0000 C CNN
F 2 "" H 3050 6375 50  0001 C CNN
F 3 "" H 3050 6375 50  0001 C CNN
    1    3050 6375
    -1   0    0    1
$EndComp
$Comp
L Device:C C7
U 1 1 5FB28643
P 3450 5350
F 0 "C7" V 3600 5300 50  0000 L CNN
F 1 "100nF" V 3300 5200 50  0000 L CNN
F 2 "AllModules:C0402_1b" H 3488 5200 50  0001 C CNN
F 3 "~" H 3450 5350 50  0001 C CNN
    1    3450 5350
    0    -1   -1   0
$EndComp
Wire Wire Line
    3050 6125 3050 6250
Wire Wire Line
    3050 5175 3050 5350
$Comp
L Device:C C8
U 1 1 5FB28651
P 3450 6250
F 0 "C8" V 3600 6200 50  0000 L CNN
F 1 "100nF" V 3300 6125 50  0000 L CNN
F 2 "AllModules:C0402_1b" H 3488 6100 50  0001 C CNN
F 3 "~" H 3450 6250 50  0001 C CNN
    1    3450 6250
    0    -1   -1   0
$EndComp
Wire Wire Line
    3300 6250 3050 6250
Connection ~ 3050 6250
Wire Wire Line
    3050 6250 3050 6375
Wire Wire Line
    3300 5350 3050 5350
Connection ~ 3050 5350
Wire Wire Line
    3050 5350 3050 5525
$Comp
L power:GND #PWR023
U 1 1 5FB2865D
P 3775 5475
F 0 "#PWR023" H 3775 5225 50  0001 C CNN
F 1 "GND" H 3780 5302 50  0000 C CNN
F 2 "" H 3775 5475 50  0001 C CNN
F 3 "" H 3775 5475 50  0001 C CNN
    1    3775 5475
    1    0    0    -1
$EndComp
$Comp
L power:GND #PWR030
U 1 1 5FB28663
P 3750 6350
F 0 "#PWR030" H 3750 6100 50  0001 C CNN
F 1 "GND" H 3755 6177 50  0000 C CNN
F 2 "" H 3750 6350 50  0001 C CNN
F 3 "" H 3750 6350 50  0001 C CNN
    1    3750 6350
    1    0    0    -1
$EndComp
Wire Wire Line
    3775 5350 3775 5475
Wire Wire Line
    3600 5350 3775 5350
Wire Wire Line
    3600 6250 3750 6250
Wire Wire Line
    3750 6250 3750 6350
Wire Wire Line
    7900 4300 15000 4300
Connection ~ 7900 4300
Wire Wire Line
    7900 4300 7900 2925
Wire Wire Line
    8175 2925 7900 2925
Wire Wire Line
    7825 2375 8125 2375
Wire Wire Line
    8950 3500 9175 3500
Wire Wire Line
    4000 2600 4900 2600
Wire Wire Line
    4000 2750 4900 2750
Connection ~ 2600 2900
Wire Wire Line
    3400 2900 2600 2900
Wire Wire Line
    2600 2600 2600 2900
Connection ~ 3000 2600
Wire Wire Line
    3400 2600 3000 2600
Wire Wire Line
    3000 2400 3000 2600
Wire Wire Line
    3200 2450 3400 2450
Connection ~ 3200 2450
Wire Wire Line
    3200 2200 3200 2450
Wire Wire Line
    2800 2750 3400 2750
Connection ~ 2800 2750
Wire Wire Line
    2800 2500 2800 2750
Wire Wire Line
    2600 2900 2600 3800
Wire Wire Line
    3000 2600 3000 3800
Connection ~ 4250 3325
Wire Wire Line
    4250 3300 4250 3325
$Comp
L power:+5V #PWR05
U 1 1 5F8D454B
P 4250 3300
F 0 "#PWR05" H 4250 3150 50  0001 C CNN
F 1 "+5V" H 4375 3425 50  0000 C CNN
F 2 "" H 4250 3300 50  0001 C CNN
F 3 "" H 4250 3300 50  0001 C CNN
    1    4250 3300
    1    0    0    -1
$EndComp
Wire Wire Line
    3200 2450 3200 3800
$Comp
L power:GND #PWR08
U 1 1 5F26F747
P 4250 3750
F 0 "#PWR08" H 4250 3500 50  0001 C CNN
F 1 "GND" H 4255 3577 50  0000 C CNN
F 2 "" H 4250 3750 50  0001 C CNN
F 3 "" H 4250 3750 50  0001 C CNN
    1    4250 3750
    1    0    0    -1
$EndComp
Wire Wire Line
    4250 3325 4250 3375
Wire Wire Line
    4000 3325 4250 3325
Wire Wire Line
    2800 2750 2800 3800
$Comp
L Device:C C2
U 1 1 5E87D053
P 4250 3525
F 0 "C2" H 4365 3571 50  0000 L CNN
F 1 "220pF" H 4300 3425 50  0000 L CNN
F 2 "AllModules:C0402_1b" H 4288 3375 50  0001 C CNN
F 3 "~" H 4250 3525 50  0001 C CNN
    1    4250 3525
    1    0    0    -1
$EndComp
$Comp
L Device:L_Core_Ferrite L1
U 1 1 5E87AB3F
P 3850 3325
F 0 "L1" V 3950 3325 50  0000 C CNN
F 1 "Core_Ferrite" V 3775 3300 50  0000 C CNN
F 2 "AllModules:RC1206_1" H 3850 3325 50  0001 C CNN
F 3 "~" H 3850 3325 50  0001 C CNN
    1    3850 3325
    0    -1   -1   0
$EndComp
$Comp
L Device:Fuse FU1
U 1 1 5E879854
P 3450 3325
F 0 "FU1" V 3375 3325 50  0000 C CNN
F 1 "500mA" V 3525 3325 50  0000 C CNN
F 2 "AllModules:F6126_1" V 3380 3325 50  0001 C CNN
F 3 "~" H 3450 3325 50  0001 C CNN
    1    3450 3325
    0    1    1    0
$EndComp
Wire Wire Line
    4250 3675 4250 3725
Wire Wire Line
    4250 3725 2200 3725
Wire Wire Line
    2200 2800 2200 3725
Connection ~ 4250 3725
Wire Wire Line
    4250 3725 4250 3750
Wire Wire Line
    3700 3325 3600 3325
Wire Wire Line
    3300 3325 2400 3325
Wire Wire Line
    2400 2700 2400 3325
Wire Wire Line
    4900 2450 4000 2450
$Sheet
S 3500 7600 1500 700
U 5E89C6B8
F0 "GR106768_buzzer_charger" 50
F1 "GR106768_buzzer_charger.sch" 50
F2 "BUZ-ACT" I R 5000 7700 50
F3 "SUPPLY-BUZ" O L 3500 7700 50
F4 "STOP-INV" I L 3500 7800 50
F5 "INHIB-STOP-INV" I L 3500 7900 50
F6 "VBAT" O R 5000 7800 50
F7 "VCHARG" O R 5000 7900 50
$EndSheet
Wire Wire Line
    14525 6575 14525 6650
Wire Wire Line
    14100 7500 14100 7400
Wire Wire Line
    14700 6225 14700 7100
$Comp
L power:GND #PWR021
U 1 1 5EA0E815
P 14525 6650
F 0 "#PWR021" H 14525 6400 50  0001 C CNN
F 1 "GND" H 14530 6477 50  0000 C CNN
F 2 "" H 14525 6650 50  0001 C CNN
F 3 "" H 14525 6650 50  0001 C CNN
    1    14525 6650
    1    0    0    -1
$EndComp
$Comp
L power:GND #PWR027
U 1 1 5E9F8A01
P 14100 7500
F 0 "#PWR027" H 14100 7250 50  0001 C CNN
F 1 "GND" H 14105 7327 50  0000 C CNN
F 2 "" H 14100 7500 50  0001 C CNN
F 3 "" H 14100 7500 50  0001 C CNN
    1    14100 7500
    1    0    0    -1
$EndComp
$Comp
L Amplifier_Operational:LMV321 IC4
U 1 1 5E9F6105
P 14200 7100
F 0 "IC4" H 14350 7250 50  0000 L CNN
F 1 "LMV321" H 14375 7000 50  0000 L CNN
F 2 "AllModules:SOT23-5_1" H 14200 7100 50  0001 L CNN
F 3 "http://www.ti.com/lit/ds/symlink/lmv324.pdf" H 14200 7100 50  0001 C CNN
    1    14200 7100
    1    0    0    -1
$EndComp
Wire Wire Line
    13600 7000 13600 7900
Wire Wire Line
    13600 7000 13900 7000
Connection ~ 13600 7000
Wire Wire Line
    13825 7200 13900 7200
Wire Wire Line
    13825 6225 13825 7200
Wire Wire Line
    14100 6525 14100 6575
Wire Wire Line
    14100 6800 14100 6575
Connection ~ 14100 6575
Wire Wire Line
    14500 7100 14700 7100
$Comp
L GR106768_Buzzer:BLA31BD221SN4D FI1
U 1 1 5FB00CBD
P 3700 2700
F 0 "FI1" H 3700 3150 50  0000 C CNN
F 1 "BLA31BD221SN4D" H 3700 2350 50  0000 C CNN
F 2 "AllModules:WE-FA_1" H 3300 2200 50  0001 L BNN
F 3 "1206 Murata" H 3400 1650 50  0001 L BNN
F 4 "Murata Electronics" H 3350 2100 50  0001 L BNN "Champ5"
    1    3700 2700
    1    0    0    -1
$EndComp
$Comp
L GR106768_Buzzer:C_NETWORK C1
U 1 1 5FB0366D
P 2900 4000
F 0 "C1" H 3353 4059 50  0000 L CNN
F 1 "47pF" H 3353 3968 50  0000 L CNN
F 2 "AllModules:C0612-4_1" H 2638 3850 50  0001 C CNN
F 3 "~" H 2600 4000 50  0001 C CNN
    1    2900 4000
    1    0    0    -1
$EndComp
$Comp
L GR106768_Buzzer:LMC7211 IC1
U 1 1 5FB0685F
P 5900 4850
F 0 "IC1" H 5975 5100 50  0000 L CNN
F 1 "LMC7211" H 5975 4575 50  0000 L CNN
F 2 "AllModules:SOT23-5_1" H 5700 4850 50  0001 C CNN
F 3 "" H 5700 4850 50  0001 C CNN
    1    5900 4850
    1    0    0    -1
$EndComp
$Comp
L Amplifier_Operational:LM358 IC3
U 1 1 5E8962E9
P 8475 2825
F 0 "IC3" H 8550 2650 50  0000 C CNN
F 1 "MC33172" H 8600 3000 50  0000 C CNN
F 2 "AllModules:MX.A8_COMPOSANT_1" H 8475 2825 50  0001 C CNN
F 3 "http://www.ti.com/lit/ds/symlink/lm2904-n.pdf" H 8475 2825 50  0001 C CNN
    1    8475 2825
    1    0    0    1
$EndComp
$Comp
L Amplifier_Operational:LM358 IC2
U 3 1 5FB28649
P 3150 5825
F 0 "IC2" H 2850 5975 50  0000 C CNN
F 1 "MC33172" H 2800 5625 50  0000 C CNN
F 2 "AllModules:MX.A8_COMPOSANT_1" H 3150 5825 50  0001 C CNN
F 3 "http://www.ti.com/lit/ds/symlink/lm2904-n.pdf" H 3150 5825 50  0001 C CNN
    3    3150 5825
    1    0    0    -1
$EndComp
$Comp
L GR106768_Buzzer:Buzzer BUZ1
U 1 1 5E96E8FA
P 9975 2575
F 0 "BUZ1" V 10250 2675 50  0000 R CNN
F 1 "PKM33EPH" V 10175 2775 50  0000 R CNN
F 2 "AllModules:PKM33EPH-1201C_1" V 9950 2675 50  0001 C CNN
F 3 "http://datasheetz.com/data/Audio%20Products/Buzzers/490-4687-datasheetz.html" V 9950 2675 50  0001 C CNN
F 4 "muRATA PKM33EPH-1201C" V 9975 2575 50  0001 C CNN "MPN"
    1    9975 2575
    0    -1   -1   0
$EndComp
$Comp
L GR106768_Buzzer:Buzzer BUZ2
U 1 1 5E971F0E
P 9975 3075
F 0 "BUZ2" V 10250 3175 50  0000 R CNN
F 1 "PKM33EPH" V 10175 3275 50  0000 R CNN
F 2 "AllModules:PKM33EPH-1201C_1" V 9950 3175 50  0001 C CNN
F 3 "http://datasheetz.com/data/Audio%20Products/Buzzers/490-4687-datasheetz.html" V 9950 3175 50  0001 C CNN
F 4 "muRATA PKM33EPH-1201C" V 9975 3075 50  0001 C CNN "MPN"
    1    9975 3075
    0    1    1    0
$EndComp
$Comp
L GR106768_Buzzer:R0402_200k_1% R69
U 1 1 5EA89989
P 13850 7900
F 0 "R69" H 13850 8000 50  0000 C CNN
F 1 "200k" H 13850 7900 50  0000 C CNN
F 2 "AllModules:R0402_1" H 13850 8100 50  0001 C CNN
F 3 "~" H 13850 7900 50  0001 C CNN
F 4 "RESISTOR, 200k, +/-1%, 0.063W, 0402" H 13850 8100 50  0001 C CNN "Description"
F 5 "10023292" H 13850 8100 50  0000 C CNN "Item Number"
    1    13850 7900
    1    0    0    -1
$EndComp
$Comp
L GR106768_Buzzer:R0402_100k_1% R59
U 1 1 5EA8B1EB
P 13500 8250
F 0 "R59" H 13500 8350 50  0000 C CNN
F 1 "100k" H 13500 8250 50  0000 C CNN
F 2 "AllModules:R0402_1" H 13500 8450 50  0001 C CNN
F 3 "~" H 13500 8250 50  0001 C CNN
F 4 "RESISTOR, 100k, +/-1%, 0.063W, 0402" H 13500 8450 50  0001 C CNN "Description"
F 5 "10022149" H 13500 8450 50  0000 C CNN "Item Number"
    1    13500 8250
    0    1    1    0
$EndComp
$Comp
L GR106768_Buzzer:R0402_100k_1% R24
U 1 1 5EA8E1A5
P 13250 7000
F 0 "R24" H 13250 7100 50  0000 C CNN
F 1 "100k" H 13250 7000 50  0000 C CNN
F 2 "AllModules:R0402_1" H 13250 7200 50  0001 C CNN
F 3 "~" H 13250 7000 50  0001 C CNN
F 4 "RESISTOR, 100k, +/-1%, 0.063W, 0402" H 13250 7200 50  0001 C CNN "Description"
F 5 "10022149" H 13325 6900 50  0000 C CNN "Item Number"
    1    13250 7000
    1    0    0    -1
$EndComp
$Comp
L GR106768_Buzzer:R0402_100k_1% R29
U 1 1 5EA90255
P 14400 6225
F 0 "R29" H 14400 6325 50  0000 C CNN
F 1 "100k" H 14400 6225 50  0000 C CNN
F 2 "AllModules:R0402_1" H 14400 6425 50  0001 C CNN
F 3 "~" H 14400 6225 50  0001 C CNN
F 4 "RESISTOR, 100k, +/-1%, 0.063W, 0402" H 14400 6425 50  0001 C CNN "Description"
F 5 "10022149" H 14400 6425 50  0000 C CNN "Item Number"
    1    14400 6225
    1    0    0    -1
$EndComp
$Comp
L GR106768_Buzzer:R0402_68k_1% R27
U 1 1 5EA91372
P 13550 6225
F 0 "R27" H 13550 6325 50  0000 C CNN
F 1 "68k" H 13550 6225 50  0000 C CNN
F 2 "AllModules:R0402_1" H 13550 6425 50  0001 C CNN
F 3 "~" H 13550 6225 50  0001 C CNN
F 4 "RESISTOR, 68k, +/-1%, 0.063W, 0402" H 13550 6425 50  0001 C CNN "Description"
F 5 "10021556" H 13550 6425 50  0000 C CNN "Item Number"
    1    13550 6225
    1    0    0    -1
$EndComp
$Comp
L GR106768_Buzzer:R0402_2.2k_1% R23
U 1 1 5EA9CBEC
P 12700 6750
F 0 "R23" H 12700 6850 50  0000 C CNN
F 1 "2.2k" H 12700 6750 50  0000 C CNN
F 2 "AllModules:R0402_1" H 12700 6950 50  0001 C CNN
F 3 "~" H 12700 6750 50  0001 C CNN
F 4 "RESISTOR, 2.2k, +/-1%, 0.063W, 0402" H 12700 6950 50  0001 C CNN "Description"
F 5 "10022957" H 12700 6950 50  0000 C CNN "Item Number"
    1    12700 6750
    0    1    1    0
$EndComp
$Comp
L GR106768_Buzzer:R0402_150k_1% R18
U 1 1 5EA9EA69
P 11300 7050
F 0 "R18" H 11300 7150 50  0000 C CNN
F 1 "150k" H 11300 7050 50  0000 C CNN
F 2 "AllModules:R0402_1" H 11300 7250 50  0001 C CNN
F 3 "~" H 11300 7050 50  0001 C CNN
F 4 "RESISTOR, 150k, +/-1%, 0.063W, 0402" H 11300 7250 50  0001 C CNN "Description"
F 5 "10022881" H 11300 7250 50  0000 C CNN "Item Number"
    1    11300 7050
    0    1    1    0
$EndComp
Wire Wire Line
    12900 2500 12400 2500
Wire Wire Line
    12900 1500 12900 1600
Connection ~ 12900 1500
Wire Wire Line
    12525 1500 12525 2800
Wire Wire Line
    12900 1500 12525 1500
Wire Wire Line
    12900 3475 12900 3400
Connection ~ 12900 3475
Wire Wire Line
    12525 3475 12525 3100
Wire Wire Line
    12900 3475 12525 3475
Wire Wire Line
    12900 1425 12900 1500
Wire Wire Line
    13400 1800 13400 2500
Wire Wire Line
    13200 1800 13400 1800
Wire Wire Line
    13400 2500 13525 2500
Connection ~ 13400 2500
Wire Wire Line
    13400 3200 13200 3200
Wire Wire Line
    13400 2500 13400 3200
Wire Wire Line
    12900 2075 12900 2000
Wire Wire Line
    12900 2500 12900 2625
Connection ~ 12900 2500
Wire Wire Line
    13000 2500 12900 2500
Wire Wire Line
    12900 2375 12900 2500
Wire Wire Line
    12900 3000 12900 2925
Wire Wire Line
    12900 3525 12900 3475
Wire Wire Line
    13525 2500 13625 2500
Connection ~ 13525 2500
Wire Wire Line
    13525 1950 13525 2500
Wire Wire Line
    13825 1950 13525 1950
Wire Wire Line
    13300 2500 13400 2500
Wire Wire Line
    14350 1950 14350 2400
Wire Wire Line
    14125 1950 14350 1950
Wire Wire Line
    14225 2400 14350 2400
Wire Wire Line
    14350 2600 14350 2725
Wire Wire Line
    14225 2600 14350 2600
$Comp
L power:-12V #PWR010
U 1 1 5E99DE51
P 12900 3525
F 0 "#PWR010" H 12900 3625 50  0001 C CNN
F 1 "-12V" H 12915 3698 50  0000 C CNN
F 2 "" H 12900 3525 50  0001 C CNN
F 3 "" H 12900 3525 50  0001 C CNN
    1    12900 3525
    -1   0    0    1
$EndComp
$Comp
L power:+12V #PWR01
U 1 1 5E99DE4B
P 12900 1425
F 0 "#PWR01" H 12900 1275 50  0001 C CNN
F 1 "+12V" H 12915 1598 50  0000 C CNN
F 2 "" H 12900 1425 50  0001 C CNN
F 3 "" H 12900 1425 50  0001 C CNN
    1    12900 1425
    1    0    0    -1
$EndComp
$Comp
L Device:CP C12
U 1 1 5E95457C
P 12525 2950
F 0 "C12" H 12550 3075 50  0000 L CNN
F 1 "470μF" H 12275 2825 50  0000 L CNN
F 2 "AllModules:AX10X30_1" H 12563 2800 50  0001 C CNN
F 3 "~" H 12525 2950 50  0001 C CNN
    1    12525 2950
    1    0    0    -1
$EndComp
$Comp
L power:GND #PWR04
U 1 1 5E939516
P 14350 2725
F 0 "#PWR04" H 14350 2475 50  0001 C CNN
F 1 "GND" H 14355 2552 50  0000 C CNN
F 2 "" H 14350 2725 50  0001 C CNN
F 3 "" H 14350 2725 50  0001 C CNN
    1    14350 2725
    1    0    0    -1
$EndComp
$Comp
L Transistor_BJT:BC847 T3
U 1 1 5E91F7C5
P 13000 1800
F 0 "T3" H 12875 1925 50  0000 L CNN
F 1 "BC847" H 13150 1700 50  0000 L CNN
F 2 "AllModules:SOT23-BEC_1" H 13200 1725 50  0001 L CIN
F 3 "http://www.infineon.com/dgdl/Infineon-BC847SERIES_BC848SERIES_BC849SERIES_BC850SERIES-DS-v01_01-en.pdf?fileId=db3a304314dca389011541d4630a1657" H 13000 1800 50  0001 L CNN
    1    13000 1800
    -1   0    0    -1
$EndComp
$Comp
L Transistor_BJT:BC857 T4
U 1 1 5E91F7BF
P 13000 3200
F 0 "T4" H 12875 3075 50  0000 L CNN
F 1 "BC857" H 13150 3300 50  0000 L CNN
F 2 "AllModules:SOT23-BEC_1" H 13200 3125 50  0001 L CIN
F 3 "http://www.fairchildsemi.com/ds/BC/BC856.pdf" H 13000 3200 50  0001 L CNN
    1    13000 3200
    -1   0    0    1
$EndComp
$Comp
L Amplifier_Operational:LM358 IC3
U 2 1 5E906CDE
P 13925 2500
F 0 "IC3" H 14000 2675 50  0000 C CNN
F 1 "MC33172" H 14000 2300 50  0000 C CNN
F 2 "AllModules:MX.A8_COMPOSANT_1" H 13925 2500 50  0001 C CNN
F 3 "http://www.ti.com/lit/ds/symlink/lm2904-n.pdf" H 13925 2500 50  0001 C CNN
    2    13925 2500
    -1   0    0    1
$EndComp
$Comp
L Diode:BAT54S D4
U 1 1 5E8F2FE5
P 12200 2500
F 0 "D4" V 12125 2350 50  0000 L CNN
F 1 "BAT54S" V 12450 2200 50  0000 L CNN
F 2 "AllModules:SOT23-1G_1" H 12275 2625 50  0001 L CNN
F 3 "https://www.diodes.com/assets/Datasheets/ds11005.pdf" H 12080 2500 50  0001 C CNN
    1    12200 2500
    0    -1   -1   0
$EndComp
$Comp
L GR106768_Buzzer:R0402_33Ohm_1% R15
U 1 1 5EADE678
P 11500 2450
F 0 "R15" H 11500 2550 50  0000 C CNN
F 1 "33" H 11500 2450 50  0000 C CNN
F 2 "AllModules:R0402_1" H 11500 2650 50  0001 C CNN
F 3 "~" H 11500 2450 50  0001 C CNN
F 4 "RESISTOR, 33Ohm, +/-1%, 0.063W, 0402" H 11500 2650 50  0001 C CNN "Description"
F 5 "10022745" H 11500 2650 50  0000 C CNN "Item Number"
    1    11500 2450
    0    1    1    0
$EndComp
$Comp
L GR106768_Buzzer:R0402_150k_1% R21
U 1 1 5EADFF19
P 12250 5900
F 0 "R21" H 12250 6000 50  0000 C CNN
F 1 "150k" H 12250 5900 50  0000 C CNN
F 2 "AllModules:R0402_1" H 12250 6100 50  0001 C CNN
F 3 "~" H 12250 5900 50  0001 C CNN
F 4 "RESISTOR, 150k, +/-1%, 0.063W, 0402" H 12250 6100 50  0001 C CNN "Description"
F 5 "10022881" H 12250 6100 50  0000 C CNN "Item Number"
    1    12250 5900
    -1   0    0    1
$EndComp
$Comp
L GR106768_Buzzer:R0402_10k_1% R16
U 1 1 5EAE2485
P 11700 4850
F 0 "R16" H 11700 4950 50  0000 C CNN
F 1 "10k" H 11700 4850 50  0000 C CNN
F 2 "AllModules:R0402_1" H 11700 5050 50  0001 C CNN
F 3 "~" H 11700 4850 50  0001 C CNN
F 4 "RESISTOR, 10k, +/-1%, 0.063W, 0402" H 11700 5050 50  0001 C CNN "Description"
F 5 "10022150" H 11700 5050 50  0000 C CNN "Item Number"
    1    11700 4850
    0    1    1    0
$EndComp
$Comp
L GR106768_Buzzer:R0402_10k_1% R17
U 1 1 5EAE3A2A
P 11300 5150
F 0 "R17" H 11300 5250 50  0000 C CNN
F 1 "10k" H 11300 5150 50  0000 C CNN
F 2 "AllModules:R0402_1" H 11300 5350 50  0001 C CNN
F 3 "~" H 11300 5150 50  0001 C CNN
F 4 "RESISTOR, 10k, +/-1%, 0.063W, 0402" H 11300 5350 50  0001 C CNN "Description"
F 5 "10022150" H 11300 5350 50  0000 C CNN "Item Number"
    1    11300 5150
    0    1    1    0
$EndComp
$Comp
L GR106768_Buzzer:R0402_32.4k_1% R28
U 1 1 5EAE478D
P 14700 2400
F 0 "R28" H 14700 2500 50  0000 C CNN
F 1 "32.4k" H 14700 2400 50  0000 C CNN
F 2 "AllModules:R0402_1" H 14700 2600 50  0001 C CNN
F 3 "~" H 14700 2400 50  0001 C CNN
F 4 "RESISTOR, 32.4k, +/-1%, 0.063W, 0402" H 14700 2600 50  0001 C CNN "Description"
F 5 "10022154" H 14700 2600 50  0000 C CNN "Item Number"
    1    14700 2400
    1    0    0    -1
$EndComp
$Comp
L GR106768_Buzzer:R0402_137k_1% R26
U 1 1 5EAE68B0
P 13975 1950
F 0 "R26" H 13975 2050 50  0000 C CNN
F 1 "137k" H 13975 1950 50  0000 C CNN
F 2 "AllModules:R0402_1" H 13975 2150 50  0001 C CNN
F 3 "~" H 13975 1950 50  0001 C CNN
F 4 "RESISTOR, 137k, +/-1%, 0.063W, 0402" H 13975 2150 50  0001 C CNN "Description"
F 5 "10021468" H 13975 2150 50  0000 C CNN "Item Number"
    1    13975 1950
    1    0    0    -1
$EndComp
$Comp
L GR106768_Buzzer:R0402_470Ohm_1% R22
U 1 1 5EAE98B3
P 13150 2500
F 0 "R22" H 13150 2600 50  0000 C CNN
F 1 "470" H 13150 2500 50  0000 C CNN
F 2 "AllModules:R0402_1" H 13150 2700 50  0001 C CNN
F 3 "~" H 13150 2500 50  0001 C CNN
F 4 "RESISTOR, 470Ohm, +/-1%, 0.063W, 0402" H 13150 2700 50  0001 C CNN "Description"
F 5 "10022156" H 13150 2700 50  0000 C CNN "Item Number"
    1    13150 2500
    1    0    0    -1
$EndComp
$Comp
L GR106768_Buzzer:R0402_1.5Ohm_1% R19
U 1 1 5EAEB7F1
P 12900 2225
F 0 "R19" H 12900 2325 50  0000 C CNN
F 1 "1.5" H 12900 2225 50  0000 C CNN
F 2 "AllModules:R0402_1" H 12900 2425 50  0001 C CNN
F 3 "~" H 12900 2225 50  0001 C CNN
F 4 "RESISTOR, 1.5Ohm, +/-1%, 0.063W, 0402" H 12900 2425 50  0001 C CNN "Description"
F 5 "10022725" H 12900 2425 50  0000 C CNN "Item Number"
    1    12900 2225
    0    1    1    0
$EndComp
$Comp
L GR106768_Buzzer:R0402_1.5Ohm_1% R20
U 1 1 5EAEDC7F
P 12900 2775
F 0 "R20" H 12900 2875 50  0000 C CNN
F 1 "1.5" H 12900 2775 50  0000 C CNN
F 2 "AllModules:R0402_1" H 12900 2975 50  0001 C CNN
F 3 "~" H 12900 2775 50  0001 C CNN
F 4 "RESISTOR, 1.5Ohm, +/-1%, 0.063W, 0402" H 12900 2975 50  0001 C CNN "Description"
F 5 "10022725" H 12900 2975 50  0000 C CNN "Item Number"
    1    12900 2775
    0    1    1    0
$EndComp
$Comp
L GR106768_Buzzer:R0402_1.5Ohm_1% R13
U 1 1 5EAEECA2
P 9475 2550
F 0 "R13" H 9475 2650 50  0000 C CNN
F 1 "1.5" H 9475 2550 50  0000 C CNN
F 2 "AllModules:R0402_1" H 9475 2750 50  0001 C CNN
F 3 "~" H 9475 2550 50  0001 C CNN
F 4 "RESISTOR, 1.5Ohm, +/-1%, 0.063W, 0402" H 9475 2750 50  0001 C CNN "Description"
F 5 "10022725" H 9475 2750 50  0000 C CNN "Item Number"
    1    9475 2550
    0    1    1    0
$EndComp
$Comp
L GR106768_Buzzer:R0402_1.5Ohm_1% R14
U 1 1 5EAF08D9
P 9475 3075
F 0 "R14" H 9475 3175 50  0000 C CNN
F 1 "1.5" H 9475 3075 50  0000 C CNN
F 2 "AllModules:R0402_1" H 9475 3275 50  0001 C CNN
F 3 "~" H 9475 3075 50  0001 C CNN
F 4 "RESISTOR, 1.5Ohm, +/-1%, 0.063W, 0402" H 9475 3275 50  0001 C CNN "Description"
F 5 "10022725" H 9475 3275 50  0000 C CNN "Item Number"
    1    9475 3075
    0    1    1    0
$EndComp
$Comp
L GR106768_Buzzer:R0402_470Ohm_1% R12
U 1 1 5EAF15D6
P 9225 2825
F 0 "R12" H 9225 2925 50  0000 C CNN
F 1 "470" H 9225 2825 50  0000 C CNN
F 2 "AllModules:R0402_1" H 9225 3025 50  0001 C CNN
F 3 "~" H 9225 2825 50  0001 C CNN
F 4 "RESISTOR, 470Ohm, +/-1%, 0.063W, 0402" H 9225 3025 50  0001 C CNN "Description"
F 5 "10022156" H 9225 3025 50  0000 C CNN "Item Number"
    1    9225 2825
    1    0    0    -1
$EndComp
$Comp
L GR106768_Buzzer:R0402_32.4k_1% R9
U 1 1 5EAF2BD4
P 7675 2375
F 0 "R9" H 7675 2475 50  0000 C CNN
F 1 "32.4k" H 7675 2375 50  0000 C CNN
F 2 "AllModules:R0402_1" H 7675 2575 50  0001 C CNN
F 3 "~" H 7675 2375 50  0001 C CNN
F 4 "RESISTOR, 32.4k, +/-1%, 0.063W, 0402" H 7675 2575 50  0001 C CNN "Description"
F 5 "10022154" H 7675 2575 50  0000 C CNN "Item Number"
    1    7675 2375
    1    0    0    -1
$EndComp
$Comp
L GR106768_Buzzer:R0402_105k_1% R11
U 1 1 5EAF4C77
P 8450 2375
F 0 "R11" H 8450 2475 50  0000 C CNN
F 1 "105k" H 8450 2375 50  0000 C CNN
F 2 "AllModules:R0402_1" H 8450 2575 50  0001 C CNN
F 3 "~" H 8450 2375 50  0001 C CNN
F 4 "RESISTOR, 105k, +/-1%, 0.063W, 0402" H 8450 2575 50  0001 C CNN "Description"
F 5 "10022155" H 8450 2575 50  0000 C CNN "Item Number"
    1    8450 2375
    1    0    0    -1
$EndComp
$Comp
L GR106768_Buzzer:R0402_100k_1% R10
U 1 1 5EAF61C9
P 7900 5025
F 0 "R10" H 7900 5125 50  0000 C CNN
F 1 "100k" H 7900 5025 50  0000 C CNN
F 2 "AllModules:R0402_1" H 7900 5225 50  0001 C CNN
F 3 "~" H 7900 5025 50  0001 C CNN
F 4 "RESISTOR, 100k, +/-1%, 0.063W, 0402" H 7900 5225 50  0001 C CNN "Description"
F 5 "10022149" H 7900 5225 50  0000 C CNN "Item Number"
    1    7900 5025
    0    1    1    0
$EndComp
$Comp
L GR106768_Buzzer:R0402_100k_1% R2
U 1 1 5EAF8964
P 4950 4500
F 0 "R2" H 4950 4600 50  0000 C CNN
F 1 "100k" H 4950 4500 50  0000 C CNN
F 2 "AllModules:R0402_1" H 4950 4700 50  0001 C CNN
F 3 "~" H 4950 4500 50  0001 C CNN
F 4 "RESISTOR, 100k, +/-1%, 0.063W, 0402" H 4950 4700 50  0001 C CNN "Description"
F 5 "10022149" H 4950 4700 50  0000 C CNN "Item Number"
    1    4950 4500
    0    1    1    0
$EndComp
$Comp
L GR106768_Buzzer:R0402_100k_1% R3
U 1 1 5EAFA9E8
P 4950 5000
F 0 "R3" H 4950 5100 50  0000 C CNN
F 1 "100k" H 4950 5000 50  0000 C CNN
F 2 "AllModules:R0402_1" H 4950 5200 50  0001 C CNN
F 3 "~" H 4950 5000 50  0001 C CNN
F 4 "RESISTOR, 100k, +/-1%, 0.063W, 0402" H 4950 5200 50  0001 C CNN "Description"
F 5 "10022149" H 4950 5200 50  0000 C CNN "Item Number"
    1    4950 5000
    0    1    1    0
$EndComp
Wire Wire Line
    11700 5000 11700 5500
Wire Wire Line
    11700 6400 11900 6400
Wire Wire Line
    12400 5500 12700 5500
Wire Wire Line
    12700 5500 12700 5900
Wire Wire Line
    12400 5900 12700 5900
Wire Wire Line
    12100 5900 11700 5900
Connection ~ 11700 5900
Wire Wire Line
    11700 5900 11700 6400
Wire Wire Line
    12100 5500 11700 5500
Connection ~ 11700 5500
Wire Wire Line
    11700 5500 11700 5900
Wire Wire Line
    11800 7200 11800 7350
Wire Wire Line
    11300 7200 11300 7350
Wire Wire Line
    11300 7350 11800 7350
Connection ~ 11800 7350
Wire Wire Line
    11800 7350 11800 7500
Wire Wire Line
    11300 6900 11300 6600
Wire Wire Line
    11300 6600 11800 6600
Wire Wire Line
    11800 6900 11800 6600
Connection ~ 11800 6600
Wire Wire Line
    11800 6600 11900 6600
Wire Wire Line
    11300 5300 11300 6600
Connection ~ 11300 6600
Wire Wire Line
    11700 4700 11700 3000
Wire Wire Line
    11700 3000 12200 3000
Wire Wire Line
    12200 3000 12200 2800
Wire Wire Line
    11000 2800 11000 3000
Wire Wire Line
    11000 3000 11500 3000
Connection ~ 11700 3000
Wire Wire Line
    11300 5000 11300 2000
Wire Wire Line
    10250 2825 10250 2500
Wire Wire Line
    10250 2500 10800 2500
Wire Wire Line
    12200 2200 12200 2000
Wire Wire Line
    12200 2000 11500 2000
Wire Wire Line
    11000 2000 11000 2200
Wire Wire Line
    11500 2600 11500 3000
Connection ~ 11500 3000
Wire Wire Line
    11500 3000 11700 3000
Wire Wire Line
    11500 2300 11500 2000
Connection ~ 11500 2000
Wire Wire Line
    11500 2000 11300 2000
Connection ~ 11300 2000
Wire Wire Line
    11300 2000 11000 2000
Wire Wire Line
    14350 2400 14550 2400
Connection ~ 14350 2400
Wire Wire Line
    14850 2400 15000 2400
Wire Wire Line
    15000 2400 15000 4300
Wire Wire Line
    7775 4450 7900 4450
Connection ~ 7900 4450
Wire Wire Line
    7900 4450 7900 4875
$Comp
L GR106768_Buzzer:R0402_1k_1% R8
U 1 1 5EE632F2
P 7400 5000
F 0 "R8" H 7400 5100 50  0000 C CNN
F 1 "1k" H 7400 5000 50  0000 C CNN
F 2 "AllModules:R0402_1" H 7400 5200 50  0001 C CNN
F 3 "~" H 7400 5000 50  0001 C CNN
F 4 "RESISTOR, 1k, +/-1%, 0.063W, 0402" H 7400 5200 50  0001 C CNN "Description"
F 5 "10022153" H 7400 5200 50  0000 C CNN "Item Number"
    1    7400 5000
    0    1    1    0
$EndComp
$Comp
L GR106768_Buzzer:R0402_51.1k_1% R7
U 1 1 5EE6575D
P 6625 5225
F 0 "R7" H 6625 5325 50  0000 C CNN
F 1 "51.1k" H 6625 5225 50  0000 C CNN
F 2 "AllModules:R0402_1" H 6625 5425 50  0001 C CNN
F 3 "~" H 6625 5225 50  0001 C CNN
F 4 "RESISTOR, 51.1k, +/-1%, 0.063W, 0402" H 6625 5425 50  0001 C CNN "Description"
F 5 "10022152" H 6625 5425 50  0000 C CNN "Item Number"
    1    6625 5225
    0    1    1    0
$EndComp
$Comp
L GR106768_Buzzer:R0402_100k_1% R1
U 1 1 5EE68B27
P 4900 3250
F 0 "R1" H 4900 3350 50  0000 C CNN
F 1 "100k" H 4900 3250 50  0000 C CNN
F 2 "AllModules:R0402_1" H 4900 3450 50  0001 C CNN
F 3 "~" H 4900 3250 50  0001 C CNN
F 4 "RESISTOR, 100k, +/-1%, 0.063W, 0402" H 4900 3450 50  0001 C CNN "Description"
F 5 "10022149" H 4900 3450 50  0000 C CNN "Item Number"
    1    4900 3250
    0    1    1    0
$EndComp
$Comp
L GR106768_Buzzer:R0402_10k_1% R4
U 1 1 5EE69FB2
P 5250 2900
F 0 "R4" H 5250 3000 50  0000 C CNN
F 1 "10k" H 5250 2900 50  0000 C CNN
F 2 "AllModules:R0402_1" H 5250 3100 50  0001 C CNN
F 3 "~" H 5250 2900 50  0001 C CNN
F 4 "RESISTOR, 10k, +/-1%, 0.063W, 0402" H 5250 3100 50  0001 C CNN "Description"
F 5 "10022150" H 5250 3100 50  0000 C CNN "Item Number"
    1    5250 2900
    1    0    0    -1
$EndComp
$Comp
L GR106768_Buzzer:R0402_10k_1% R5
U 1 1 5EE6DF49
P 5725 2900
F 0 "R5" H 5725 3000 50  0000 C CNN
F 1 "10k" H 5725 2900 50  0000 C CNN
F 2 "AllModules:R0402_1" H 5725 3100 50  0001 C CNN
F 3 "~" H 5725 2900 50  0001 C CNN
F 4 "RESISTOR, 10k, +/-1%, 0.063W, 0402" H 5725 3100 50  0001 C CNN "Description"
F 5 "10022150" H 5725 3100 50  0000 C CNN "Item Number"
    1    5725 2900
    1    0    0    -1
$EndComp
$Comp
L GR106768_Buzzer:R0402_59k_1% R6
U 1 1 5EE74830
P 5825 3975
F 0 "R6" H 5825 4075 50  0000 C CNN
F 1 "59k" H 5825 3975 50  0000 C CNN
F 2 "AllModules:R0402_1" H 5825 4175 50  0001 C CNN
F 3 "~" H 5825 3975 50  0001 C CNN
F 4 "RESISTOR, 59k, +/-1%, 0.063W, 0402" H 5825 4175 50  0001 C CNN "Description"
F 5 "10022151" H 5825 4175 50  0000 C CNN "Item Number"
    1    5825 3975
    1    0    0    -1
$EndComp
Wire Wire Line
    4900 3500 4900 3400
Wire Wire Line
    5100 2900 4900 2900
Wire Wire Line
    4900 2900 4900 3100
Connection ~ 4900 2900
Wire Wire Line
    4900 2900 4000 2900
Wire Wire Line
    2600 4200 2600 4300
Wire Wire Line
    2600 4300 2800 4300
Wire Wire Line
    3200 4300 3200 4200
Connection ~ 2600 4300
Wire Wire Line
    2600 4300 2600 4400
Wire Wire Line
    3000 4200 3000 4300
Connection ~ 3000 4300
Wire Wire Line
    3000 4300 3200 4300
Wire Wire Line
    2800 4200 2800 4300
Connection ~ 2800 4300
Wire Wire Line
    2800 4300 3000 4300
Text Label 4900 2300 2    50   ~ 0
SUPPLY-BUZ
Text Label 4900 2450 2    50   ~ 0
INHIB-STOP-INV
Text Label 4900 2600 2    50   ~ 0
TESTBUZ
Text Label 4900 2750 2    50   ~ 0
STOP-INV
Text Label 4300 4250 0    50   ~ 0
SUPPLY-BUZ
Wire Wire Line
    3500 7700 2600 7700
Wire Wire Line
    3500 7800 2600 7800
Wire Wire Line
    2600 7900 3500 7900
Text Label 2600 7700 0    50   ~ 0
SUPPLY-BUZ
Text Label 2600 7900 0    50   ~ 0
INHIB-STOP-INV
Text Label 2600 7800 0    50   ~ 0
STOP-INV
Wire Wire Line
    12700 6600 12700 6500
Connection ~ 12700 5900
Wire Wire Line
    12500 6500 12700 6500
Connection ~ 12700 6500
Wire Wire Line
    12700 6500 12700 5900
Wire Wire Line
    13100 7000 12700 7000
Wire Wire Line
    12700 7000 12700 6900
Wire Wire Line
    12700 7000 12500 7000
Wire Wire Line
    12500 7000 12500 7200
Connection ~ 12700 7000
Wire Wire Line
    12500 7500 12500 7600
Text Label 12100 7000 0    50   ~ 0
BUZ-ACT
Wire Wire Line
    12500 7000 12100 7000
Connection ~ 12500 7000
Text Label 12750 7900 0    50   ~ 0
VBAT
Wire Wire Line
    13100 7900 12750 7900
Wire Wire Line
    13500 7900 13500 8100
Connection ~ 13500 7900
Wire Wire Line
    13500 7900 13600 7900
Wire Wire Line
    13500 8400 13500 8500
Text Label 14350 7900 2    50   ~ 0
VCHARG
Wire Wire Line
    14000 7900 14350 7900
Text Label 5600 7800 2    50   ~ 0
VBAT
Wire Wire Line
    5000 7800 5600 7800
Text Label 5600 7700 2    50   ~ 0
BUZ-ACT
Wire Wire Line
    5000 7700 5600 7700
Text Label 5600 7900 2    50   ~ 0
VCHARG
Wire Wire Line
    5000 7900 5600 7900
Wire Wire Line
    14700 7100 15200 7100
Text Label 15200 7100 2    50   ~ 0
TESTBUZ
Connection ~ 14700 7100
$Comp
L Mechanical:Fiducial J2
U 1 1 5EA28D60
P 7150 7500
F 0 "J2" H 7150 7700 50  0000 C CNN
F 1 "MIRECMS" H 7150 7625 50  0000 C CNN
F 2 "AllModules:MIRECMS-SAFT_1" H 7150 7500 50  0001 C CNN
F 3 "~" H 7150 7500 50  0001 C CNN
    1    7150 7500
    1    0    0    -1
$EndComp
$Comp
L Mechanical:Fiducial J3
U 1 1 5EA29F64
P 7150 7900
F 0 "J3" H 7150 8100 50  0000 C CNN
F 1 "MIRECMS" H 7150 8025 50  0000 C CNN
F 2 "AllModules:MIRECMS-SAFT_1" H 7150 7900 50  0001 C CNN
F 3 "~" H 7150 7900 50  0001 C CNN
    1    7150 7900
    1    0    0    -1
$EndComp
Text Notes 6800 7100 0    100  ~ 0
FIDUCIALS
Text Notes 6800 8500 0    100  ~ 0
HOLES
$Comp
L Mechanical:MountingHole H1
U 1 1 5EA3F179
P 6900 8750
F 0 "H1" H 7000 8796 50  0000 L CNN
F 1 "PadHole" H 7000 8705 50  0000 L CNN
F 2 "AllModules:ThroughHole_60milx12mil_Pad_Cu_Mask" H 6900 8750 50  0001 C CNN
F 3 "~" H 6900 8750 50  0001 C CNN
    1    6900 8750
    1    0    0    -1
$EndComp
$Comp
L Mechanical:MountingHole H2
U 1 1 5EA41143
P 6900 8900
F 0 "H2" H 7000 8946 50  0000 L CNN
F 1 "PadHole" H 7000 8855 50  0000 L CNN
F 2 "AllModules:ThroughHole_60milx12mil_Pad_Cu_Mask" H 6900 8900 50  0001 C CNN
F 3 "~" H 6900 8900 50  0001 C CNN
    1    6900 8900
    1    0    0    -1
$EndComp
$Comp
L Mechanical:MountingHole H3
U 1 1 5EA441E6
P 6900 9050
F 0 "H3" H 7000 9096 50  0000 L CNN
F 1 "PadHole" H 7000 9005 50  0000 L CNN
F 2 "AllModules:ThroughHole_60milx12mil_Pad_Cu_Mask" H 6900 9050 50  0001 C CNN
F 3 "~" H 6900 9050 50  0001 C CNN
    1    6900 9050
    1    0    0    -1
$EndComp
$Comp
L Mechanical:MountingHole H4
U 1 1 5EA441F0
P 6900 9200
F 0 "H4" H 7000 9246 50  0000 L CNN
F 1 "PadHole" H 7000 9155 50  0000 L CNN
F 2 "AllModules:ThroughHole_60milx12mil_Pad_Cu_Mask" H 6900 9200 50  0001 C CNN
F 3 "~" H 6900 9200 50  0001 C CNN
    1    6900 9200
    1    0    0    -1
$EndComp
$Comp
L Mechanical:MountingHole H5
U 1 1 5EA60AEA
P 6900 9350
F 0 "H5" H 7000 9396 50  0000 L CNN
F 1 "PadHole" H 7000 9305 50  0000 L CNN
F 2 "AllModules:ThroughHole_60milx12mil_Pad_Cu_Mask" H 6900 9350 50  0001 C CNN
F 3 "~" H 6900 9350 50  0001 C CNN
    1    6900 9350
    1    0    0    -1
$EndComp
$Comp
L Mechanical:MountingHole H6
U 1 1 5EA60AF0
P 6900 9500
F 0 "H6" H 7000 9546 50  0000 L CNN
F 1 "PadHole" H 7000 9455 50  0000 L CNN
F 2 "AllModules:ThroughHole_60milx12mil_Pad_Cu_Mask" H 6900 9500 50  0001 C CNN
F 3 "~" H 6900 9500 50  0001 C CNN
    1    6900 9500
    1    0    0    -1
$EndComp
$Comp
L Mechanical:MountingHole H7
U 1 1 5EA60AF6
P 6900 9650
F 0 "H7" H 7000 9696 50  0000 L CNN
F 1 "PadHole" H 7000 9605 50  0000 L CNN
F 2 "AllModules:ThroughHole_60milx12mil_Pad_Cu_Mask" H 6900 9650 50  0001 C CNN
F 3 "~" H 6900 9650 50  0001 C CNN
    1    6900 9650
    1    0    0    -1
$EndComp
$Comp
L Mechanical:MountingHole H8
U 1 1 5EA60AFC
P 6900 9800
F 0 "H8" H 7000 9846 50  0000 L CNN
F 1 "PadHole" H 7000 9755 50  0000 L CNN
F 2 "AllModules:ThroughHole_60milx12mil_Pad_Cu_Mask" H 6900 9800 50  0001 C CNN
F 3 "~" H 6900 9800 50  0001 C CNN
    1    6900 9800
    1    0    0    -1
$EndComp
$Comp
L Mechanical:MountingHole H9
U 1 1 5EA79738
P 6900 9950
F 0 "H9" H 7000 9996 50  0000 L CNN
F 1 "PadHole" H 7000 9905 50  0000 L CNN
F 2 "AllModules:ThroughHole_60milx12mil_Pad_Cu_Mask" H 6900 9950 50  0001 C CNN
F 3 "~" H 6900 9950 50  0001 C CNN
    1    6900 9950
    1    0    0    -1
$EndComp
$Comp
L Mechanical:MountingHole H10
U 1 1 5EA7973E
P 6900 10100
F 0 "H10" H 7000 10146 50  0000 L CNN
F 1 "PadHole" H 7000 10055 50  0000 L CNN
F 2 "AllModules:ThroughHole_60milx12mil_Pad_Cu_Mask" H 6900 10100 50  0001 C CNN
F 3 "~" H 6900 10100 50  0001 C CNN
    1    6900 10100
    1    0    0    -1
$EndComp
$Comp
L Mechanical:MountingHole H11
U 1 1 5EA79744
P 6900 10250
F 0 "H11" H 7000 10296 50  0000 L CNN
F 1 "PadHole" H 7000 10205 50  0000 L CNN
F 2 "AllModules:ThroughHole_60milx12mil_Pad_Cu_Mask" H 6900 10250 50  0001 C CNN
F 3 "~" H 6900 10250 50  0001 C CNN
    1    6900 10250
    1    0    0    -1
$EndComp
$Comp
L Mechanical:MountingHole H12
U 1 1 5EA7974A
P 6900 10400
F 0 "H12" H 7000 10446 50  0000 L CNN
F 1 "PadHole" H 7000 10355 50  0000 L CNN
F 2 "AllModules:ThroughHole_60milx12mil_Pad_Cu_Mask" H 6900 10400 50  0001 C CNN
F 3 "~" H 6900 10400 50  0001 C CNN
    1    6900 10400
    1    0    0    -1
$EndComp
$Comp
L Mechanical:MountingHole H13
U 1 1 5EA79750
P 6900 10550
F 0 "H13" H 7000 10596 50  0000 L CNN
F 1 "PadHole" H 7000 10505 50  0000 L CNN
F 2 "AllModules:ThroughHole_60milx12mil_Pad_Cu_Mask" H 6900 10550 50  0001 C CNN
F 3 "~" H 6900 10550 50  0001 C CNN
    1    6900 10550
    1    0    0    -1
$EndComp
$Comp
L Mechanical:MountingHole H14
U 1 1 5EA79756
P 6900 10700
F 0 "H14" H 7000 10746 50  0000 L CNN
F 1 "PadHole" H 7000 10655 50  0000 L CNN
F 2 "AllModules:ThroughHole_60milx12mil_Pad_Cu_Mask" H 6900 10700 50  0001 C CNN
F 3 "~" H 6900 10700 50  0001 C CNN
    1    6900 10700
    1    0    0    -1
$EndComp
$Comp
L Mechanical:MountingHole H15
U 1 1 5EA7975C
P 6900 10850
F 0 "H15" H 7000 10896 50  0000 L CNN
F 1 "PadHole" H 7000 10805 50  0000 L CNN
F 2 "AllModules:ThroughHole_60milx12mil_Pad_Cu_Mask" H 6900 10850 50  0001 C CNN
F 3 "~" H 6900 10850 50  0001 C CNN
    1    6900 10850
    1    0    0    -1
$EndComp
$Comp
L Mechanical:MountingHole H16
U 1 1 5EA79762
P 6900 11000
F 0 "H16" H 7000 11046 50  0000 L CNN
F 1 "PadHole" H 7000 10955 50  0000 L CNN
F 2 "AllModules:ThroughHole_60milx12mil_Pad_Cu_Mask" H 6900 11000 50  0001 C CNN
F 3 "~" H 6900 11000 50  0001 C CNN
    1    6900 11000
    1    0    0    -1
$EndComp
$Comp
L Mechanical:MountingHole H17
U 1 1 5EAC22AB
P 7450 8750
F 0 "H17" H 7550 8796 50  0000 L CNN
F 1 "PadHole" H 7550 8705 50  0000 L CNN
F 2 "AllModules:ThroughHole_60milx12mil_Pad_Cu_Mask" H 7450 8750 50  0001 C CNN
F 3 "~" H 7450 8750 50  0001 C CNN
    1    7450 8750
    1    0    0    -1
$EndComp
$Comp
L Mechanical:MountingHole H18
U 1 1 5EAC22B1
P 7450 8900
F 0 "H18" H 7550 8946 50  0000 L CNN
F 1 "PadHole" H 7550 8855 50  0000 L CNN
F 2 "AllModules:ThroughHole_60milx12mil_Pad_Cu_Mask" H 7450 8900 50  0001 C CNN
F 3 "~" H 7450 8900 50  0001 C CNN
    1    7450 8900
    1    0    0    -1
$EndComp
$Comp
L Mechanical:MountingHole H19
U 1 1 5EAC22B7
P 7450 9050
F 0 "H19" H 7550 9096 50  0000 L CNN
F 1 "PadHole" H 7550 9005 50  0000 L CNN
F 2 "AllModules:ThroughHole_60milx12mil_Pad_Cu_Mask" H 7450 9050 50  0001 C CNN
F 3 "~" H 7450 9050 50  0001 C CNN
    1    7450 9050
    1    0    0    -1
$EndComp
$Comp
L Mechanical:MountingHole H20
U 1 1 5EAC22BD
P 7450 9200
F 0 "H20" H 7550 9246 50  0000 L CNN
F 1 "PadHole" H 7550 9155 50  0000 L CNN
F 2 "AllModules:ThroughHole_60milx12mil_Pad_Cu_Mask" H 7450 9200 50  0001 C CNN
F 3 "~" H 7450 9200 50  0001 C CNN
    1    7450 9200
    1    0    0    -1
$EndComp
$Comp
L Mechanical:MountingHole H21
U 1 1 5EAC22C3
P 7450 9350
F 0 "H21" H 7550 9396 50  0000 L CNN
F 1 "PadHole" H 7550 9305 50  0000 L CNN
F 2 "AllModules:ThroughHole_60milx12mil_Pad_Cu_Mask" H 7450 9350 50  0001 C CNN
F 3 "~" H 7450 9350 50  0001 C CNN
    1    7450 9350
    1    0    0    -1
$EndComp
$Comp
L Mechanical:MountingHole H22
U 1 1 5EAC22C9
P 7450 9500
F 0 "H22" H 7550 9546 50  0000 L CNN
F 1 "PadHole" H 7550 9455 50  0000 L CNN
F 2 "AllModules:ThroughHole_60milx12mil_Pad_Cu_Mask" H 7450 9500 50  0001 C CNN
F 3 "~" H 7450 9500 50  0001 C CNN
    1    7450 9500
    1    0    0    -1
$EndComp
$Comp
L Mechanical:MountingHole H23
U 1 1 5EAC22CF
P 7450 9650
F 0 "H23" H 7550 9696 50  0000 L CNN
F 1 "PadHole" H 7550 9605 50  0000 L CNN
F 2 "AllModules:ThroughHole_60milx12mil_Pad_Cu_Mask" H 7450 9650 50  0001 C CNN
F 3 "~" H 7450 9650 50  0001 C CNN
    1    7450 9650
    1    0    0    -1
$EndComp
$Comp
L Mechanical:MountingHole H24
U 1 1 5EAC22D5
P 7450 9800
F 0 "H24" H 7550 9846 50  0000 L CNN
F 1 "PadHole" H 7550 9755 50  0000 L CNN
F 2 "AllModules:ThroughHole_60milx12mil_Pad_Cu_Mask" H 7450 9800 50  0001 C CNN
F 3 "~" H 7450 9800 50  0001 C CNN
    1    7450 9800
    1    0    0    -1
$EndComp
$Comp
L Mechanical:MountingHole H25
U 1 1 5EAC22DB
P 7450 9950
F 0 "H25" H 7550 9996 50  0000 L CNN
F 1 "PadHole" H 7550 9905 50  0000 L CNN
F 2 "AllModules:ThroughHole_60milx12mil_Pad_Cu_Mask" H 7450 9950 50  0001 C CNN
F 3 "~" H 7450 9950 50  0001 C CNN
    1    7450 9950
    1    0    0    -1
$EndComp
$Comp
L Mechanical:MountingHole H26
U 1 1 5EAC22E1
P 7450 10100
F 0 "H26" H 7550 10146 50  0000 L CNN
F 1 "PadHole" H 7550 10055 50  0000 L CNN
F 2 "AllModules:ThroughHole_60milx12mil_Pad_Cu_Mask" H 7450 10100 50  0001 C CNN
F 3 "~" H 7450 10100 50  0001 C CNN
    1    7450 10100
    1    0    0    -1
$EndComp
$Comp
L Mechanical:MountingHole H27
U 1 1 5EAC22E7
P 7450 10250
F 0 "H27" H 7550 10296 50  0000 L CNN
F 1 "PadHole" H 7550 10205 50  0000 L CNN
F 2 "AllModules:ThroughHole_60milx12mil_Pad_Cu_Mask" H 7450 10250 50  0001 C CNN
F 3 "~" H 7450 10250 50  0001 C CNN
    1    7450 10250
    1    0    0    -1
$EndComp
$Comp
L Mechanical:MountingHole H28
U 1 1 5EAC22ED
P 7450 10400
F 0 "H28" H 7550 10446 50  0000 L CNN
F 1 "PadHole" H 7550 10355 50  0000 L CNN
F 2 "AllModules:ThroughHole_60milx12mil_Pad_Cu_Mask" H 7450 10400 50  0001 C CNN
F 3 "~" H 7450 10400 50  0001 C CNN
    1    7450 10400
    1    0    0    -1
$EndComp
$Comp
L Mechanical:MountingHole H29
U 1 1 5EAC22F3
P 7450 10550
F 0 "H29" H 7550 10596 50  0000 L CNN
F 1 "PadHole" H 7550 10505 50  0000 L CNN
F 2 "AllModules:ThroughHole_60milx12mil_Pad_Cu_Mask" H 7450 10550 50  0001 C CNN
F 3 "~" H 7450 10550 50  0001 C CNN
    1    7450 10550
    1    0    0    -1
$EndComp
$Comp
L Mechanical:MountingHole H30
U 1 1 5EAC22F9
P 7450 10700
F 0 "H30" H 7550 10746 50  0000 L CNN
F 1 "PadHole" H 7550 10655 50  0000 L CNN
F 2 "AllModules:ThroughHole_60milx12mil_Pad_Cu_Mask" H 7450 10700 50  0001 C CNN
F 3 "~" H 7450 10700 50  0001 C CNN
    1    7450 10700
    1    0    0    -1
$EndComp
$Comp
L Mechanical:MountingHole H31
U 1 1 5EAC22FF
P 7450 10850
F 0 "H31" H 7550 10896 50  0000 L CNN
F 1 "PadHole" H 7550 10805 50  0000 L CNN
F 2 "AllModules:ThroughHole_60milx12mil_Pad_Cu_Mask" H 7450 10850 50  0001 C CNN
F 3 "~" H 7450 10850 50  0001 C CNN
    1    7450 10850
    1    0    0    -1
$EndComp
$Comp
L Mechanical:MountingHole H32
U 1 1 5EAC2305
P 7450 11000
F 0 "H32" H 7550 11046 50  0000 L CNN
F 1 "PadHole" H 7550 10955 50  0000 L CNN
F 2 "AllModules:ThroughHole_60milx12mil_Pad_Cu_Mask" H 7450 11000 50  0001 C CNN
F 3 "~" H 7450 11000 50  0001 C CNN
    1    7450 11000
    1    0    0    -1
$EndComp
$Comp
L Mechanical:MountingHole H33
U 1 1 5EAE2F39
P 8000 8750
F 0 "H33" H 8100 8796 50  0000 L CNN
F 1 "PadHole" H 8100 8705 50  0000 L CNN
F 2 "AllModules:ThroughHole_60milx12mil_Pad_Cu_Mask" H 8000 8750 50  0001 C CNN
F 3 "~" H 8000 8750 50  0001 C CNN
    1    8000 8750
    1    0    0    -1
$EndComp
$Comp
L Mechanical:MountingHole H34
U 1 1 5EAE2F3F
P 8000 8900
F 0 "H34" H 8100 8946 50  0000 L CNN
F 1 "PadHole" H 8100 8855 50  0000 L CNN
F 2 "AllModules:ThroughHole_60milx12mil_Pad_Cu_Mask" H 8000 8900 50  0001 C CNN
F 3 "~" H 8000 8900 50  0001 C CNN
    1    8000 8900
    1    0    0    -1
$EndComp
$Comp
L Mechanical:MountingHole H35
U 1 1 5EAE2F45
P 8000 9050
F 0 "H35" H 8100 9096 50  0000 L CNN
F 1 "PadHole" H 8100 9005 50  0000 L CNN
F 2 "AllModules:ThroughHole_60milx12mil_Pad_Cu_Mask" H 8000 9050 50  0001 C CNN
F 3 "~" H 8000 9050 50  0001 C CNN
    1    8000 9050
    1    0    0    -1
$EndComp
$Comp
L Mechanical:MountingHole H36
U 1 1 5EAE2F4B
P 8000 9200
F 0 "H36" H 8100 9246 50  0000 L CNN
F 1 "PadHole" H 8100 9155 50  0000 L CNN
F 2 "AllModules:ThroughHole_60milx12mil_Pad_Cu_Mask" H 8000 9200 50  0001 C CNN
F 3 "~" H 8000 9200 50  0001 C CNN
    1    8000 9200
    1    0    0    -1
$EndComp
$Comp
L Mechanical:MountingHole H37
U 1 1 5EAE2F51
P 8000 9350
F 0 "H37" H 8100 9396 50  0000 L CNN
F 1 "PadHole" H 8100 9305 50  0000 L CNN
F 2 "AllModules:ThroughHole_60milx12mil_Pad_Cu_Mask" H 8000 9350 50  0001 C CNN
F 3 "~" H 8000 9350 50  0001 C CNN
    1    8000 9350
    1    0    0    -1
$EndComp
$Comp
L Mechanical:MountingHole H38
U 1 1 5EAE2F57
P 8000 9500
F 0 "H38" H 8100 9546 50  0000 L CNN
F 1 "PadHole" H 8100 9455 50  0000 L CNN
F 2 "AllModules:ThroughHole_60milx12mil_Pad_Cu_Mask" H 8000 9500 50  0001 C CNN
F 3 "~" H 8000 9500 50  0001 C CNN
    1    8000 9500
    1    0    0    -1
$EndComp
$Comp
L Mechanical:MountingHole H39
U 1 1 5EAE2F5D
P 8000 9650
F 0 "H39" H 8100 9696 50  0000 L CNN
F 1 "PadHole" H 8100 9605 50  0000 L CNN
F 2 "AllModules:ThroughHole_60milx12mil_Pad_Cu_Mask" H 8000 9650 50  0001 C CNN
F 3 "~" H 8000 9650 50  0001 C CNN
    1    8000 9650
    1    0    0    -1
$EndComp
$Comp
L Mechanical:MountingHole H40
U 1 1 5EAE2F63
P 8000 9800
F 0 "H40" H 8100 9846 50  0000 L CNN
F 1 "PadHole" H 8100 9755 50  0000 L CNN
F 2 "AllModules:ThroughHole_60milx12mil_Pad_Cu_Mask" H 8000 9800 50  0001 C CNN
F 3 "~" H 8000 9800 50  0001 C CNN
    1    8000 9800
    1    0    0    -1
$EndComp
$Comp
L Mechanical:MountingHole H41
U 1 1 5EAE2F69
P 8000 9950
F 0 "H41" H 8100 9996 50  0000 L CNN
F 1 "PadHole" H 8100 9905 50  0000 L CNN
F 2 "AllModules:ThroughHole_60milx12mil_Pad_Cu_Mask" H 8000 9950 50  0001 C CNN
F 3 "~" H 8000 9950 50  0001 C CNN
    1    8000 9950
    1    0    0    -1
$EndComp
$Comp
L Mechanical:MountingHole H42
U 1 1 5EAE2F6F
P 8000 10100
F 0 "H42" H 8100 10146 50  0000 L CNN
F 1 "PadHole" H 8100 10055 50  0000 L CNN
F 2 "AllModules:ThroughHole_60milx12mil_Pad_Cu_Mask" H 8000 10100 50  0001 C CNN
F 3 "~" H 8000 10100 50  0001 C CNN
    1    8000 10100
    1    0    0    -1
$EndComp
$Comp
L Mechanical:MountingHole H43
U 1 1 5EAE2F75
P 8000 10250
F 0 "H43" H 8100 10296 50  0000 L CNN
F 1 "PadHole" H 8100 10205 50  0000 L CNN
F 2 "AllModules:ThroughHole_60milx12mil_Pad_Cu_Mask" H 8000 10250 50  0001 C CNN
F 3 "~" H 8000 10250 50  0001 C CNN
    1    8000 10250
    1    0    0    -1
$EndComp
$Comp
L Mechanical:MountingHole H44
U 1 1 5EAE2F7B
P 8000 10400
F 0 "H44" H 8100 10446 50  0000 L CNN
F 1 "PadHole" H 8100 10355 50  0000 L CNN
F 2 "AllModules:ThroughHole_60milx12mil_Pad_Cu_Mask" H 8000 10400 50  0001 C CNN
F 3 "~" H 8000 10400 50  0001 C CNN
    1    8000 10400
    1    0    0    -1
$EndComp
$Comp
L Mechanical:MountingHole H45
U 1 1 5EAE2F81
P 8000 10550
F 0 "H45" H 8100 10596 50  0000 L CNN
F 1 "PadHole" H 8100 10505 50  0000 L CNN
F 2 "AllModules:ThroughHole_60milx12mil_Pad_Cu_Mask" H 8000 10550 50  0001 C CNN
F 3 "~" H 8000 10550 50  0001 C CNN
    1    8000 10550
    1    0    0    -1
$EndComp
$Comp
L Mechanical:MountingHole H46
U 1 1 5EAE2F87
P 8000 10700
F 0 "H46" H 8100 10746 50  0000 L CNN
F 1 "PadHole" H 8100 10655 50  0000 L CNN
F 2 "AllModules:ThroughHole_60milx12mil_Pad_Cu_Mask" H 8000 10700 50  0001 C CNN
F 3 "~" H 8000 10700 50  0001 C CNN
    1    8000 10700
    1    0    0    -1
$EndComp
$Comp
L Mechanical:MountingHole H47
U 1 1 5EAE2F8D
P 8000 10850
F 0 "H47" H 8100 10896 50  0000 L CNN
F 1 "PadHole" H 8100 10805 50  0000 L CNN
F 2 "AllModules:ThroughHole_60milx12mil_Pad_Cu_Mask" H 8000 10850 50  0001 C CNN
F 3 "~" H 8000 10850 50  0001 C CNN
    1    8000 10850
    1    0    0    -1
$EndComp
$Comp
L Mechanical:MountingHole H48
U 1 1 5EAE2F93
P 8000 11000
F 0 "H48" H 8100 11046 50  0000 L CNN
F 1 "PadHole" H 8100 10955 50  0000 L CNN
F 2 "AllModules:ThroughHole_60milx12mil_Pad_Cu_Mask" H 8000 11000 50  0001 C CNN
F 3 "~" H 8000 11000 50  0001 C CNN
    1    8000 11000
    1    0    0    -1
$EndComp
$Comp
L Mechanical:MountingHole H49
U 1 1 5EAE2F99
P 8550 8750
F 0 "H49" H 8650 8796 50  0000 L CNN
F 1 "PadHole" H 8650 8705 50  0000 L CNN
F 2 "AllModules:ThroughHole_60milx12mil_Pad_Cu_Mask" H 8550 8750 50  0001 C CNN
F 3 "~" H 8550 8750 50  0001 C CNN
    1    8550 8750
    1    0    0    -1
$EndComp
$Comp
L Mechanical:MountingHole H50
U 1 1 5EAE2F9F
P 8550 8900
F 0 "H50" H 8650 8946 50  0000 L CNN
F 1 "PadHole" H 8650 8855 50  0000 L CNN
F 2 "AllModules:ThroughHole_60milx12mil_Pad_Cu_Mask" H 8550 8900 50  0001 C CNN
F 3 "~" H 8550 8900 50  0001 C CNN
    1    8550 8900
    1    0    0    -1
$EndComp
$Comp
L Mechanical:MountingHole H51
U 1 1 5EAE2FA5
P 8550 9050
F 0 "H51" H 8650 9096 50  0000 L CNN
F 1 "PadHole" H 8650 9005 50  0000 L CNN
F 2 "AllModules:ThroughHole_60milx12mil_Pad_Cu_Mask" H 8550 9050 50  0001 C CNN
F 3 "~" H 8550 9050 50  0001 C CNN
    1    8550 9050
    1    0    0    -1
$EndComp
$Comp
L Mechanical:MountingHole H52
U 1 1 5EAE2FAB
P 8550 9200
F 0 "H52" H 8650 9246 50  0000 L CNN
F 1 "PadHole" H 8650 9155 50  0000 L CNN
F 2 "AllModules:ThroughHole_60milx12mil_Pad_Cu_Mask" H 8550 9200 50  0001 C CNN
F 3 "~" H 8550 9200 50  0001 C CNN
    1    8550 9200
    1    0    0    -1
$EndComp
$Comp
L Mechanical:MountingHole H53
U 1 1 5EAE2FB1
P 8550 9350
F 0 "H53" H 8650 9396 50  0000 L CNN
F 1 "PadHole" H 8650 9305 50  0000 L CNN
F 2 "AllModules:ThroughHole_60milx12mil_Pad_Cu_Mask" H 8550 9350 50  0001 C CNN
F 3 "~" H 8550 9350 50  0001 C CNN
    1    8550 9350
    1    0    0    -1
$EndComp
$Comp
L Mechanical:MountingHole H54
U 1 1 5EAE2FB7
P 8550 9500
F 0 "H54" H 8650 9546 50  0000 L CNN
F 1 "PadHole" H 8650 9455 50  0000 L CNN
F 2 "AllModules:ThroughHole_60milx12mil_Pad_Cu_Mask" H 8550 9500 50  0001 C CNN
F 3 "~" H 8550 9500 50  0001 C CNN
    1    8550 9500
    1    0    0    -1
$EndComp
$Comp
L Mechanical:MountingHole H55
U 1 1 5EAE2FBD
P 8550 9650
F 0 "H55" H 8650 9696 50  0000 L CNN
F 1 "PadHole" H 8650 9605 50  0000 L CNN
F 2 "AllModules:ThroughHole_60milx12mil_Pad_Cu_Mask" H 8550 9650 50  0001 C CNN
F 3 "~" H 8550 9650 50  0001 C CNN
    1    8550 9650
    1    0    0    -1
$EndComp
$Comp
L Mechanical:MountingHole H56
U 1 1 5EAE2FC3
P 8550 9800
F 0 "H56" H 8650 9846 50  0000 L CNN
F 1 "PadHole" H 8650 9755 50  0000 L CNN
F 2 "AllModules:ThroughHole_60milx12mil_Pad_Cu_Mask" H 8550 9800 50  0001 C CNN
F 3 "~" H 8550 9800 50  0001 C CNN
    1    8550 9800
    1    0    0    -1
$EndComp
$Comp
L Mechanical:MountingHole H57
U 1 1 5EAE2FC9
P 8550 9950
F 0 "H57" H 8650 9996 50  0000 L CNN
F 1 "PadHole" H 8650 9905 50  0000 L CNN
F 2 "AllModules:ThroughHole_60milx12mil_Pad_Cu_Mask" H 8550 9950 50  0001 C CNN
F 3 "~" H 8550 9950 50  0001 C CNN
    1    8550 9950
    1    0    0    -1
$EndComp
$Comp
L Mechanical:MountingHole H58
U 1 1 5EAE2FCF
P 8550 10100
F 0 "H58" H 8650 10146 50  0000 L CNN
F 1 "PadHole" H 8650 10055 50  0000 L CNN
F 2 "AllModules:ThroughHole_60milx12mil_Pad_Cu_Mask" H 8550 10100 50  0001 C CNN
F 3 "~" H 8550 10100 50  0001 C CNN
    1    8550 10100
    1    0    0    -1
$EndComp
$Comp
L Mechanical:MountingHole H59
U 1 1 5EAE2FD5
P 8550 10250
F 0 "H59" H 8650 10296 50  0000 L CNN
F 1 "PadHole" H 8650 10205 50  0000 L CNN
F 2 "AllModules:ThroughHole_60milx12mil_Pad_Cu_Mask" H 8550 10250 50  0001 C CNN
F 3 "~" H 8550 10250 50  0001 C CNN
    1    8550 10250
    1    0    0    -1
$EndComp
$Comp
L Mechanical:MountingHole H60
U 1 1 5EAE2FDB
P 8550 10400
F 0 "H60" H 8650 10446 50  0000 L CNN
F 1 "PadHole" H 8650 10355 50  0000 L CNN
F 2 "AllModules:ThroughHole_60milx12mil_Pad_Cu_Mask" H 8550 10400 50  0001 C CNN
F 3 "~" H 8550 10400 50  0001 C CNN
    1    8550 10400
    1    0    0    -1
$EndComp
$Comp
L Mechanical:MountingHole H61
U 1 1 5EAE2FE1
P 8550 10550
F 0 "H61" H 8650 10596 50  0000 L CNN
F 1 "PadHole" H 8650 10505 50  0000 L CNN
F 2 "AllModules:ThroughHole_60milx12mil_Pad_Cu_Mask" H 8550 10550 50  0001 C CNN
F 3 "~" H 8550 10550 50  0001 C CNN
    1    8550 10550
    1    0    0    -1
$EndComp
$Comp
L Mechanical:MountingHole H62
U 1 1 5EAE2FE7
P 8550 10700
F 0 "H62" H 8650 10746 50  0000 L CNN
F 1 "PadHole" H 8650 10655 50  0000 L CNN
F 2 "AllModules:ThroughHole_60milx12mil_Pad_Cu_Mask" H 8550 10700 50  0001 C CNN
F 3 "~" H 8550 10700 50  0001 C CNN
    1    8550 10700
    1    0    0    -1
$EndComp
$Comp
L Mechanical:MountingHole H63
U 1 1 5EAE2FED
P 8550 10850
F 0 "H63" H 8650 10896 50  0000 L CNN
F 1 "PadHole" H 8650 10805 50  0000 L CNN
F 2 "AllModules:ThroughHole_60milx12mil_Pad_Cu_Mask" H 8550 10850 50  0001 C CNN
F 3 "~" H 8550 10850 50  0001 C CNN
    1    8550 10850
    1    0    0    -1
$EndComp
$Comp
L Mechanical:MountingHole H64
U 1 1 5EAE2FF3
P 8550 11000
F 0 "H64" H 8650 11046 50  0000 L CNN
F 1 "PadHole" H 8650 10955 50  0000 L CNN
F 2 "AllModules:ThroughHole_60milx12mil_Pad_Cu_Mask" H 8550 11000 50  0001 C CNN
F 3 "~" H 8550 11000 50  0001 C CNN
    1    8550 11000
    1    0    0    -1
$EndComp
$Comp
L Mechanical:MountingHole H65
U 1 1 5EB064FD
P 9100 8750
F 0 "H65" H 9200 8796 50  0000 L CNN
F 1 "PadHole" H 9200 8705 50  0000 L CNN
F 2 "AllModules:ThroughHole_60milx12mil_Pad_Cu_Mask" H 9100 8750 50  0001 C CNN
F 3 "~" H 9100 8750 50  0001 C CNN
    1    9100 8750
    1    0    0    -1
$EndComp
$Comp
L Mechanical:MountingHole H66
U 1 1 5EB06503
P 9100 8900
F 0 "H66" H 9200 8946 50  0000 L CNN
F 1 "PadHole" H 9200 8855 50  0000 L CNN
F 2 "AllModules:ThroughHole_60milx12mil_Pad_Cu_Mask" H 9100 8900 50  0001 C CNN
F 3 "~" H 9100 8900 50  0001 C CNN
    1    9100 8900
    1    0    0    -1
$EndComp
$Comp
L Mechanical:MountingHole H67
U 1 1 5EB06509
P 9100 9050
F 0 "H67" H 9200 9096 50  0000 L CNN
F 1 "PadHole" H 9200 9005 50  0000 L CNN
F 2 "AllModules:ThroughHole_60milx12mil_Pad_Cu_Mask" H 9100 9050 50  0001 C CNN
F 3 "~" H 9100 9050 50  0001 C CNN
    1    9100 9050
    1    0    0    -1
$EndComp
$Comp
L Mechanical:MountingHole H68
U 1 1 5EB0650F
P 9100 9200
F 0 "H68" H 9200 9246 50  0000 L CNN
F 1 "PadHole" H 9200 9155 50  0000 L CNN
F 2 "AllModules:ThroughHole_60milx12mil_Pad_Cu_Mask" H 9100 9200 50  0001 C CNN
F 3 "~" H 9100 9200 50  0001 C CNN
    1    9100 9200
    1    0    0    -1
$EndComp
$Comp
L Mechanical:MountingHole H69
U 1 1 5EB06515
P 9100 9350
F 0 "H69" H 9200 9396 50  0000 L CNN
F 1 "PadHole" H 9200 9305 50  0000 L CNN
F 2 "AllModules:ThroughHole_60milx12mil_Pad_Cu_Mask" H 9100 9350 50  0001 C CNN
F 3 "~" H 9100 9350 50  0001 C CNN
    1    9100 9350
    1    0    0    -1
$EndComp
$Comp
L Mechanical:MountingHole H70
U 1 1 5EB0651B
P 9100 9500
F 0 "H70" H 9200 9546 50  0000 L CNN
F 1 "PadHole" H 9200 9455 50  0000 L CNN
F 2 "AllModules:ThroughHole_60milx12mil_Pad_Cu_Mask" H 9100 9500 50  0001 C CNN
F 3 "~" H 9100 9500 50  0001 C CNN
    1    9100 9500
    1    0    0    -1
$EndComp
$Comp
L Mechanical:MountingHole H71
U 1 1 5EB06521
P 9100 9650
F 0 "H71" H 9200 9696 50  0000 L CNN
F 1 "PadHole" H 9200 9605 50  0000 L CNN
F 2 "AllModules:ThroughHole_60milx12mil_Pad_Cu_Mask" H 9100 9650 50  0001 C CNN
F 3 "~" H 9100 9650 50  0001 C CNN
    1    9100 9650
    1    0    0    -1
$EndComp
$Comp
L Mechanical:MountingHole H72
U 1 1 5EB06527
P 9100 9800
F 0 "H72" H 9200 9846 50  0000 L CNN
F 1 "PadHole" H 9200 9755 50  0000 L CNN
F 2 "AllModules:ThroughHole_60milx12mil_Pad_Cu_Mask" H 9100 9800 50  0001 C CNN
F 3 "~" H 9100 9800 50  0001 C CNN
    1    9100 9800
    1    0    0    -1
$EndComp
$Comp
L Mechanical:MountingHole H73
U 1 1 5EB0652D
P 9100 9950
F 0 "H73" H 9200 9996 50  0000 L CNN
F 1 "PadHole" H 9200 9905 50  0000 L CNN
F 2 "AllModules:ThroughHole_60milx12mil_Pad_Cu_Mask" H 9100 9950 50  0001 C CNN
F 3 "~" H 9100 9950 50  0001 C CNN
    1    9100 9950
    1    0    0    -1
$EndComp
$Comp
L Mechanical:MountingHole H74
U 1 1 5EB06533
P 9100 10100
F 0 "H74" H 9200 10146 50  0000 L CNN
F 1 "PadHole" H 9200 10055 50  0000 L CNN
F 2 "AllModules:ThroughHole_60milx12mil_Pad_Cu_Mask" H 9100 10100 50  0001 C CNN
F 3 "~" H 9100 10100 50  0001 C CNN
    1    9100 10100
    1    0    0    -1
$EndComp
$Comp
L Mechanical:MountingHole H75
U 1 1 5EB06539
P 9100 10250
F 0 "H75" H 9200 10296 50  0000 L CNN
F 1 "PadHole" H 9200 10205 50  0000 L CNN
F 2 "AllModules:ThroughHole_60milx12mil_Pad_Cu_Mask" H 9100 10250 50  0001 C CNN
F 3 "~" H 9100 10250 50  0001 C CNN
    1    9100 10250
    1    0    0    -1
$EndComp
$Comp
L Mechanical:MountingHole H76
U 1 1 5EB0653F
P 9100 10400
F 0 "H76" H 9200 10446 50  0000 L CNN
F 1 "PadHole" H 9200 10355 50  0000 L CNN
F 2 "AllModules:ThroughHole_60milx12mil_Pad_Cu_Mask" H 9100 10400 50  0001 C CNN
F 3 "~" H 9100 10400 50  0001 C CNN
    1    9100 10400
    1    0    0    -1
$EndComp
$Comp
L Mechanical:MountingHole H77
U 1 1 5EB06545
P 9100 10550
F 0 "H77" H 9200 10596 50  0000 L CNN
F 1 "PadHole" H 9200 10505 50  0000 L CNN
F 2 "AllModules:ThroughHole_60milx12mil_Pad_Cu_Mask" H 9100 10550 50  0001 C CNN
F 3 "~" H 9100 10550 50  0001 C CNN
    1    9100 10550
    1    0    0    -1
$EndComp
$Comp
L Mechanical:MountingHole H78
U 1 1 5EB0654B
P 9100 10700
F 0 "H78" H 9200 10746 50  0000 L CNN
F 1 "PadHole" H 9200 10655 50  0000 L CNN
F 2 "AllModules:ThroughHole_60milx12mil_Pad_Cu_Mask" H 9100 10700 50  0001 C CNN
F 3 "~" H 9100 10700 50  0001 C CNN
    1    9100 10700
    1    0    0    -1
$EndComp
$Comp
L Mechanical:MountingHole H79
U 1 1 5EB06551
P 9100 10850
F 0 "H79" H 9200 10896 50  0000 L CNN
F 1 "PadHole" H 9200 10805 50  0000 L CNN
F 2 "AllModules:ThroughHole_60milx12mil_Pad_Cu_Mask" H 9100 10850 50  0001 C CNN
F 3 "~" H 9100 10850 50  0001 C CNN
    1    9100 10850
    1    0    0    -1
$EndComp
$Comp
L Mechanical:MountingHole H80
U 1 1 5EB06557
P 9100 11000
F 0 "H80" H 9200 11046 50  0000 L CNN
F 1 "PadHole" H 9200 10955 50  0000 L CNN
F 2 "AllModules:ThroughHole_60milx12mil_Pad_Cu_Mask" H 9100 11000 50  0001 C CNN
F 3 "~" H 9100 11000 50  0001 C CNN
    1    9100 11000
    1    0    0    -1
$EndComp
$Comp
L Mechanical:MountingHole H81
U 1 1 5EB0655D
P 9650 8750
F 0 "H81" H 9750 8796 50  0000 L CNN
F 1 "PadHole" H 9750 8705 50  0000 L CNN
F 2 "AllModules:ThroughHole_60milx12mil_Pad_Cu_Mask" H 9650 8750 50  0001 C CNN
F 3 "~" H 9650 8750 50  0001 C CNN
    1    9650 8750
    1    0    0    -1
$EndComp
$Comp
L Mechanical:MountingHole H82
U 1 1 5EB06563
P 9650 8900
F 0 "H82" H 9750 8946 50  0000 L CNN
F 1 "PadHole" H 9750 8855 50  0000 L CNN
F 2 "AllModules:ThroughHole_60milx12mil_Pad_Cu_Mask" H 9650 8900 50  0001 C CNN
F 3 "~" H 9650 8900 50  0001 C CNN
    1    9650 8900
    1    0    0    -1
$EndComp
$Comp
L Mechanical:MountingHole H83
U 1 1 5EB06569
P 9650 9050
F 0 "H83" H 9750 9096 50  0000 L CNN
F 1 "PadHole" H 9750 9005 50  0000 L CNN
F 2 "AllModules:ThroughHole_60milx12mil_Pad_Cu_Mask" H 9650 9050 50  0001 C CNN
F 3 "~" H 9650 9050 50  0001 C CNN
    1    9650 9050
    1    0    0    -1
$EndComp
$Comp
L Mechanical:MountingHole H84
U 1 1 5EB0656F
P 9650 9200
F 0 "H84" H 9750 9246 50  0000 L CNN
F 1 "PadHole" H 9750 9155 50  0000 L CNN
F 2 "AllModules:ThroughHole_60milx12mil_Pad_Cu_Mask" H 9650 9200 50  0001 C CNN
F 3 "~" H 9650 9200 50  0001 C CNN
    1    9650 9200
    1    0    0    -1
$EndComp
$Comp
L Mechanical:MountingHole H85
U 1 1 5EB06575
P 9650 9350
F 0 "H85" H 9750 9396 50  0000 L CNN
F 1 "PadHole" H 9750 9305 50  0000 L CNN
F 2 "AllModules:ThroughHole_60milx12mil_Pad_Cu_Mask" H 9650 9350 50  0001 C CNN
F 3 "~" H 9650 9350 50  0001 C CNN
    1    9650 9350
    1    0    0    -1
$EndComp
$Comp
L Mechanical:MountingHole H86
U 1 1 5EB0657B
P 9650 9500
F 0 "H86" H 9750 9546 50  0000 L CNN
F 1 "PadHole" H 9750 9455 50  0000 L CNN
F 2 "AllModules:ThroughHole_60milx12mil_Pad_Cu_Mask" H 9650 9500 50  0001 C CNN
F 3 "~" H 9650 9500 50  0001 C CNN
    1    9650 9500
    1    0    0    -1
$EndComp
$Comp
L Mechanical:MountingHole H87
U 1 1 5EB06581
P 9650 9650
F 0 "H87" H 9750 9696 50  0000 L CNN
F 1 "PadHole" H 9750 9605 50  0000 L CNN
F 2 "AllModules:ThroughHole_60milx12mil_Pad_Cu_Mask" H 9650 9650 50  0001 C CNN
F 3 "~" H 9650 9650 50  0001 C CNN
    1    9650 9650
    1    0    0    -1
$EndComp
$Comp
L Mechanical:MountingHole H88
U 1 1 5EB06587
P 9650 9800
F 0 "H88" H 9750 9846 50  0000 L CNN
F 1 "PadHole" H 9750 9755 50  0000 L CNN
F 2 "AllModules:ThroughHole_60milx12mil_Pad_Cu_Mask" H 9650 9800 50  0001 C CNN
F 3 "~" H 9650 9800 50  0001 C CNN
    1    9650 9800
    1    0    0    -1
$EndComp
$Comp
L Mechanical:MountingHole H89
U 1 1 5EB0658D
P 9650 9950
F 0 "H89" H 9750 9996 50  0000 L CNN
F 1 "PadHole" H 9750 9905 50  0000 L CNN
F 2 "AllModules:ThroughHole_60milx12mil_Pad_Cu_Mask" H 9650 9950 50  0001 C CNN
F 3 "~" H 9650 9950 50  0001 C CNN
    1    9650 9950
    1    0    0    -1
$EndComp
$Comp
L Mechanical:MountingHole H90
U 1 1 5EB06593
P 9650 10100
F 0 "H90" H 9750 10146 50  0000 L CNN
F 1 "PadHole" H 9750 10055 50  0000 L CNN
F 2 "AllModules:ThroughHole_60milx12mil_Pad_Cu_Mask" H 9650 10100 50  0001 C CNN
F 3 "~" H 9650 10100 50  0001 C CNN
    1    9650 10100
    1    0    0    -1
$EndComp
$Comp
L Mechanical:MountingHole H91
U 1 1 5EB06599
P 9650 10250
F 0 "H91" H 9750 10296 50  0000 L CNN
F 1 "PadHole" H 9750 10205 50  0000 L CNN
F 2 "AllModules:ThroughHole_60milx12mil_Pad_Cu_Mask" H 9650 10250 50  0001 C CNN
F 3 "~" H 9650 10250 50  0001 C CNN
    1    9650 10250
    1    0    0    -1
$EndComp
$Comp
L Mechanical:MountingHole H92
U 1 1 5EB0659F
P 9650 10400
F 0 "H92" H 9750 10446 50  0000 L CNN
F 1 "PadHole" H 9750 10355 50  0000 L CNN
F 2 "AllModules:ThroughHole_60milx12mil_Pad_Cu_Mask" H 9650 10400 50  0001 C CNN
F 3 "~" H 9650 10400 50  0001 C CNN
    1    9650 10400
    1    0    0    -1
$EndComp
$Comp
L Mechanical:MountingHole H93
U 1 1 5EB065A5
P 9650 10550
F 0 "H93" H 9750 10596 50  0000 L CNN
F 1 "PadHole" H 9750 10505 50  0000 L CNN
F 2 "AllModules:ThroughHole_60milx12mil_Pad_Cu_Mask" H 9650 10550 50  0001 C CNN
F 3 "~" H 9650 10550 50  0001 C CNN
    1    9650 10550
    1    0    0    -1
$EndComp
$Comp
L Mechanical:MountingHole H94
U 1 1 5EB065AB
P 9650 10700
F 0 "H94" H 9750 10746 50  0000 L CNN
F 1 "PadHole" H 9750 10655 50  0000 L CNN
F 2 "AllModules:ThroughHole_60milx12mil_Pad_Cu_Mask" H 9650 10700 50  0001 C CNN
F 3 "~" H 9650 10700 50  0001 C CNN
    1    9650 10700
    1    0    0    -1
$EndComp
$Comp
L Mechanical:MountingHole H95
U 1 1 5EB065B1
P 9650 10850
F 0 "H95" H 9750 10896 50  0000 L CNN
F 1 "PadHole" H 9750 10805 50  0000 L CNN
F 2 "AllModules:ThroughHole_60milx12mil_Pad_Cu_Mask" H 9650 10850 50  0001 C CNN
F 3 "~" H 9650 10850 50  0001 C CNN
    1    9650 10850
    1    0    0    -1
$EndComp
$Comp
L Mechanical:MountingHole H96
U 1 1 5EB065B7
P 9650 11000
F 0 "H96" H 9750 11046 50  0000 L CNN
F 1 "PadHole" H 9750 10955 50  0000 L CNN
F 2 "AllModules:ThroughHole_60milx12mil_Pad_Cu_Mask" H 9650 11000 50  0001 C CNN
F 3 "~" H 9650 11000 50  0001 C CNN
    1    9650 11000
    1    0    0    -1
$EndComp
$Comp
L Mechanical:MountingHole H97
U 1 1 5EB065BD
P 10200 8750
F 0 "H97" H 10300 8796 50  0000 L CNN
F 1 "PadHole" H 10300 8705 50  0000 L CNN
F 2 "AllModules:ThroughHole_60milx12mil_Pad_Cu_Mask" H 10200 8750 50  0001 C CNN
F 3 "~" H 10200 8750 50  0001 C CNN
    1    10200 8750
    1    0    0    -1
$EndComp
$Comp
L Mechanical:MountingHole H98
U 1 1 5EB065C3
P 10200 8900
F 0 "H98" H 10300 8946 50  0000 L CNN
F 1 "PadHole" H 10300 8855 50  0000 L CNN
F 2 "AllModules:ThroughHole_60milx12mil_Pad_Cu_Mask" H 10200 8900 50  0001 C CNN
F 3 "~" H 10200 8900 50  0001 C CNN
    1    10200 8900
    1    0    0    -1
$EndComp
$Comp
L Mechanical:MountingHole H99
U 1 1 5EB065C9
P 10200 9050
F 0 "H99" H 10300 9096 50  0000 L CNN
F 1 "PadHole" H 10300 9005 50  0000 L CNN
F 2 "AllModules:ThroughHole_60milx12mil_Pad_Cu_Mask" H 10200 9050 50  0001 C CNN
F 3 "~" H 10200 9050 50  0001 C CNN
    1    10200 9050
    1    0    0    -1
$EndComp
$Comp
L Mechanical:MountingHole H100
U 1 1 5EB065CF
P 10200 9200
F 0 "H100" H 10300 9246 50  0000 L CNN
F 1 "PadHole" H 10300 9155 50  0000 L CNN
F 2 "AllModules:ThroughHole_60milx12mil_Pad_Cu_Mask" H 10200 9200 50  0001 C CNN
F 3 "~" H 10200 9200 50  0001 C CNN
    1    10200 9200
    1    0    0    -1
$EndComp
$Comp
L Mechanical:MountingHole H101
U 1 1 5EB065D5
P 10200 9350
F 0 "H101" H 10300 9396 50  0000 L CNN
F 1 "PadHole" H 10300 9305 50  0000 L CNN
F 2 "AllModules:ThroughHole_60milx12mil_Pad_Cu_Mask" H 10200 9350 50  0001 C CNN
F 3 "~" H 10200 9350 50  0001 C CNN
    1    10200 9350
    1    0    0    -1
$EndComp
$Comp
L Mechanical:MountingHole H102
U 1 1 5EB065DB
P 10200 9500
F 0 "H102" H 10300 9546 50  0000 L CNN
F 1 "PadHole" H 10300 9455 50  0000 L CNN
F 2 "AllModules:ThroughHole_60milx12mil_Pad_Cu_Mask" H 10200 9500 50  0001 C CNN
F 3 "~" H 10200 9500 50  0001 C CNN
    1    10200 9500
    1    0    0    -1
$EndComp
$Comp
L Mechanical:MountingHole H103
U 1 1 5EB065E1
P 10200 9650
F 0 "H103" H 10300 9696 50  0000 L CNN
F 1 "PadHole" H 10300 9605 50  0000 L CNN
F 2 "AllModules:ThroughHole_60milx12mil_Pad_Cu_Mask" H 10200 9650 50  0001 C CNN
F 3 "~" H 10200 9650 50  0001 C CNN
    1    10200 9650
    1    0    0    -1
$EndComp
$Comp
L Mechanical:MountingHole H104
U 1 1 5EB065E7
P 10200 9800
F 0 "H104" H 10300 9846 50  0000 L CNN
F 1 "PadHole" H 10300 9755 50  0000 L CNN
F 2 "AllModules:ThroughHole_60milx12mil_Pad_Cu_Mask" H 10200 9800 50  0001 C CNN
F 3 "~" H 10200 9800 50  0001 C CNN
    1    10200 9800
    1    0    0    -1
$EndComp
$Comp
L Mechanical:MountingHole H105
U 1 1 5EB065ED
P 10200 9950
F 0 "H105" H 10300 9996 50  0000 L CNN
F 1 "PadHole" H 10300 9905 50  0000 L CNN
F 2 "AllModules:ThroughHole_60milx12mil_Pad_Cu_Mask" H 10200 9950 50  0001 C CNN
F 3 "~" H 10200 9950 50  0001 C CNN
    1    10200 9950
    1    0    0    -1
$EndComp
$EndSCHEMATC
