(module C6032_1 (layer F.Cu) (tedit 5E9B7EB4)
  (attr smd)
  (fp_text reference C81 (at -5.21 -0.74863 -270 unlocked) (layer F.SilkS)
    (effects (font (size 1.0496 1.104) (thickness 0.1)))
  )
  (fp_text value C-BCP-C6032 (at -0.0332 3.71873 -270 unlocked) (layer F.SilkS) hide
    (effects (font (size 1.0496 1.104) (thickness 0.1)))
  )
  (fp_line (start -3.4925 1.905) (end 3.81 1.905) (layer F.SilkS) (width 0.18))
  (fp_line (start -3.81 -1.43859) (end -3.81 -1.5875) (layer F.SilkS) (width 0.18))
  (fp_line (start -3.81 -1.5875) (end -3.4925 -1.905) (layer F.SilkS) (width 0.18))
  (fp_line (start 3.81 -1.43859) (end 3.81 -1.905) (layer F.SilkS) (width 0.18))
  (fp_line (start -3.4925 -1.905) (end 3.81 -1.905) (layer F.SilkS) (width 0.18))
  (fp_line (start -3.81 1.5875) (end -3.4925 1.905) (layer F.SilkS) (width 0.18))
  (fp_line (start -3.81 1.5875) (end -3.81 1.43859) (layer F.SilkS) (width 0.18))
  (fp_line (start 3.81 1.905) (end 3.81 1.43859) (layer F.SilkS) (width 0.18))
  (fp_line (start -3.5052 1.6002) (end -3.5052 -1.6002) (layer F.Fab) (width 0.1))
  (fp_line (start -2.9972 1.524) (end -2.9972 -1.524) (layer F.Fab) (width 0.1))
  (fp_line (start -3.5052 1.6002) (end 3.4798 1.6002) (layer F.Fab) (width 0.1))
  (fp_line (start -2.7972 1.524) (end -2.7972 -1.524) (layer F.Fab) (width 0.1))
  (fp_line (start 3.4798 1.6002) (end 3.4798 -1.6002) (layer F.Fab) (width 0.1))
  (fp_line (start -3.5052 -1.6002) (end 3.4798 -1.6002) (layer F.Fab) (width 0.1))
  (pad - smd rect (at 2.3622 0) (size 2.286 2.54) (layers F.Cu F.Paste F.Mask))
  (pad + smd rect (at -2.3622 0) (size 2.286 2.54) (layers F.Cu F.Paste F.Mask))
  (model ${KISYS3DMOD}/Capacitor_Tantalum_SMD.3dshapes/CP_EIA-6032-28_Kemet-C.wrl
    (at (xyz 0 0 0))
    (scale (xyz 1 1 1))
    (rotate (xyz 0 0 0))
  )
)
