ISO-10303-21;
HEADER;
FILE_DESCRIPTION (( 'STEP AP214' ),
    '1' );
FILE_NAME ('User Library-SOD-87.STEP',
    '2020-04-19T11:29:36',
    ( '' ),
    ( '' ),
    'SwSTEP 2.0',
    'SolidWorks 2019',
    '' );
FILE_SCHEMA (( 'AUTOMOTIVE_DESIGN' ));
ENDSEC;

DATA;
#1 = DIRECTION ( 'NONE',  ( -1.000000000000000000, -0.0000000000000000000, -0.0000000000000000000 ) ) ;
#2 = EDGE_CURVE ( 'NONE', #364, #696, #629, .T. ) ;
#3 = SURFACE_STYLE_USAGE ( .BOTH. , #460 ) ;
#4 = ORIENTED_EDGE ( 'NONE', *, *, #56, .F. ) ;
#5 = DIRECTION ( 'NONE',  ( 0.0000000000000000000, 0.0000000000000000000, 1.000000000000000000 ) ) ;
#6 =( GEOMETRIC_REPRESENTATION_CONTEXT ( 3 ) GLOBAL_UNCERTAINTY_ASSIGNED_CONTEXT ( ( #307 ) ) GLOBAL_UNIT_ASSIGNED_CONTEXT ( ( #758, #349, #353 ) ) REPRESENTATION_CONTEXT ( 'NONE', 'WORKASPACE' ) );
#7 = CIRCLE ( 'NONE', #35, 1.000000000000000222 ) ;
#8 = AXIS2_PLACEMENT_3D ( 'NONE', #138, #747, #329 ) ;
#9 = CARTESIAN_POINT ( 'NONE',  ( -1.699999999999999956, 0.0000000000000000000, 0.0000000000000000000 ) ) ;
#10 = EDGE_CURVE ( 'NONE', #838, #168, #803, .T. ) ;
#11 = DIRECTION ( 'NONE',  ( 0.0000000000000000000, -1.224646799147353207E-16, 1.000000000000000000 ) ) ;
#12 =( NAMED_UNIT ( * ) PLANE_ANGLE_UNIT ( ) SI_UNIT ( $, .RADIAN. ) );
#13 = CARTESIAN_POINT ( 'NONE',  ( -1.750000000000000000, 0.0000000000000000000, 0.0000000000000000000 ) ) ;
#14 = ORIENTED_EDGE ( 'NONE', *, *, #680, .F. ) ;
#15 = DIRECTION ( 'NONE',  ( 1.000000000000000000, 0.0000000000000000000, 0.0000000000000000000 ) ) ;
#16 = PRESENTATION_STYLE_ASSIGNMENT (( #157 ) ) ;
#17 = VERTEX_POINT ( 'NONE', #623 ) ;
#18 = FACE_OUTER_BOUND ( 'NONE', #649, .T. ) ;
#19 = CIRCLE ( 'NONE', #129, 0.2000000000000003164 ) ;
#20 = AXIS2_PLACEMENT_3D ( 'NONE', #667, #72, #468 ) ;
#21 = AXIS2_PLACEMENT_3D ( 'NONE', #559, #222, #634 ) ;
#22 = CARTESIAN_POINT ( 'NONE',  ( 1.450000000000000622, 0.0000000000000000000, 0.0000000000000000000 ) ) ;
#23 = CARTESIAN_POINT ( 'NONE',  ( -1.450000000000000622, 0.0000000000000000000, 0.0000000000000000000 ) ) ;
#24 = B_SPLINE_CURVE_WITH_KNOTS ( 'NONE', 3,
 ( #270, #606, #516, #800, #193, #44 ),
 .UNSPECIFIED., .F., .F.,
 ( 4, 2, 4 ),
 ( 0.0000000000000000000, 0.07761169604920177545, 0.1552233920984035509 ),
 .UNSPECIFIED. ) ;
#25 = DIRECTION ( 'NONE',  ( 0.0000000000000000000, 0.0000000000000000000, 1.000000000000000000 ) ) ;
#26 = CARTESIAN_POINT ( 'NONE',  ( -1.699999999999999956, 0.0000000000000000000, 0.0000000000000000000 ) ) ;
#27 = EDGE_LOOP ( 'NONE', ( #186, #255, #14, #339 ) ) ;
#28 =( NAMED_UNIT ( * ) PLANE_ANGLE_UNIT ( ) SI_UNIT ( $, .RADIAN. ) );
#29 = DIRECTION ( 'NONE',  ( 0.0000000000000000000, 0.0000000000000000000, 1.000000000000000000 ) ) ;
#30 = ADVANCED_FACE ( 'NONE', ( #80 ), #74, .T. ) ;
#31 = DIRECTION ( 'NONE',  ( 0.0000000000000000000, -1.224646799147353207E-16, 1.000000000000000000 ) ) ;
#32 = ORIENTED_EDGE ( 'NONE', *, *, #334, .F. ) ;
#33 = DIRECTION ( 'NONE',  ( -1.000000000000000000, -0.0000000000000000000, -0.0000000000000000000 ) ) ;
#34 = AXIS2_PLACEMENT_3D ( 'NONE', #98, #581, #370 ) ;
#35 = AXIS2_PLACEMENT_3D ( 'NONE', #763, #440, #495 ) ;
#36 = CIRCLE ( 'NONE', #526, 1.000000000000000444 ) ;
#37 = DIRECTION ( 'NONE',  ( 0.0000000000000000000, 0.0000000000000000000, 1.000000000000000000 ) ) ;
#38 = COLOUR_RGB ( '',0.9098039215686274384, 0.4431372549019607643, 0.03137254901960784270 ) ;
#39 = DIRECTION ( 'NONE',  ( 0.0000000000000000000, 0.0000000000000000000, 1.000000000000000000 ) ) ;
#40 = ORIENTED_EDGE ( 'NONE', *, *, #240, .F. ) ;
#41 = DIRECTION ( 'NONE',  ( -1.000000000000000000, -0.0000000000000000000, -0.0000000000000000000 ) ) ;
#42 = ORIENTED_EDGE ( 'NONE', *, *, #279, .F. ) ;
#43 = EDGE_CURVE ( 'NONE', #351, #683, #155, .T. ) ;
#44 = CARTESIAN_POINT ( 'NONE',  ( -0.2499999999999997780, -2.909464618929847177E-15, 1.000000000000000222 ) ) ;
#45 = ORIENTED_EDGE ( 'NONE', *, *, #267, .T. ) ;
#46 = EDGE_CURVE ( 'NONE', #685, #17, #796, .T. ) ;
#47 = COLOUR_RGB ( '',0.9098039215686274384, 0.4431372549019607643, 0.03137254901960784270 ) ;
#48 = CARTESIAN_POINT ( 'NONE',  ( -0.2499999999999997780, 0.5231968748007079784, 0.8630667416348196674 ) ) ;
#49 = VECTOR ( 'NONE', #774, 1000.000000000000000 ) ;
#50 = CARTESIAN_POINT ( 'NONE',  ( 1.699999999999999956, 0.0000000000000000000, 0.0000000000000000000 ) ) ;
#51 = VERTEX_POINT ( 'NONE', #701 ) ;
#52 = PRESENTATION_LAYER_ASSIGNMENT (  '', '', ( #573 ) ) ;
#53 = DIRECTION ( 'NONE',  ( -1.000000000000000000, -0.0000000000000000000, -0.0000000000000000000 ) ) ;
#54 =( GEOMETRIC_REPRESENTATION_CONTEXT ( 3 ) GLOBAL_UNCERTAINTY_ASSIGNED_CONTEXT ( ( #865 ) ) GLOBAL_UNIT_ASSIGNED_CONTEXT ( ( #467, #127, #868 ) ) REPRESENTATION_CONTEXT ( 'NONE', 'WORKASPACE' ) );
#55 = ORIENTED_EDGE ( 'NONE', *, *, #82, .F. ) ;
#56 = EDGE_CURVE ( 'NONE', #683, #90, #568, .T. ) ;
#57 = EDGE_LOOP ( 'NONE', ( #765, #300 ) ) ;
#58 = PRESENTATION_STYLE_ASSIGNMENT (( #746 ) ) ;
#59 = DIRECTION ( 'NONE',  ( -1.000000000000000000, -0.0000000000000000000, -0.0000000000000000000 ) ) ;
#60 = VERTEX_POINT ( 'NONE', #288 ) ;
#61 = SURFACE_STYLE_FILL_AREA ( #870 ) ;
#62 = CIRCLE ( 'NONE', #660, 0.9500000000000003997 ) ;
#63 = CARTESIAN_POINT ( 'NONE',  ( -1.500000000000000666, 0.0000000000000000000, 0.0000000000000000000 ) ) ;
#64 = PRESENTATION_STYLE_ASSIGNMENT (( #3 ) ) ;
#65 = ORIENTED_EDGE ( 'NONE', *, *, #782, .T. ) ;
#66 = ADVANCED_FACE ( 'NONE', ( #362 ), #730, .T. ) ;
#67 = CARTESIAN_POINT ( 'NONE',  ( -1.450000000000000622, 0.0000000000000000000, 0.0000000000000000000 ) ) ;
#68 = CARTESIAN_POINT ( 'NONE',  ( -1.699999999999999956, 1.163414459189986175E-16, -0.9500000000000003997 ) ) ;
#69 = ORIENTED_EDGE ( 'NONE', *, *, #334, .T. ) ;
#70 = EDGE_CURVE ( 'NONE', #683, #351, #819, .T. ) ;
#71 = VERTEX_POINT ( 'NONE', #83 ) ;
#72 = DIRECTION ( 'NONE',  ( -1.000000000000000000, -0.0000000000000000000, -0.0000000000000000000 ) ) ;
#73 = MECHANICAL_DESIGN_GEOMETRIC_PRESENTATION_REPRESENTATION (  '', ( #687 ), #301 ) ;
#74 = TOROIDAL_SURFACE ( 'NONE', #274, 0.7999999999999999334, 0.2000000000000003164 ) ;
#75 = CLOSED_SHELL ( 'NONE', ( #66, #843, #509, #790, #665, #385, #592, #372, #549, #346, #475, #462, #580, #449, #422, #536, #487, #30, #761, #847, #479, #194, #120, #152, #287 ) ) ;
#76 = STYLED_ITEM ( 'NONE', ( #565 ), #385 ) ;
#77 = CIRCLE ( 'NONE', #574, 1.000000000000000666 ) ;
#78 = ORIENTED_EDGE ( 'NONE', *, *, #316, .F. ) ;
#79 = DIRECTION ( 'NONE',  ( -0.0000000000000000000, 0.0000000000000000000, 1.000000000000000000 ) ) ;
#80 = FACE_OUTER_BOUND ( 'NONE', #712, .T. ) ;
#81 = DIRECTION ( 'NONE',  ( -0.0000000000000000000, 1.000000000000000000, 1.224646799147353207E-16 ) ) ;
#82 = EDGE_CURVE ( 'NONE', #728, #437, #769, .T. ) ;
#83 = CARTESIAN_POINT ( 'NONE',  ( -1.699999999999999956, 1.224646799147353947E-16, -1.000000000000000444 ) ) ;
#84 = DIRECTION ( 'NONE',  ( 0.0000000000000000000, 0.0000000000000000000, 1.000000000000000000 ) ) ;
#85 = COLOUR_RGB ( '',0.2509803921568627416, 0.2509803921568627416, 0.2509803921568627416 ) ;
#86 =( NAMED_UNIT ( * ) SI_UNIT ( $, .STERADIAN. ) SOLID_ANGLE_UNIT ( ) );
#87 = MECHANICAL_DESIGN_GEOMETRIC_PRESENTATION_REPRESENTATION (  '', ( #76 ), #187 ) ;
#88 = CARTESIAN_POINT ( 'NONE',  ( -1.750000000000000000, 0.0000000000000000000, 1.000000000000000222 ) ) ;
#89 = CARTESIAN_POINT ( 'NONE',  ( 1.699999999999999956, 0.0000000000000000000, 0.0000000000000000000 ) ) ;
#90 = VERTEX_POINT ( 'NONE', #354 ) ;
#91 = SURFACE_SIDE_STYLE ('',( #304 ) ) ;
#92 = EDGE_CURVE ( 'NONE', #100, #96, #430, .T. ) ;
#93 = SURFACE_STYLE_USAGE ( .BOTH. , #706 ) ;
#94 = CYLINDRICAL_SURFACE ( 'NONE', #302, 1.000000000000000444 ) ;
#95 = DIRECTION ( 'NONE',  ( -1.000000000000000000, -0.0000000000000000000, -0.0000000000000000000 ) ) ;
#96 = VERTEX_POINT ( 'NONE', #640 ) ;
#97 = DIRECTION ( 'NONE',  ( -1.000000000000000000, -0.0000000000000000000, -0.0000000000000000000 ) ) ;
#98 = CARTESIAN_POINT ( 'NONE',  ( 0.0000000000000000000, 0.0000000000000000000, 0.0000000000000000000 ) ) ;
#99 = CARTESIAN_POINT ( 'NONE',  ( 1.250000000000000000, 0.0000000000000000000, 0.0000000000000000000 ) ) ;
#100 = VERTEX_POINT ( 'NONE', #226 ) ;
#101 = AXIS2_PLACEMENT_3D ( 'NONE', #248, #864, #466 ) ;
#102 = MECHANICAL_DESIGN_GEOMETRIC_PRESENTATION_REPRESENTATION (  '', ( #286 ), #132 ) ;
#103 = LINE ( 'NONE', #88, #201 ) ;
#104 = CIRCLE ( 'NONE', #601, 0.05000000000000002359 ) ;
#105 = CARTESIAN_POINT ( 'NONE',  ( 1.250000000000000000, 1.224646799147353454E-16, -1.000000000000000222 ) ) ;
#106 = EDGE_CURVE ( 'NONE', #859, #696, #7, .T. ) ;
#107 = ORIENTED_EDGE ( 'NONE', *, *, #713, .F. ) ;
#108 = DIRECTION ( 'NONE',  ( -1.000000000000000000, -0.0000000000000000000, -0.0000000000000000000 ) ) ;
#109 = FILL_AREA_STYLE ('',( #655 ) ) ;
#110 = ORIENTED_EDGE ( 'NONE', *, *, #778, .F. ) ;
#111 = EDGE_CURVE ( 'NONE', #51, #259, #366, .T. ) ;
#112 = ORIENTED_EDGE ( 'NONE', *, *, #500, .T. ) ;
#113 = FILL_AREA_STYLE ('',( #766 ) ) ;
#114 = AXIS2_PLACEMENT_3D ( 'NONE', #443, #435, #37 ) ;
#115 = SURFACE_SIDE_STYLE ('',( #727 ) ) ;
#116 = ORIENTED_EDGE ( 'NONE', *, *, #221, .F. ) ;
#117 = AXIS2_PLACEMENT_3D ( 'NONE', #355, #213, #481 ) ;
#118 = CARTESIAN_POINT ( 'NONE',  ( 1.500000000000000666, 0.0000000000000000000, 0.0000000000000000000 ) ) ;
#119 = CIRCLE ( 'NONE', #21, 1.000000000000000666 ) ;
#120 = ADVANCED_FACE ( 'NONE', ( #567 ), #94, .T. ) ;
#121 = DIRECTION ( 'NONE',  ( 0.0000000000000000000, 0.0000000000000000000, 1.000000000000000000 ) ) ;
#122 = ORIENTED_EDGE ( 'NONE', *, *, #10, .T. ) ;
#123 = FILL_AREA_STYLE_COLOUR ( '', #852 ) ;
#124 = UNCERTAINTY_MEASURE_WITH_UNIT (LENGTH_MEASURE( 1.000000000000000082E-05 ), #145, 'distance_accuracy_value', 'NONE');
#125 = ORIENTED_EDGE ( 'NONE', *, *, #144, .F. ) ;
#126 = CARTESIAN_POINT ( 'NONE',  ( -1.500000000000000666, 1.224646799147353947E-16, -1.000000000000000444 ) ) ;
#127 =( NAMED_UNIT ( * ) PLANE_ANGLE_UNIT ( ) SI_UNIT ( $, .RADIAN. ) );
#128 = ORIENTED_EDGE ( 'NONE', *, *, #358, .F. ) ;
#129 = AXIS2_PLACEMENT_3D ( 'NONE', #742, #335, #476 ) ;
#130 = FACE_OUTER_BOUND ( 'NONE', #814, .T. ) ;
#131 = EDGE_CURVE ( 'NONE', #445, #364, #327, .T. ) ;
#132 =( GEOMETRIC_REPRESENTATION_CONTEXT ( 3 ) GLOBAL_UNCERTAINTY_ASSIGNED_CONTEXT ( ( #570 ) ) GLOBAL_UNIT_ASSIGNED_CONTEXT ( ( #546, #12, #137 ) ) REPRESENTATION_CONTEXT ( 'NONE', 'WORKASPACE' ) );
#133 = STYLED_ITEM ( 'NONE', ( #64 ), #761 ) ;
#134 = DIRECTION ( 'NONE',  ( 0.0000000000000000000, 0.0000000000000000000, 1.000000000000000000 ) ) ;
#135 = SURFACE_STYLE_FILL_AREA ( #528 ) ;
#136 = VERTEX_POINT ( 'NONE', #577 ) ;
#137 =( NAMED_UNIT ( * ) SI_UNIT ( $, .STERADIAN. ) SOLID_ANGLE_UNIT ( ) );
#138 = CARTESIAN_POINT ( 'NONE',  ( -1.750000000000000000, 0.0000000000000000000, 0.0000000000000000000 ) ) ;
#139 = EDGE_LOOP ( 'NONE', ( #69, #793, #748, #296 ) ) ;
#140 = EDGE_LOOP ( 'NONE', ( #781, #65, #695, #704, #110 ) ) ;
#141 = CARTESIAN_POINT ( 'NONE',  ( 1.500000000000000666, 0.0000000000000000000, 0.0000000000000000000 ) ) ;
#142 = AXIS2_PLACEMENT_3D ( 'NONE', #282, #421, #618 ) ;
#143 = CIRCLE ( 'NONE', #616, 0.9500000000000003997 ) ;
#144 = EDGE_CURVE ( 'NONE', #799, #644, #143, .T. ) ;
#145 =( LENGTH_UNIT ( ) NAMED_UNIT ( * ) SI_UNIT ( .MILLI., .METRE. ) );
#146 = DIRECTION ( 'NONE',  ( 0.0000000000000000000, 0.0000000000000000000, -1.000000000000000000 ) ) ;
#147 = ORIENTED_EDGE ( 'NONE', *, *, #340, .F. ) ;
#148 = DIRECTION ( 'NONE',  ( 0.0000000000000000000, 0.0000000000000000000, 1.000000000000000000 ) ) ;
#149 = FILL_AREA_STYLE_COLOUR ( '', #456 ) ;
#150 = CARTESIAN_POINT ( 'NONE',  ( -1.450000000000000400, -0.9500000000000003997, 0.0000000000000000000 ) ) ;
#151 = ORIENTED_EDGE ( 'NONE', *, *, #556, .T. ) ;
#152 = ADVANCED_FACE ( 'NONE', ( #825 ), #499, .T. ) ;
#153 = B_SPLINE_CURVE_WITH_KNOTS ( 'NONE', 3,
 ( #780, #711, #314, #583, #648, #723, #388, #243, #252, #175 ),
 .UNSPECIFIED., .F., .F.,
 ( 4, 2, 2, 2, 4 ),
 ( 0.2855255308949310455, 0.3779499961957993870, 0.4703744614966676729, 0.5627989267975359589, 0.6552233920984043003 ),
 .UNSPECIFIED. ) ;
#154 = PRESENTATION_LAYER_ASSIGNMENT (  '', '', ( #767 ) ) ;
#155 = CIRCLE ( 'NONE', #245, 0.9500000000000003997 ) ;
#156 = SURFACE_STYLE_FILL_AREA ( #797 ) ;
#157 = SURFACE_STYLE_USAGE ( .BOTH. , #494 ) ;
#158 = DIRECTION ( 'NONE',  ( 0.0000000000000000000, 0.0000000000000000000, -1.000000000000000000 ) ) ;
#159 = DIRECTION ( 'NONE',  ( -1.000000000000000000, -0.0000000000000000000, -0.0000000000000000000 ) ) ;
#160 = EDGE_LOOP ( 'NONE', ( #223, #745, #32, #239 ) ) ;
#161 = CARTESIAN_POINT ( 'NONE',  ( 1.750000000000000000, 0.0000000000000000000, 0.9500000000000003997 ) ) ;
#162 =( NAMED_UNIT ( * ) PLANE_ANGLE_UNIT ( ) SI_UNIT ( $, .RADIAN. ) );
#163 = EDGE_LOOP ( 'NONE', ( #521, #324, #579, #374, #522 ) ) ;
#164 = FACE_OUTER_BOUND ( 'NONE', #560, .T. ) ;
#165 = ADVANCED_BREP_SHAPE_REPRESENTATION ( 'User Library-SOD-87', ( #854, #34 ), #272 ) ;
#166 = DIRECTION ( 'NONE',  ( 0.0000000000000000000, 0.0000000000000000000, 1.000000000000000000 ) ) ;
#167 = CARTESIAN_POINT ( 'NONE',  ( 1.750000000000000000, 1.194030629168670061E-16, -0.9500000000000003997 ) ) ;
#168 = VERTEX_POINT ( 'NONE', #491 ) ;
#169 = APPLICATION_CONTEXT ( 'automotive_design' ) ;
#170 = TOROIDAL_SURFACE ( 'NONE', #142, 0.7999999999999999334, 0.2000000000000003164 ) ;
#171 = AXIS2_PLACEMENT_3D ( 'NONE', #647, #220, #427 ) ;
#172 = TOROIDAL_SURFACE ( 'NONE', #731, 0.7999999999999999334, 0.2000000000000003164 ) ;
#173 = CARTESIAN_POINT ( 'NONE',  ( -1.250000000000000000, 0.0000000000000000000, 0.7999999999999999334 ) ) ;
#174 = AXIS2_PLACEMENT_3D ( 'NONE', #50, #510, #444 ) ;
#175 = CARTESIAN_POINT ( 'NONE',  ( -0.2499999999999997780, -1.408962799656044823E-15, -1.000000000000000222 ) ) ;
#176 = ORIENTED_EDGE ( 'NONE', *, *, #46, .T. ) ;
#177 = CARTESIAN_POINT ( 'NONE',  ( -0.2499999999999997780, 0.6370479764141500079, 0.7828084351001902697 ) ) ;
#178 = CARTESIAN_POINT ( 'NONE',  ( 1.500000000000000666, 0.0000000000000000000, 1.000000000000000666 ) ) ;
#179 = ORIENTED_EDGE ( 'NONE', *, *, #688, .T. ) ;
#180 = DIRECTION ( 'NONE',  ( -1.000000000000000000, -0.0000000000000000000, -0.0000000000000000000 ) ) ;
#181 = ORIENTED_EDGE ( 'NONE', *, *, #650, .T. ) ;
#182 = DIRECTION ( 'NONE',  ( -1.000000000000000000, -0.0000000000000000000, -0.0000000000000000000 ) ) ;
#183 = EDGE_CURVE ( 'NONE', #859, #51, #103, .T. ) ;
#184 = AXIS2_PLACEMENT_3D ( 'NONE', #237, #232, #158 ) ;
#185 = COLOUR_RGB ( '',0.2509803921568627416, 0.2509803921568627416, 0.2509803921568627416 ) ;
#186 = ORIENTED_EDGE ( 'NONE', *, *, #111, .F. ) ;
#187 =( GEOMETRIC_REPRESENTATION_CONTEXT ( 3 ) GLOBAL_UNCERTAINTY_ASSIGNED_CONTEXT ( ( #669 ) ) GLOBAL_UNIT_ASSIGNED_CONTEXT ( ( #365, #28, #575 ) ) REPRESENTATION_CONTEXT ( 'NONE', 'WORKASPACE' ) );
#188 =( LENGTH_UNIT ( ) NAMED_UNIT ( * ) SI_UNIT ( .MILLI., .METRE. ) );
#189 = AXIS2_PLACEMENT_3D ( 'NONE', #762, #426, #84 ) ;
#190 = SURFACE_STYLE_FILL_AREA ( #811 ) ;
#191 = ORIENTED_EDGE ( 'NONE', *, *, #221, .T. ) ;
#192 = DIRECTION ( 'NONE',  ( -0.0000000000000000000, 1.000000000000000000, 1.224646799147353207E-16 ) ) ;
#193 = CARTESIAN_POINT ( 'NONE',  ( -0.2499999999999997780, -0.1625495560938804984, 0.9999999999999997780 ) ) ;
#194 = ADVANCED_FACE ( 'NONE', ( #266 ), #343, .T. ) ;
#195 = FACE_OUTER_BOUND ( 'NONE', #163, .T. ) ;
#196 = VERTEX_POINT ( 'NONE', #610 ) ;
#197 = CYLINDRICAL_SURFACE ( 'NONE', #20, 1.000000000000000666 ) ;
#198 = DIRECTION ( 'NONE',  ( 0.0000000000000000000, 0.0000000000000000000, 1.000000000000000000 ) ) ;
#199 = CARTESIAN_POINT ( 'NONE',  ( -1.450000000000000622, 1.194030629168670308E-16, -0.9500000000000003997 ) ) ;
#200 = FILL_AREA_STYLE ('',( #548 ) ) ;
#201 = VECTOR ( 'NONE', #535, 1000.000000000000000 ) ;
#202 = DIRECTION ( 'NONE',  ( 0.0000000000000000000, 0.0000000000000000000, 1.000000000000000000 ) ) ;
#203 = PRESENTATION_LAYER_ASSIGNMENT (  '', '', ( #286 ) ) ;
#204 = AXIS2_PLACEMENT_3D ( 'NONE', #414, #401, #121 ) ;
#205 = DIRECTION ( 'NONE',  ( -1.000000000000000000, -0.0000000000000000000, -0.0000000000000000000 ) ) ;
#206 = PRESENTATION_STYLE_ASSIGNMENT (( #736 ) ) ;
#207 = ORIENTED_EDGE ( 'NONE', *, *, #10, .F. ) ;
#208 = CARTESIAN_POINT ( 'NONE',  ( -0.2499999999999997224, -0.1805246097522117954, -1.000000000000000000 ) ) ;
#209 = CARTESIAN_POINT ( 'NONE',  ( -1.750000000000000000, 0.0000000000000000000, 0.0000000000000000000 ) ) ;
#210 = EDGE_CURVE ( 'NONE', #259, #685, #257, .T. ) ;
#211 = DIRECTION ( 'NONE',  ( 0.0000000000000000000, 0.0000000000000000000, -1.000000000000000000 ) ) ;
#212 = SURFACE_SIDE_STYLE ('',( #412 ) ) ;
#213 = DIRECTION ( 'NONE',  ( -1.000000000000000000, -0.0000000000000000000, -0.0000000000000000000 ) ) ;
#214 = AXIS2_PLACEMENT_3D ( 'NONE', #67, #739, #405 ) ;
#215 = AXIS2_PLACEMENT_3D ( 'NONE', #150, #497, #146 ) ;
#216 = PRESENTATION_LAYER_ASSIGNMENT (  '', '', ( #260 ) ) ;
#217 =( LENGTH_UNIT ( ) NAMED_UNIT ( * ) SI_UNIT ( .MILLI., .METRE. ) );
#218 =( NAMED_UNIT ( * ) PLANE_ANGLE_UNIT ( ) SI_UNIT ( $, .RADIAN. ) );
#219 = CARTESIAN_POINT ( 'NONE',  ( -0.2499999999999997780, -1.408962799656044823E-15, -1.000000000000000222 ) ) ;
#220 = DIRECTION ( 'NONE',  ( -1.000000000000000000, -0.0000000000000000000, -0.0000000000000000000 ) ) ;
#221 = EDGE_CURVE ( 'NONE', #696, #838, #410, .T. ) ;
#222 = DIRECTION ( 'NONE',  ( -1.000000000000000000, -0.0000000000000000000, -0.0000000000000000000 ) ) ;
#223 = ORIENTED_EDGE ( 'NONE', *, *, #309, .T. ) ;
#224 = SURFACE_SIDE_STYLE ('',( #156 ) ) ;
#225 = PRESENTATION_STYLE_ASSIGNMENT (( #93 ) ) ;
#226 = CARTESIAN_POINT ( 'NONE',  ( -1.450000000000000622, 0.0000000000000000000, 0.9500000000000003997 ) ) ;
#227 = CARTESIAN_POINT ( 'NONE',  ( 1.699999999999999956, 0.0000000000000000000, 0.9500000000000003997 ) ) ;
#228 = ORIENTED_EDGE ( 'NONE', *, *, #517, .T. ) ;
#229 = SURFACE_STYLE_USAGE ( .BOTH. , #91 ) ;
#230 = AXIS2_PLACEMENT_3D ( 'NONE', #633, #291, #433 ) ;
#231 = TOROIDAL_SURFACE ( 'NONE', #822, 0.9500000000000003997, 0.05000000000000018319 ) ;
#232 = DIRECTION ( 'NONE',  ( 0.0000000000000000000, -1.000000000000000000, 0.0000000000000000000 ) ) ;
#233 = CARTESIAN_POINT ( 'NONE',  ( -1.750000000000000000, 0.0000000000000000000, 0.0000000000000000000 ) ) ;
#234 = UNCERTAINTY_MEASURE_WITH_UNIT (LENGTH_MEASURE( 1.000000000000000082E-05 ), #690, 'distance_accuracy_value', 'NONE');
#235 = ORIENTED_EDGE ( 'NONE', *, *, #862, .T. ) ;
#236 = CYLINDRICAL_SURFACE ( 'NONE', #617, 1.000000000000000222 ) ;
#237 = CARTESIAN_POINT ( 'NONE',  ( -1.500000000000000666, 0.0000000000000000000, 0.9500000000000003997 ) ) ;
#238 = DIRECTION ( 'NONE',  ( -1.000000000000000000, -0.0000000000000000000, -0.0000000000000000000 ) ) ;
#239 = ORIENTED_EDGE ( 'NONE', *, *, #92, .F. ) ;
#240 = EDGE_CURVE ( 'NONE', #283, #136, #391, .T. ) ;
#241 = APPLICATION_PROTOCOL_DEFINITION ( 'draft international standard', 'automotive_design', 1998, #397 ) ;
#242 =( NAMED_UNIT ( * ) SI_UNIT ( $, .STERADIAN. ) SOLID_ANGLE_UNIT ( ) );
#243 = CARTESIAN_POINT ( 'NONE',  ( -0.2499999999999997780, 0.3867856341771103157, -0.9422672200835409129 ) ) ;
#244 = ORIENTED_EDGE ( 'NONE', *, *, #750, .T. ) ;
#245 = AXIS2_PLACEMENT_3D ( 'NONE', #806, #697, #305 ) ;
#246 =( NAMED_UNIT ( * ) SI_UNIT ( $, .STERADIAN. ) SOLID_ANGLE_UNIT ( ) );
#247 = AXIS2_PLACEMENT_3D ( 'NONE', #209, #344, #202 ) ;
#248 = CARTESIAN_POINT ( 'NONE',  ( -1.749999999999999778, 0.0000000000000000000, 0.0000000000000000000 ) ) ;
#249 = PRESENTATION_LAYER_ASSIGNMENT (  '', '', ( #133 ) ) ;
#250 = CARTESIAN_POINT ( 'NONE',  ( -0.9166666666666654084, 0.7302668532270675250, 0.6831620035378409561 ) ) ;
#251 = VERTEX_POINT ( 'NONE', #722 ) ;
#252 = CARTESIAN_POINT ( 'NONE',  ( -0.2499999999999997780, 0.1935733474674470045, -1.000000000000000444 ) ) ;
#253 = UNCERTAINTY_MEASURE_WITH_UNIT (LENGTH_MEASURE( 1.000000000000000082E-05 ), #271, 'distance_accuracy_value', 'NONE');
#254 = EDGE_CURVE ( 'NONE', #407, #96, #375, .T. ) ;
#255 = ORIENTED_EDGE ( 'NONE', *, *, #279, .T. ) ;
#256 = SURFACE_STYLE_USAGE ( .BOTH. , #224 ) ;
#257 = CIRCLE ( 'NONE', #755, 0.2000000000000003164 ) ;
#258 = PRESENTATION_LAYER_ASSIGNMENT (  '', '', ( #76 ) ) ;
#259 = VERTEX_POINT ( 'NONE', #262 ) ;
#260 = STYLED_ITEM ( 'NONE', ( #206 ), #790 ) ;
#261 = EDGE_CURVE ( 'NONE', #407, #71, #387, .T. ) ;
#262 = CARTESIAN_POINT ( 'NONE',  ( -1.249999999999999778, 0.0000000000000000000, 1.000000000000000222 ) ) ;
#263 =( NAMED_UNIT ( * ) PLANE_ANGLE_UNIT ( ) SI_UNIT ( $, .RADIAN. ) );
#264 = VERTEX_POINT ( 'NONE', #651 ) ;
#265 = FACE_OUTER_BOUND ( 'NONE', #663, .T. ) ;
#266 = FACE_OUTER_BOUND ( 'NONE', #384, .T. ) ;
#267 = EDGE_CURVE ( 'NONE', #168, #51, #24, .T. ) ;
#268 = CARTESIAN_POINT ( 'NONE',  ( -1.250000000000000000, 0.0000000000000000000, 0.0000000000000000000 ) ) ;
#269 = ORIENTED_EDGE ( 'NONE', *, *, #340, .T. ) ;
#270 = CARTESIAN_POINT ( 'NONE',  ( -0.2499999999999997780, -0.8278687073570961674, 0.5609219227119681683 ) ) ;
#271 =( LENGTH_UNIT ( ) NAMED_UNIT ( * ) SI_UNIT ( .MILLI., .METRE. ) );
#272 =( GEOMETRIC_REPRESENTATION_CONTEXT ( 3 ) GLOBAL_UNCERTAINTY_ASSIGNED_CONTEXT ( ( #724 ) ) GLOBAL_UNIT_ASSIGNED_CONTEXT ( ( #217, #424, #829 ) ) REPRESENTATION_CONTEXT ( 'NONE', 'WORKASPACE' ) );
#273 = ORIENTED_EDGE ( 'NONE', *, *, #413, .F. ) ;
#274 = AXIS2_PLACEMENT_3D ( 'NONE', #99, #783, #25 ) ;
#275 = AXIS2_PLACEMENT_3D ( 'NONE', #227, #698, #637 ) ;
#276 = B_SPLINE_CURVE_WITH_KNOTS ( 'NONE', 3,
 ( #597, #609, #404, #861 ),
 .UNSPECIFIED., .F., .F.,
 ( 4, 4 ),
 ( 0.0000000000000000000, 1.000000000000000000 ),
 .UNSPECIFIED. ) ;
#277 = SURFACE_STYLE_FILL_AREA ( #626 ) ;
#278 = CARTESIAN_POINT ( 'NONE',  ( -0.2499999999999997780, -1.408962799656044823E-15, -1.000000000000000222 ) ) ;
#279 = EDGE_CURVE ( 'NONE', #51, #60, #786, .T. ) ;
#280 = ORIENTED_EDGE ( 'NONE', *, *, #562, .T. ) ;
#281 = DIRECTION ( 'NONE',  ( 0.0000000000000000000, 0.0000000000000000000, -1.000000000000000000 ) ) ;
#282 = CARTESIAN_POINT ( 'NONE',  ( -1.250000000000000000, 0.0000000000000000000, 0.0000000000000000000 ) ) ;
#283 = VERTEX_POINT ( 'NONE', #326 ) ;
#284 = DIRECTION ( 'NONE',  ( -1.000000000000000000, -0.0000000000000000000, -0.0000000000000000000 ) ) ;
#285 =( GEOMETRIC_REPRESENTATION_CONTEXT ( 3 ) GLOBAL_UNCERTAINTY_ASSIGNED_CONTEXT ( ( #124 ) ) GLOBAL_UNIT_ASSIGNED_CONTEXT ( ( #145, #218, #242 ) ) REPRESENTATION_CONTEXT ( 'NONE', 'WORKASPACE' ) );
#286 = STYLED_ITEM ( 'NONE', ( #686 ), #462 ) ;
#287 = ADVANCED_FACE ( 'NONE', ( #313 ), #849, .T. ) ;
#288 = CARTESIAN_POINT ( 'NONE',  ( -0.2499999999999997780, 0.7302668532270674140, 0.6831620035378410671 ) ) ;
#289 = PLANE ( 'NONE',  #359 ) ;
#290 = ORIENTED_EDGE ( 'NONE', *, *, #556, .F. ) ;
#291 = DIRECTION ( 'NONE',  ( -1.000000000000000000, -0.0000000000000000000, -0.0000000000000000000 ) ) ;
#292 = CARTESIAN_POINT ( 'NONE',  ( 1.500000000000000666, 0.0000000000000000000, 0.9500000000000003997 ) ) ;
#293 = DIRECTION ( 'NONE',  ( -0.0000000000000000000, 1.000000000000000000, 1.224646799147353207E-16 ) ) ;
#294 = FACE_OUTER_BOUND ( 'NONE', #802, .T. ) ;
#295 = UNCERTAINTY_MEASURE_WITH_UNIT (LENGTH_MEASURE( 1.000000000000000082E-05 ), #188, 'distance_accuracy_value', 'NONE');
#296 = ORIENTED_EDGE ( 'NONE', *, *, #801, .F. ) ;
#297 = B_SPLINE_CURVE_WITH_KNOTS ( 'NONE', 3,
 ( #306, #250, #508, #578 ),
 .UNSPECIFIED., .F., .F.,
 ( 4, 4 ),
 ( 0.0000000000000000000, 1.000000000000000000 ),
 .UNSPECIFIED. ) ;
#298 = FILL_AREA_STYLE_COLOUR ( '', #85 ) ;
#299 = FACE_OUTER_BOUND ( 'NONE', #488, .T. ) ;
#300 = ORIENTED_EDGE ( 'NONE', *, *, #240, .T. ) ;
#301 =( GEOMETRIC_REPRESENTATION_CONTEXT ( 3 ) GLOBAL_UNCERTAINTY_ASSIGNED_CONTEXT ( ( #234 ) ) GLOBAL_UNIT_ASSIGNED_CONTEXT ( ( #690, #345, #622 ) ) REPRESENTATION_CONTEXT ( 'NONE', 'WORKASPACE' ) );
#302 = AXIS2_PLACEMENT_3D ( 'NONE', #630, #835, #710 ) ;
#303 = AXIS2_PLACEMENT_3D ( 'NONE', #628, #423, #79 ) ;
#304 = SURFACE_STYLE_FILL_AREA ( #113 ) ;
#305 = DIRECTION ( 'NONE',  ( 0.0000000000000000000, 0.0000000000000000000, 1.000000000000000000 ) ) ;
#306 = CARTESIAN_POINT ( 'NONE',  ( -1.249999999999999778, 0.7302668532270675250, 0.6831620035378409561 ) ) ;
#307 = UNCERTAINTY_MEASURE_WITH_UNIT (LENGTH_MEASURE( 1.000000000000000082E-05 ), #758, 'distance_accuracy_value', 'NONE');
#308 = ORIENTED_EDGE ( 'NONE', *, *, #261, .F. ) ;
#309 = EDGE_CURVE ( 'NONE', #100, #785, #598, .T. ) ;
#310 = DIRECTION ( 'NONE',  ( 0.0000000000000000000, -1.224646799147355672E-16, 1.000000000000000000 ) ) ;
#311 = CYLINDRICAL_SURFACE ( 'NONE', #837, 1.000000000000000222 ) ;
#312 = ORIENTED_EDGE ( 'NONE', *, *, #131, .F. ) ;
#313 = FACE_OUTER_BOUND ( 'NONE', #57, .T. ) ;
#314 = CARTESIAN_POINT ( 'NONE',  ( -0.2499999999999997780, 0.9523437664935138214, 0.3612644339963477225 ) ) ;
#315 = AXIS2_PLACEMENT_3D ( 'NONE', #636, #41, #830 ) ;
#316 = EDGE_CURVE ( 'NONE', #445, #859, #19, .T. ) ;
#317 = COLOUR_RGB ( '',0.9098039215686274384, 0.4431372549019607643, 0.03137254901960784270 ) ;
#318 = DIRECTION ( 'NONE',  ( 0.0000000000000000000, 0.0000000000000000000, 1.000000000000000000 ) ) ;
#319 = ORIENTED_EDGE ( 'NONE', *, *, #672, .F. ) ;
#320 = DIRECTION ( 'NONE',  ( 0.0000000000000000000, 0.0000000000000000000, 1.000000000000000000 ) ) ;
#321 = CARTESIAN_POINT ( 'NONE',  ( 1.450000000000000622, 1.194030629168670308E-16, -0.9500000000000003997 ) ) ;
#322 = ORIENTED_EDGE ( 'NONE', *, *, #820, .F. ) ;
#323 =( NAMED_UNIT ( * ) PLANE_ANGLE_UNIT ( ) SI_UNIT ( $, .RADIAN. ) );
#324 = ORIENTED_EDGE ( 'NONE', *, *, #524, .T. ) ;
#325 =( LENGTH_UNIT ( ) NAMED_UNIT ( * ) SI_UNIT ( .MILLI., .METRE. ) );
#326 = CARTESIAN_POINT ( 'NONE',  ( -1.749999999999999778, 1.194030629168670061E-16, -0.9500000000000003997 ) ) ;
#327 = CIRCLE ( 'NONE', #658, 0.7999999999999999334 ) ;
#328 = CIRCLE ( 'NONE', #484, 1.000000000000000222 ) ;
#329 = DIRECTION ( 'NONE',  ( 0.0000000000000000000, 0.0000000000000000000, 1.000000000000000000 ) ) ;
#330 = UNCERTAINTY_MEASURE_WITH_UNIT (LENGTH_MEASURE( 1.000000000000000082E-05 ), #506, 'distance_accuracy_value', 'NONE');
#331 = ORIENTED_EDGE ( 'NONE', *, *, #500, .F. ) ;
#332 = TOROIDAL_SURFACE ( 'NONE', #620, 0.9500000000000003997, 0.05000000000000007910 ) ;
#333 = DIRECTION ( 'NONE',  ( 0.0000000000000000000, 0.0000000000000000000, 1.000000000000000000 ) ) ;
#334 = EDGE_CURVE ( 'NONE', #96, #407, #741, .T. ) ;
#335 = DIRECTION ( 'NONE',  ( 0.0000000000000000000, -1.000000000000000000, 0.0000000000000000000 ) ) ;
#336 = CARTESIAN_POINT ( 'NONE',  ( 1.250000000000000000, 9.797174393178824918E-17, -0.7999999999999999334 ) ) ;
#337 = CARTESIAN_POINT ( 'NONE',  ( -0.2499999999999997780, 0.7302668532270674140, 0.6831620035378410671 ) ) ;
#338 = DIRECTION ( 'NONE',  ( -0.0000000000000000000, 1.000000000000000000, 1.224646799147353207E-16 ) ) ;
#339 = ORIENTED_EDGE ( 'NONE', *, *, #352, .F. ) ;
#340 = EDGE_CURVE ( 'NONE', #666, #670, #850, .T. ) ;
#341 = AXIS2_PLACEMENT_3D ( 'NONE', #9, #490, #550 ) ;
#342 = ORIENTED_EDGE ( 'NONE', *, *, #413, .T. ) ;
#343 = TOROIDAL_SURFACE ( 'NONE', #642, 0.9500000000000003997, 0.05000000000000018319 ) ;
#344 = DIRECTION ( 'NONE',  ( -1.000000000000000000, -0.0000000000000000000, -0.0000000000000000000 ) ) ;
#345 =( NAMED_UNIT ( * ) PLANE_ANGLE_UNIT ( ) SI_UNIT ( $, .RADIAN. ) );
#346 = ADVANCED_FACE ( 'NONE', ( #164 ), #236, .T. ) ;
#347 = CARTESIAN_POINT ( 'NONE',  ( -0.2499999999999997780, -0.9291289185561337760, 0.4114712473902614187 ) ) ;
#348 = DIRECTION ( 'NONE',  ( 0.0000000000000000000, 0.0000000000000000000, 1.000000000000000000 ) ) ;
#349 =( NAMED_UNIT ( * ) PLANE_ANGLE_UNIT ( ) SI_UNIT ( $, .RADIAN. ) );
#350 = CARTESIAN_POINT ( 'NONE',  ( 1.750000000000000000, 0.0000000000000000000, 0.0000000000000000000 ) ) ;
#351 = VERTEX_POINT ( 'NONE', #161 ) ;
#352 = EDGE_CURVE ( 'NONE', #259, #728, #716, .T. ) ;
#353 =( NAMED_UNIT ( * ) SI_UNIT ( $, .STERADIAN. ) SOLID_ANGLE_UNIT ( ) );
#354 = CARTESIAN_POINT ( 'NONE',  ( 1.699999999999999956, 1.224646799147353947E-16, -1.000000000000000444 ) ) ;
#355 = CARTESIAN_POINT ( 'NONE',  ( -1.750000000000000000, 0.0000000000000000000, 0.0000000000000000000 ) ) ;
#356 = AXIS2_PLACEMENT_3D ( 'NONE', #809, #469, #134 ) ;
#357 = AXIS2_PLACEMENT_3D ( 'NONE', #621, #671, #5 ) ;
#358 = EDGE_CURVE ( 'NONE', #696, #859, #328, .T. ) ;
#359 = AXIS2_PLACEMENT_3D ( 'NONE', #350, #15, #281 ) ;
#360 = DIRECTION ( 'NONE',  ( 0.0000000000000000000, 0.0000000000000000000, 1.000000000000000000 ) ) ;
#361 = FACE_OUTER_BOUND ( 'NONE', #140, .T. ) ;
#362 = FACE_OUTER_BOUND ( 'NONE', #869, .T. ) ;
#363 = CARTESIAN_POINT ( 'NONE',  ( 1.500000000000000666, 0.0000000000000000000, 0.0000000000000000000 ) ) ;
#364 = VERTEX_POINT ( 'NONE', #705 ) ;
#365 =( LENGTH_UNIT ( ) NAMED_UNIT ( * ) SI_UNIT ( .MILLI., .METRE. ) );
#366 = LINE ( 'NONE', #707, #49 ) ;
#367 = CARTESIAN_POINT ( 'NONE',  ( -1.500000000000000666, 0.0000000000000000000, 0.0000000000000000000 ) ) ;
#368 = EDGE_LOOP ( 'NONE', ( #308, #452, #442, #331 ) ) ;
#369 = DIRECTION ( 'NONE',  ( -1.000000000000000000, -0.0000000000000000000, -0.0000000000000000000 ) ) ;
#370 = DIRECTION ( 'NONE',  ( 1.000000000000000000, 0.0000000000000000000, 0.0000000000000000000 ) ) ;
#371 = DIRECTION ( 'NONE',  ( -1.000000000000000000, -0.0000000000000000000, -0.0000000000000000000 ) ) ;
#372 = ADVANCED_FACE ( 'NONE', ( #561 ), #858, .T. ) ;
#373 = DIRECTION ( 'NONE',  ( 0.0000000000000000000, 0.0000000000000000000, -1.000000000000000000 ) ) ;
#374 = ORIENTED_EDGE ( 'NONE', *, *, #210, .F. ) ;
#375 = CIRCLE ( 'NONE', #406, 1.000000000000000444 ) ;
#376 = TOROIDAL_SURFACE ( 'NONE', #357, 0.9500000000000003997, 0.05000000000000007910 ) ;
#377 = AXIS2_PLACEMENT_3D ( 'NONE', #268, #677, #595 ) ;
#378 = PRESENTATION_STYLE_ASSIGNMENT (( #386 ) ) ;
#379 = CARTESIAN_POINT ( 'NONE',  ( -1.699999999999999956, 0.0000000000000000000, 0.0000000000000000000 ) ) ;
#380 = DIRECTION ( 'NONE',  ( 0.0000000000000000000, -1.000000000000000000, 0.0000000000000000000 ) ) ;
#381 = ORIENTED_EDGE ( 'NONE', *, *, #650, .F. ) ;
#382 = CARTESIAN_POINT ( 'NONE',  ( -1.500000000000000666, 0.0000000000000000000, 0.0000000000000000000 ) ) ;
#383 = DIRECTION ( 'NONE',  ( 0.0000000000000000000, 0.0000000000000000000, 1.000000000000000000 ) ) ;
#384 = EDGE_LOOP ( 'NONE', ( #498, #151, #472, #603 ) ) ;
#385 = ADVANCED_FACE ( 'NONE', ( #639 ), #172, .T. ) ;
#386 = SURFACE_STYLE_USAGE ( .BOTH. , #718 ) ;
#387 = LINE ( 'NONE', #654, #860 ) ;
#388 = CARTESIAN_POINT ( 'NONE',  ( -0.2499999999999997780, 0.7104665323253197551, -0.7298684451977557330 ) ) ;
#389 = ORIENTED_EDGE ( 'NONE', *, *, #661, .T. ) ;
#390 = PRESENTATION_LAYER_ASSIGNMENT (  '', '', ( #833 ) ) ;
#391 = CIRCLE ( 'NONE', #673, 0.9500000000000003997 ) ;
#392 = AXIS2_PLACEMENT_3D ( 'NONE', #590, #840, #333 ) ;
#393 = AXIS2_PLACEMENT_3D ( 'NONE', #855, #720, #518 ) ;
#394 =( NAMED_UNIT ( * ) PLANE_ANGLE_UNIT ( ) SI_UNIT ( $, .RADIAN. ) );
#395 = ORIENTED_EDGE ( 'NONE', *, *, #144, .T. ) ;
#396 = DIRECTION ( 'NONE',  ( 0.0000000000000000000, 0.0000000000000000000, 1.000000000000000000 ) ) ;
#397 = APPLICATION_CONTEXT ( 'automotive_design' ) ;
#398 = CARTESIAN_POINT ( 'NONE',  ( -1.249999999999999778, 0.0000000000000000000, 0.0000000000000000000 ) ) ;
#399 = ORIENTED_EDGE ( 'NONE', *, *, #611, .F. ) ;
#400 = SURFACE_SIDE_STYLE ('',( #614 ) ) ;
#401 = DIRECTION ( 'NONE',  ( -1.000000000000000000, -0.0000000000000000000, -0.0000000000000000000 ) ) ;
#402 = EDGE_CURVE ( 'NONE', #136, #283, #821, .T. ) ;
#403 = ORIENTED_EDGE ( 'NONE', *, *, #820, .T. ) ;
#404 = CARTESIAN_POINT ( 'NONE',  ( -0.9166666666666662966, -0.8278687073570961674, 0.5609219227119681683 ) ) ;
#405 = DIRECTION ( 'NONE',  ( 0.0000000000000000000, 0.0000000000000000000, 1.000000000000000000 ) ) ;
#406 = AXIS2_PLACEMENT_3D ( 'NONE', #382, #108, #599 ) ;
#407 = VERTEX_POINT ( 'NONE', #126 ) ;
#408 = AXIS2_PLACEMENT_3D ( 'NONE', #826, #159, #485 ) ;
#409 = PRODUCT_DEFINITION ( 'UNKNOWN', '', #641, #532 ) ;
#410 = LINE ( 'NONE', #674, #552 ) ;
#411 = DIRECTION ( 'NONE',  ( -1.000000000000000000, -0.0000000000000000000, -0.0000000000000000000 ) ) ;
#412 = SURFACE_STYLE_FILL_AREA ( #200 ) ;
#413 = EDGE_CURVE ( 'NONE', #168, #251, #276, .T. ) ;
#414 = CARTESIAN_POINT ( 'NONE',  ( -1.450000000000000400, 0.0000000000000000000, 0.0000000000000000000 ) ) ;
#415 = EDGE_LOOP ( 'NONE', ( #795, #846, #147, #477 ) ) ;
#416 = FACE_OUTER_BOUND ( 'NONE', #139, .T. ) ;
#417 =( GEOMETRIC_REPRESENTATION_CONTEXT ( 3 ) GLOBAL_UNCERTAINTY_ASSIGNED_CONTEXT ( ( #330 ) ) GLOBAL_UNIT_ASSIGNED_CONTEXT ( ( #506, #162, #246 ) ) REPRESENTATION_CONTEXT ( 'NONE', 'WORKASPACE' ) );
#418 = CARTESIAN_POINT ( 'NONE',  ( -0.2499999999999997780, -0.6701765009516535976, -0.7638406851552137500 ) ) ;
#419 = TOROIDAL_SURFACE ( 'NONE', #645, 0.9500000000000003997, 0.05000000000000018319 ) ;
#420 = DIRECTION ( 'NONE',  ( -1.000000000000000000, -0.0000000000000000000, -0.0000000000000000000 ) ) ;
#421 = DIRECTION ( 'NONE',  ( -1.000000000000000000, -0.0000000000000000000, -0.0000000000000000000 ) ) ;
#422 = ADVANCED_FACE ( 'NONE', ( #265 ), #197, .T. ) ;
#423 = DIRECTION ( 'NONE',  ( -1.000000000000000000, 0.0000000000000000000, -0.0000000000000000000 ) ) ;
#424 =( NAMED_UNIT ( * ) PLANE_ANGLE_UNIT ( ) SI_UNIT ( $, .RADIAN. ) );
#425 = CARTESIAN_POINT ( 'NONE',  ( 1.699999999999999956, 1.163414459189986175E-16, -0.9500000000000003997 ) ) ;
#426 = DIRECTION ( 'NONE',  ( -1.000000000000000000, -0.0000000000000000000, -0.0000000000000000000 ) ) ;
#427 = DIRECTION ( 'NONE',  ( 0.0000000000000000000, 0.0000000000000000000, 1.000000000000000000 ) ) ;
#428 = DIRECTION ( 'NONE',  ( -1.000000000000000000, -0.0000000000000000000, -0.0000000000000000000 ) ) ;
#429 = ORIENTED_EDGE ( 'NONE', *, *, #56, .T. ) ;
#430 = CIRCLE ( 'NONE', #184, 0.05000000000000023870 ) ;
#431 = AXIS2_PLACEMENT_3D ( 'NONE', #726, #97, #828 ) ;
#432 = MECHANICAL_DESIGN_GEOMETRIC_PRESENTATION_REPRESENTATION (  '', ( #260 ), #54 ) ;
#433 = DIRECTION ( 'NONE',  ( 0.0000000000000000000, 0.0000000000000000000, 1.000000000000000000 ) ) ;
#434 = FILL_AREA_STYLE_COLOUR ( '', #47 ) ;
#435 = DIRECTION ( 'NONE',  ( -1.000000000000000000, -0.0000000000000000000, -0.0000000000000000000 ) ) ;
#436 = FACE_OUTER_BOUND ( 'NONE', #652, .T. ) ;
#437 = VERTEX_POINT ( 'NONE', #735 ) ;
#438 = DIRECTION ( 'NONE',  ( 0.0000000000000000000, 0.0000000000000000000, 1.000000000000000000 ) ) ;
#439 = EDGE_CURVE ( 'NONE', #670, #644, #756, .T. ) ;
#440 = DIRECTION ( 'NONE',  ( -1.000000000000000000, -0.0000000000000000000, -0.0000000000000000000 ) ) ;
#441 = DIRECTION ( 'NONE',  ( -1.000000000000000000, -0.0000000000000000000, -0.0000000000000000000 ) ) ;
#442 = ORIENTED_EDGE ( 'NONE', *, *, #801, .T. ) ;
#443 = CARTESIAN_POINT ( 'NONE',  ( -1.450000000000000400, 0.0000000000000000000, 0.0000000000000000000 ) ) ;
#444 = DIRECTION ( 'NONE',  ( 0.0000000000000000000, 0.0000000000000000000, 1.000000000000000000 ) ) ;
#445 = VERTEX_POINT ( 'NONE', #679 ) ;
#446 = COLOUR_RGB ( '',0.7960784313725489669, 0.8235294117647058432, 0.9372549019607843146 ) ;
#447 = CIRCLE ( 'NONE', #502, 1.000000000000000222 ) ;
#448 = DIRECTION ( 'NONE',  ( 0.0000000000000000000, 0.0000000000000000000, -1.000000000000000000 ) ) ;
#449 = ADVANCED_FACE ( 'NONE', ( #684 ), #376, .T. ) ;
#450 = ORIENTED_EDGE ( 'NONE', *, *, #2, .T. ) ;
#451 = DIRECTION ( 'NONE',  ( -1.000000000000000000, -0.0000000000000000000, -0.0000000000000000000 ) ) ;
#452 = ORIENTED_EDGE ( 'NONE', *, *, #254, .T. ) ;
#453 = PRODUCT_CONTEXT ( 'NONE', #397, 'mechanical' ) ;
#454 = FACE_OUTER_BOUND ( 'NONE', #619, .T. ) ;
#455 = ORIENTED_EDGE ( 'NONE', *, *, #680, .T. ) ;
#456 = COLOUR_RGB ( '',0.7960784313725489669, 0.8235294117647058432, 0.9372549019607843146 ) ;
#457 = MECHANICAL_DESIGN_GEOMETRIC_PRESENTATION_REPRESENTATION (  '', ( #482 ), #285 ) ;
#458 = AXIS2_PLACEMENT_3D ( 'NONE', #336, #545, #11 ) ;
#459 = STYLED_ITEM ( 'NONE', ( #784 ), #665 ) ;
#460 = SURFACE_SIDE_STYLE ('',( #135 ) ) ;
#461 = ORIENTED_EDGE ( 'NONE', *, *, #688, .F. ) ;
#462 = ADVANCED_FACE ( 'NONE', ( #749 ), #815, .T. ) ;
#463 = CARTESIAN_POINT ( 'NONE',  ( 1.450000000000000622, 0.0000000000000000000, 0.9500000000000003997 ) ) ;
#464 = UNCERTAINTY_MEASURE_WITH_UNIT (LENGTH_MEASURE( 1.000000000000000082E-05 ), #775, 'distance_accuracy_value', 'NONE');
#465 = EDGE_LOOP ( 'NONE', ( #176, #635 ) ) ;
#466 = DIRECTION ( 'NONE',  ( -0.0000000000000000000, 0.0000000000000000000, 1.000000000000000000 ) ) ;
#467 =( LENGTH_UNIT ( ) NAMED_UNIT ( * ) SI_UNIT ( .MILLI., .METRE. ) );
#468 = DIRECTION ( 'NONE',  ( 0.0000000000000000000, 0.0000000000000000000, 1.000000000000000000 ) ) ;
#469 = DIRECTION ( 'NONE',  ( -1.000000000000000000, -0.0000000000000000000, -0.0000000000000000000 ) ) ;
#470 = AXIS2_PLACEMENT_3D ( 'NONE', #118, #33, #396 ) ;
#471 = LINE ( 'NONE', #744, #863 ) ;
#472 = ORIENTED_EDGE ( 'NONE', *, *, #92, .T. ) ;
#473 =( GEOMETRIC_REPRESENTATION_CONTEXT ( 3 ) GLOBAL_UNCERTAINTY_ASSIGNED_CONTEXT ( ( #253 ) ) GLOBAL_UNIT_ASSIGNED_CONTEXT ( ( #271, #263, #733 ) ) REPRESENTATION_CONTEXT ( 'NONE', 'WORKASPACE' ) );
#474 = FILL_AREA_STYLE ('',( #123 ) ) ;
#475 = ADVANCED_FACE ( 'NONE', ( #130 ), #530, .T. ) ;
#476 = DIRECTION ( 'NONE',  ( 0.0000000000000000000, 0.0000000000000000000, -1.000000000000000000 ) ) ;
#477 = ORIENTED_EDGE ( 'NONE', *, *, #750, .F. ) ;
#478 = SURFACE_SIDE_STYLE ('',( #61 ) ) ;
#479 = ADVANCED_FACE ( 'NONE', ( #823, #436 ), #772, .T. ) ;
#480 = ORIENTED_EDGE ( 'NONE', *, *, #43, .F. ) ;
#481 = DIRECTION ( 'NONE',  ( 0.0000000000000000000, 0.0000000000000000000, 1.000000000000000000 ) ) ;
#482 = STYLED_ITEM ( 'NONE', ( #483 ), #30 ) ;
#483 = PRESENTATION_STYLE_ASSIGNMENT (( #818 ) ) ;
#484 = AXIS2_PLACEMENT_3D ( 'NONE', #594, #369, #438 ) ;
#485 = DIRECTION ( 'NONE',  ( 0.0000000000000000000, 0.0000000000000000000, 1.000000000000000000 ) ) ;
#486 = AXIS2_PLACEMENT_3D ( 'NONE', #398, #59, #602 ) ;
#487 = ADVANCED_FACE ( 'NONE', ( #759, #708 ), #764, .T. ) ;
#488 = EDGE_LOOP ( 'NONE', ( #571, #280, #235, #319 ) ) ;
#489 = CARTESIAN_POINT ( 'NONE',  ( -1.250000000000000000, 9.797174393178824918E-17, -0.7999999999999999334 ) ) ;
#490 = DIRECTION ( 'NONE',  ( -1.000000000000000000, -0.0000000000000000000, -0.0000000000000000000 ) ) ;
#491 = CARTESIAN_POINT ( 'NONE',  ( -0.2499999999999997780, -0.8278687073570961674, 0.5609219227119681683 ) ) ;
#492 = FACE_OUTER_BOUND ( 'NONE', #791, .T. ) ;
#493 = ORIENTED_EDGE ( 'NONE', *, *, #183, .T. ) ;
#494 = SURFACE_SIDE_STYLE ('',( #694 ) ) ;
#495 = DIRECTION ( 'NONE',  ( 0.0000000000000000000, 0.0000000000000000000, 1.000000000000000000 ) ) ;
#496 = MECHANICAL_DESIGN_GEOMETRIC_PRESENTATION_REPRESENTATION (  '', ( #767 ), #417 ) ;
#497 = DIRECTION ( 'NONE',  ( 1.000000000000000000, 0.0000000000000000000, 0.0000000000000000000 ) ) ;
#498 = ORIENTED_EDGE ( 'NONE', *, *, #699, .F. ) ;
#499 = TOROIDAL_SURFACE ( 'NONE', #171, 0.9500000000000003997, 0.05000000000000007910 ) ;
#500 = EDGE_CURVE ( 'NONE', #71, #264, #36, .T. ) ;
#501 =( GEOMETRIC_REPRESENTATION_CONTEXT ( 3 ) GLOBAL_UNCERTAINTY_ASSIGNED_CONTEXT ( ( #776 ) ) GLOBAL_UNIT_ASSIGNED_CONTEXT ( ( #325, #738, #813 ) ) REPRESENTATION_CONTEXT ( 'NONE', 'WORKASPACE' ) );
#502 = AXIS2_PLACEMENT_3D ( 'NONE', #789, #451, #318 ) ;
#503 = DIRECTION ( 'NONE',  ( -1.000000000000000000, -0.0000000000000000000, -0.0000000000000000000 ) ) ;
#504 = DIRECTION ( 'NONE',  ( -1.000000000000000000, -0.0000000000000000000, -0.0000000000000000000 ) ) ;
#505 = ORIENTED_EDGE ( 'NONE', *, *, #309, .F. ) ;
#506 =( LENGTH_UNIT ( ) NAMED_UNIT ( * ) SI_UNIT ( .MILLI., .METRE. ) );
#507 = DIRECTION ( 'NONE',  ( 0.0000000000000000000, 0.0000000000000000000, 1.000000000000000000 ) ) ;
#508 = CARTESIAN_POINT ( 'NONE',  ( -0.5833333333333325932, 0.7302668532270675250, 0.6831620035378409561 ) ) ;
#509 = ADVANCED_FACE ( 'NONE', ( #624 ), #419, .T. ) ;
#510 = DIRECTION ( 'NONE',  ( -1.000000000000000000, -0.0000000000000000000, -0.0000000000000000000 ) ) ;
#511 = ORIENTED_EDGE ( 'NONE', *, *, #782, .F. ) ;
#512 = COLOUR_RGB ( '',0.9098039215686274384, 0.4431372549019607643, 0.03137254901960784270 ) ;
#513 =( GEOMETRIC_REPRESENTATION_CONTEXT ( 3 ) GLOBAL_UNCERTAINTY_ASSIGNED_CONTEXT ( ( #295 ) ) GLOBAL_UNIT_ASSIGNED_CONTEXT ( ( #188, #323, #86 ) ) REPRESENTATION_CONTEXT ( 'NONE', 'WORKASPACE' ) );
#514 = CIRCLE ( 'NONE', #393, 0.05000000000000023870 ) ;
#515 = APPLICATION_PROTOCOL_DEFINITION ( 'draft international standard', 'automotive_design', 1998, #169 ) ;
#516 = CARTESIAN_POINT ( 'NONE',  ( -0.2499999999999997780, -0.6121522266563358405, 0.8072744326349046151 ) ) ;
#517 = EDGE_CURVE ( 'NONE', #351, #196, #659, .T. ) ;
#518 = DIRECTION ( 'NONE',  ( 0.0000000000000000000, -1.224646799147350495E-16, 1.000000000000000000 ) ) ;
#519 = ORIENTED_EDGE ( 'NONE', *, *, #402, .F. ) ;
#520 = LINE ( 'NONE', #792, #853 ) ;
#521 = ORIENTED_EDGE ( 'NONE', *, *, #82, .T. ) ;
#522 = ORIENTED_EDGE ( 'NONE', *, *, #352, .T. ) ;
#523 = PRESENTATION_STYLE_ASSIGNMENT (( #256 ) ) ;
#524 = EDGE_CURVE ( 'NONE', #437, #17, #771, .T. ) ;
#525 = AXIS2_PLACEMENT_3D ( 'NONE', #379, #503, #29 ) ;
#526 = AXIS2_PLACEMENT_3D ( 'NONE', #26, #428, #702 ) ;
#527 = TOROIDAL_SURFACE ( 'NONE', #377, 0.7999999999999999334, 0.2000000000000003164 ) ;
#528 = FILL_AREA_STYLE ('',( #682 ) ) ;
#529 = ORIENTED_EDGE ( 'NONE', *, *, #267, .F. ) ;
#530 = CYLINDRICAL_SURFACE ( 'NONE', #117, 1.000000000000000222 ) ;
#531 = DIRECTION ( 'NONE',  ( 0.0000000000000000000, 0.0000000000000000000, 1.000000000000000000 ) ) ;
#532 = PRODUCT_DEFINITION_CONTEXT ( 'detailed design', #169, 'design' ) ;
#533 = EDGE_LOOP ( 'NONE', ( #312, #656 ) ) ;
#534 = DIRECTION ( 'NONE',  ( 0.0000000000000000000, -1.224646799147350495E-16, 1.000000000000000000 ) ) ;
#535 = DIRECTION ( 'NONE',  ( -1.000000000000000000, -0.0000000000000000000, -0.0000000000000000000 ) ) ;
#536 = ADVANCED_FACE ( 'NONE', ( #299 ), #732, .T. ) ;
#537 = SURFACE_SIDE_STYLE ('',( #190 ) ) ;
#538 = CARTESIAN_POINT ( 'NONE',  ( -0.2499999999999997780, -0.7988522224681522399, -0.6280320544238824354 ) ) ;
#539 = CARTESIAN_POINT ( 'NONE',  ( -0.2499999999999997780, -2.909464618929847177E-15, 1.000000000000000222 ) ) ;
#540 = PRESENTATION_LAYER_ASSIGNMENT (  '', '', ( #687 ) ) ;
#541 = COLOUR_RGB ( '',0.9098039215686274384, 0.4431372549019607643, 0.03137254901960784270 ) ;
#542 = ORIENTED_EDGE ( 'NONE', *, *, #316, .T. ) ;
#543 = MECHANICAL_DESIGN_GEOMETRIC_PRESENTATION_REPRESENTATION (  '', ( #133 ), #473 ) ;
#544 = ORIENTED_EDGE ( 'NONE', *, *, #70, .T. ) ;
#545 = DIRECTION ( 'NONE',  ( -0.0000000000000000000, 1.000000000000000000, 1.224646799147353207E-16 ) ) ;
#546 =( LENGTH_UNIT ( ) NAMED_UNIT ( * ) SI_UNIT ( .MILLI., .METRE. ) );
#547 = DIRECTION ( 'NONE',  ( 0.0000000000000000000, -1.000000000000000000, 0.0000000000000000000 ) ) ;
#548 = FILL_AREA_STYLE_COLOUR ( '', #512 ) ;
#549 = ADVANCED_FACE ( 'NONE', ( #492 ), #332, .T. ) ;
#550 = DIRECTION ( 'NONE',  ( 0.0000000000000000000, 0.0000000000000000000, 1.000000000000000000 ) ) ;
#551 = CIRCLE ( 'NONE', #729, 0.05000000000000023870 ) ;
#552 = VECTOR ( 'NONE', #719, 1000.000000000000000 ) ;
#553 = ORIENTED_EDGE ( 'NONE', *, *, #439, .T. ) ;
#554 = DIRECTION ( 'NONE',  ( 0.0000000000000000000, 0.0000000000000000000, 1.000000000000000000 ) ) ;
#555 = PRESENTATION_LAYER_ASSIGNMENT (  '', '', ( #459 ) ) ;
#556 = EDGE_CURVE ( 'NONE', #785, #100, #62, .T. ) ;
#557 = CARTESIAN_POINT ( 'NONE',  ( 1.250000000000000000, 0.0000000000000000000, 1.000000000000000222 ) ) ;
#558 = CARTESIAN_POINT ( 'NONE',  ( 1.450000000000000622, 0.0000000000000000000, 0.0000000000000000000 ) ) ;
#559 = CARTESIAN_POINT ( 'NONE',  ( 1.699999999999999956, 0.0000000000000000000, 0.0000000000000000000 ) ) ;
#560 = EDGE_LOOP ( 'NONE', ( #45, #725, #107, #273 ) ) ;
#561 = FACE_OUTER_BOUND ( 'NONE', #415, .T. ) ;
#562 = EDGE_CURVE ( 'NONE', #670, #666, #77, .T. ) ;
#563 = LINE ( 'NONE', #831, #692 ) ;
#564 = EDGE_LOOP ( 'NONE', ( #4, #544, #228, #461 ) ) ;
#565 = PRESENTATION_STYLE_ASSIGNMENT (( #229 ) ) ;
#566 = SHAPE_DEFINITION_REPRESENTATION ( #591, #165 ) ;
#567 = FACE_OUTER_BOUND ( 'NONE', #368, .T. ) ;
#568 = CIRCLE ( 'NONE', #834, 0.05000000000000002359 ) ;
#569 = DIRECTION ( 'NONE',  ( 0.0000000000000000000, 0.0000000000000000000, 1.000000000000000000 ) ) ;
#570 = UNCERTAINTY_MEASURE_WITH_UNIT (LENGTH_MEASURE( 1.000000000000000082E-05 ), #546, 'distance_accuracy_value', 'NONE');
#571 = ORIENTED_EDGE ( 'NONE', *, *, #439, .F. ) ;
#572 = MECHANICAL_DESIGN_GEOMETRIC_PRESENTATION_REPRESENTATION (  '', ( #573 ), #501 ) ;
#573 = STYLED_ITEM ( 'NONE', ( #58 ), #475 ) ;
#574 = AXIS2_PLACEMENT_3D ( 'NONE', #141, #420, #693 ) ;
#575 =( NAMED_UNIT ( * ) SI_UNIT ( $, .STERADIAN. ) SOLID_ANGLE_UNIT ( ) );
#576 = FILL_AREA_STYLE_COLOUR ( '', #446 ) ;
#577 = CARTESIAN_POINT ( 'NONE',  ( -1.749999999999999778, 0.0000000000000000000, 0.9500000000000003997 ) ) ;
#578 = CARTESIAN_POINT ( 'NONE',  ( -0.2499999999999997780, 0.7302668532270674140, 0.6831620035378410671 ) ) ;
#579 = ORIENTED_EDGE ( 'NONE', *, *, #46, .F. ) ;
#580 = ADVANCED_FACE ( 'NONE', ( #294 ), #289, .T. ) ;
#581 = DIRECTION ( 'NONE',  ( 0.0000000000000000000, 0.0000000000000000000, 1.000000000000000000 ) ) ;
#582 = CARTESIAN_POINT ( 'NONE',  ( 1.750000000000000000, 0.0000000000000000000, 0.0000000000000000000 ) ) ;
#583 = CARTESIAN_POINT ( 'NONE',  ( -0.2499999999999997780, 1.018362472414244602, -0.02021176954401229450 ) ) ;
#584 = ORIENTED_EDGE ( 'NONE', *, *, #625, .F. ) ;
#585 = CARTESIAN_POINT ( 'NONE',  ( -1.749999999999999778, 0.0000000000000000000, 0.0000000000000000000 ) ) ;
#586 = SURFACE_STYLE_USAGE ( .BOTH. , #115 ) ;
#587 = STYLED_ITEM ( 'NONE', ( #523 ), #346 ) ;
#588 = CIRCLE ( 'NONE', #204, 0.7999999999999999334 ) ;
#589 = CARTESIAN_POINT ( 'NONE',  ( -1.249999999999999778, 0.7302668532270675250, 0.6831620035378409561 ) ) ;
#590 = CARTESIAN_POINT ( 'NONE',  ( -1.749999999999999778, 0.0000000000000000000, 0.0000000000000000000 ) ) ;
#591 = PRODUCT_DEFINITION_SHAPE ( 'NONE', 'NONE',  #409 ) ;
#592 = ADVANCED_FACE ( 'NONE', ( #18 ), #231, .T. ) ;
#593 = ORIENTED_EDGE ( 'NONE', *, *, #605, .T. ) ;
#594 = CARTESIAN_POINT ( 'NONE',  ( 1.250000000000000000, 0.0000000000000000000, 0.0000000000000000000 ) ) ;
#595 = DIRECTION ( 'NONE',  ( 0.0000000000000000000, 0.0000000000000000000, 1.000000000000000000 ) ) ;
#596 = ORIENTED_EDGE ( 'NONE', *, *, #862, .F. ) ;
#597 = CARTESIAN_POINT ( 'NONE',  ( -0.2499999999999997780, -0.8278687073570961674, 0.5609219227119681683 ) ) ;
#598 = CIRCLE ( 'NONE', #214, 0.9500000000000003997 ) ;
#599 = DIRECTION ( 'NONE',  ( 0.0000000000000000000, 0.0000000000000000000, 1.000000000000000000 ) ) ;
#600 = AXIS2_PLACEMENT_3D ( 'NONE', #489, #81, #31 ) ;
#601 = AXIS2_PLACEMENT_3D ( 'NONE', #68, #338, #612 ) ;
#602 = DIRECTION ( 'NONE',  ( 0.0000000000000000000, 0.0000000000000000000, 1.000000000000000000 ) ) ;
#603 = ORIENTED_EDGE ( 'NONE', *, *, #254, .F. ) ;
#604 = CARTESIAN_POINT ( 'NONE',  ( 1.500000000000000666, 1.163414459189986175E-16, -0.9500000000000003997 ) ) ;
#605 = EDGE_CURVE ( 'NONE', #364, #445, #798, .T. ) ;
#606 = CARTESIAN_POINT ( 'NONE',  ( -0.2499999999999997224, -0.7366910978169414204, 0.6954916135968763902 ) ) ;
#607 = FILL_AREA_STYLE_COLOUR ( '', #38 ) ;
#608 = CARTESIAN_POINT ( 'NONE',  ( -0.2499999999999997780, -1.008276492116386258, -0.1263631677810562737 ) ) ;
#609 = CARTESIAN_POINT ( 'NONE',  ( -0.5833333333333330373, -0.8278687073570961674, 0.5609219227119681683 ) ) ;
#610 = CARTESIAN_POINT ( 'NONE',  ( 1.699999999999999956, 0.0000000000000000000, 1.000000000000000444 ) ) ;
#611 = EDGE_CURVE ( 'NONE', #196, #90, #119, .T. ) ;
#612 = DIRECTION ( 'NONE',  ( 0.0000000000000000000, -1.224646799147355672E-16, 1.000000000000000000 ) ) ;
#613 = ORIENTED_EDGE ( 'NONE', *, *, #839, .T. ) ;
#614 = SURFACE_STYLE_FILL_AREA ( #474 ) ;
#615 = MECHANICAL_DESIGN_GEOMETRIC_PRESENTATION_REPRESENTATION (  '', ( #833 ), #6 ) ;
#616 = AXIS2_PLACEMENT_3D ( 'NONE', #22, #779, #166 ) ;
#617 = AXIS2_PLACEMENT_3D ( 'NONE', #664, #182, #360 ) ;
#618 = DIRECTION ( 'NONE',  ( 0.0000000000000000000, 0.0000000000000000000, 1.000000000000000000 ) ) ;
#619 = EDGE_LOOP ( 'NONE', ( #116, #709, #493, #529, #207 ) ) ;
#620 = AXIS2_PLACEMENT_3D ( 'NONE', #89, #836, #348 ) ;
#621 = CARTESIAN_POINT ( 'NONE',  ( 1.699999999999999956, 0.0000000000000000000, 0.0000000000000000000 ) ) ;
#622 =( NAMED_UNIT ( * ) SI_UNIT ( $, .STERADIAN. ) SOLID_ANGLE_UNIT ( ) );
#623 = CARTESIAN_POINT ( 'NONE',  ( -1.450000000000000400, 1.102182119232618034E-16, -0.7999999999999999334 ) ) ;
#624 = FACE_OUTER_BOUND ( 'NONE', #160, .T. ) ;
#625 = EDGE_CURVE ( 'NONE', #90, #670, #563, .T. ) ;
#626 = FILL_AREA_STYLE ('',( #434 ) ) ;
#627 = ORIENTED_EDGE ( 'NONE', *, *, #183, .F. ) ;
#628 = CARTESIAN_POINT ( 'NONE',  ( 1.450000000000000400, -0.9500000000000003997, 0.0000000000000000000 ) ) ;
#629 = CIRCLE ( 'NONE', #458, 0.2000000000000003164 ) ;
#630 = CARTESIAN_POINT ( 'NONE',  ( -1.750000000000000000, 0.0000000000000000000, 0.0000000000000000000 ) ) ;
#631 = MECHANICAL_DESIGN_GEOMETRIC_PRESENTATION_REPRESENTATION (  '', ( #587 ), #513 ) ;
#632 = AXIS2_PLACEMENT_3D ( 'NONE', #662, #380, #373 ) ;
#633 = CARTESIAN_POINT ( 'NONE',  ( -1.249999999999999778, 0.0000000000000000000, 0.0000000000000000000 ) ) ;
#634 = DIRECTION ( 'NONE',  ( 0.0000000000000000000, 0.0000000000000000000, 1.000000000000000000 ) ) ;
#635 = ORIENTED_EDGE ( 'NONE', *, *, #778, .T. ) ;
#636 = CARTESIAN_POINT ( 'NONE',  ( -1.249999999999999778, 0.0000000000000000000, 0.0000000000000000000 ) ) ;
#637 = DIRECTION ( 'NONE',  ( 0.0000000000000000000, 0.0000000000000000000, -1.000000000000000000 ) ) ;
#638 = ORIENTED_EDGE ( 'NONE', *, *, #106, .T. ) ;
#639 = FACE_OUTER_BOUND ( 'NONE', #857, .T. ) ;
#640 = CARTESIAN_POINT ( 'NONE',  ( -1.500000000000000666, 0.0000000000000000000, 1.000000000000000444 ) ) ;
#641 = PRODUCT_DEFINITION_FORMATION_WITH_SPECIFIED_SOURCE ( 'ANY', '', #794, .NOT_KNOWN. ) ;
#642 = AXIS2_PLACEMENT_3D ( 'NONE', #63, #205, #198 ) ;
#643 = CARTESIAN_POINT ( 'NONE',  ( 1.500000000000000666, 1.224646799147354193E-16, -1.000000000000000666 ) ) ;
#644 = VERTEX_POINT ( 'NONE', #321 ) ;
#645 = AXIS2_PLACEMENT_3D ( 'NONE', #367, #95, #569 ) ;
#646 = MECHANICAL_DESIGN_GEOMETRIC_PRESENTATION_REPRESENTATION (  '', ( #459 ), #810 ) ;
#647 = CARTESIAN_POINT ( 'NONE',  ( -1.699999999999999956, 0.0000000000000000000, 0.0000000000000000000 ) ) ;
#648 = CARTESIAN_POINT ( 'NONE',  ( -0.2499999999999995837, 0.9944230802224468535, -0.2204390581785714287 ) ) ;
#649 = EDGE_LOOP ( 'NONE', ( #269, #553, #125, #596 ) ) ;
#650 = EDGE_CURVE ( 'NONE', #264, #136, #717, .T. ) ;
#651 = CARTESIAN_POINT ( 'NONE',  ( -1.699999999999999956, 0.0000000000000000000, 1.000000000000000444 ) ) ;
#652 = EDGE_LOOP ( 'NONE', ( #505, #290 ) ) ;
#653 = FILL_AREA_STYLE ('',( #576 ) ) ;
#654 = CARTESIAN_POINT ( 'NONE',  ( -1.750000000000000000, 1.224646799147353947E-16, -1.000000000000000444 ) ) ;
#655 = FILL_AREA_STYLE_COLOUR ( '', #676 ) ;
#656 = ORIENTED_EDGE ( 'NONE', *, *, #605, .F. ) ;
#657 = CARTESIAN_POINT ( 'NONE',  ( 1.250000000000000000, 0.0000000000000000000, 0.0000000000000000000 ) ) ;
#658 = AXIS2_PLACEMENT_3D ( 'NONE', #558, #371, #507 ) ;
#659 = CIRCLE ( 'NONE', #275, 0.05000000000000002359 ) ;
#660 = AXIS2_PLACEMENT_3D ( 'NONE', #23, #753, #148 ) ;
#661 = EDGE_CURVE ( 'NONE', #60, #838, #153, .T. ) ;
#662 = CARTESIAN_POINT ( 'NONE',  ( -1.699999999999999956, 0.0000000000000000000, 0.9500000000000003997 ) ) ;
#663 = EDGE_LOOP ( 'NONE', ( #584, #179, #244, #773 ) ) ;
#664 = CARTESIAN_POINT ( 'NONE',  ( -1.750000000000000000, 0.0000000000000000000, 0.0000000000000000000 ) ) ;
#665 = ADVANCED_FACE ( 'NONE', ( #841 ), #311, .T. ) ;
#666 = VERTEX_POINT ( 'NONE', #178 ) ;
#667 = CARTESIAN_POINT ( 'NONE',  ( -1.750000000000000000, 0.0000000000000000000, 0.0000000000000000000 ) ) ;
#668 = CYLINDRICAL_SURFACE ( 'NONE', #8, 1.000000000000000222 ) ;
#669 = UNCERTAINTY_MEASURE_WITH_UNIT (LENGTH_MEASURE( 1.000000000000000082E-05 ), #365, 'distance_accuracy_value', 'NONE');
#670 = VERTEX_POINT ( 'NONE', #643 ) ;
#671 = DIRECTION ( 'NONE',  ( -1.000000000000000000, -0.0000000000000000000, -0.0000000000000000000 ) ) ;
#672 = EDGE_CURVE ( 'NONE', #644, #799, #787, .T. ) ;
#673 = AXIS2_PLACEMENT_3D ( 'NONE', #585, #1, #531 ) ;
#674 = CARTESIAN_POINT ( 'NONE',  ( -1.750000000000000000, 1.224646799147353454E-16, -1.000000000000000222 ) ) ;
#675 = AXIS2_PLACEMENT_3D ( 'NONE', #604, #192, #534 ) ;
#676 = COLOUR_RGB ( '',0.9098039215686274384, 0.4431372549019607643, 0.03137254901960784270 ) ;
#677 = DIRECTION ( 'NONE',  ( -1.000000000000000000, -0.0000000000000000000, -0.0000000000000000000 ) ) ;
#678 = CARTESIAN_POINT ( 'NONE',  ( -0.2499999999999997780, -0.8278687073570961674, 0.5609219227119681683 ) ) ;
#679 = CARTESIAN_POINT ( 'NONE',  ( 1.450000000000000622, 0.0000000000000000000, 0.7999999999999999334 ) ) ;
#680 = EDGE_CURVE ( 'NONE', #728, #60, #297, .T. ) ;
#681 = DIRECTION ( 'NONE',  ( -1.000000000000000000, -0.0000000000000000000, -0.0000000000000000000 ) ) ;
#682 = FILL_AREA_STYLE_COLOUR ( '', #317 ) ;
#683 = VERTEX_POINT ( 'NONE', #167 ) ;
#684 = FACE_OUTER_BOUND ( 'NONE', #564, .T. ) ;
#685 = VERTEX_POINT ( 'NONE', #845 ) ;
#686 = PRESENTATION_STYLE_ASSIGNMENT (( #740 ) ) ;
#687 = STYLED_ITEM ( 'NONE', ( #16 ), #854 ) ;
#688 = EDGE_CURVE ( 'NONE', #90, #196, #689, .T. ) ;
#689 = CIRCLE ( 'NONE', #174, 1.000000000000000666 ) ;
#690 =( LENGTH_UNIT ( ) NAMED_UNIT ( * ) SI_UNIT ( .MILLI., .METRE. ) );
#691 = CARTESIAN_POINT ( 'NONE',  ( -0.2499999999999997780, -0.9888162894971421757, 0.2341612272586820198 ) ) ;
#692 = VECTOR ( 'NONE', #504, 1000.000000000000000 ) ;
#693 = DIRECTION ( 'NONE',  ( 0.0000000000000000000, 0.0000000000000000000, 1.000000000000000000 ) ) ;
#694 = SURFACE_STYLE_FILL_AREA ( #768 ) ;
#695 = ORIENTED_EDGE ( 'NONE', *, *, #713, .T. ) ;
#696 = VERTEX_POINT ( 'NONE', #105 ) ;
#697 = DIRECTION ( 'NONE',  ( -1.000000000000000000, -0.0000000000000000000, -0.0000000000000000000 ) ) ;
#698 = DIRECTION ( 'NONE',  ( 0.0000000000000000000, -1.000000000000000000, 0.0000000000000000000 ) ) ;
#699 = EDGE_CURVE ( 'NONE', #785, #407, #514, .T. ) ;
#700 = PRESENTATION_LAYER_ASSIGNMENT (  '', '', ( #482 ) ) ;
#701 = CARTESIAN_POINT ( 'NONE',  ( -0.2499999999999997780, -2.909464618929847177E-15, 1.000000000000000222 ) ) ;
#702 = DIRECTION ( 'NONE',  ( 0.0000000000000000000, 0.0000000000000000000, 1.000000000000000000 ) ) ;
#703 = CIRCLE ( 'NONE', #486, 1.000000000000000222 ) ;
#704 = ORIENTED_EDGE ( 'NONE', *, *, #210, .T. ) ;
#705 = CARTESIAN_POINT ( 'NONE',  ( 1.450000000000000622, 1.102182119232618034E-16, -0.7999999999999999334 ) ) ;
#706 = SURFACE_SIDE_STYLE ('',( #277 ) ) ;
#707 = CARTESIAN_POINT ( 'NONE',  ( -1.750000000000000000, 0.0000000000000000000, 1.000000000000000222 ) ) ;
#708 = FACE_BOUND ( 'NONE', #533, .T. ) ;
#709 = ORIENTED_EDGE ( 'NONE', *, *, #358, .T. ) ;
#710 = DIRECTION ( 'NONE',  ( 0.0000000000000000000, 0.0000000000000000000, 1.000000000000000000 ) ) ;
#711 = CARTESIAN_POINT ( 'NONE',  ( -0.2499999999999997224, 0.8625088091144561542, 0.5418018042141580226 ) ) ;
#712 = EDGE_LOOP ( 'NONE', ( #737, #593, #542, #128 ) ) ;
#713 = EDGE_CURVE ( 'NONE', #251, #259, #447, .T. ) ;
#714 = CARTESIAN_POINT ( 'NONE',  ( 1.450000000000000622, 0.0000000000000000000, 0.0000000000000000000 ) ) ;
#715 = EDGE_LOOP ( 'NONE', ( #322, #112, #181, #40 ) ) ;
#716 = CIRCLE ( 'NONE', #230, 1.000000000000000222 ) ;
#717 = CIRCLE ( 'NONE', #632, 0.05000000000000002359 ) ;
#718 = SURFACE_SIDE_STYLE ('',( #848 ) ) ;
#719 = DIRECTION ( 'NONE',  ( -1.000000000000000000, -0.0000000000000000000, -0.0000000000000000000 ) ) ;
#720 = DIRECTION ( 'NONE',  ( -0.0000000000000000000, 1.000000000000000000, 1.224646799147353207E-16 ) ) ;
#721 = ORIENTED_EDGE ( 'NONE', *, *, #517, .F. ) ;
#722 = CARTESIAN_POINT ( 'NONE',  ( -1.249999999999999778, -0.8278687073570961674, 0.5609219227119681683 ) ) ;
#723 = CARTESIAN_POINT ( 'NONE',  ( -0.2499999999999995282, 0.8403314011934407413, -0.5755986249271469735 ) ) ;
#724 = UNCERTAINTY_MEASURE_WITH_UNIT (LENGTH_MEASURE( 1.000000000000000082E-05 ), #217, 'distance_accuracy_value', 'NONE');
#725 = ORIENTED_EDGE ( 'NONE', *, *, #111, .T. ) ;
#726 = CARTESIAN_POINT ( 'NONE',  ( -1.750000000000000000, 0.0000000000000000000, 0.0000000000000000000 ) ) ;
#727 = SURFACE_STYLE_FILL_AREA ( #109 ) ;
#728 = VERTEX_POINT ( 'NONE', #589 ) ;
#729 = AXIS2_PLACEMENT_3D ( 'NONE', #292, #547, #211 ) ;
#730 = TOROIDAL_SURFACE ( 'NONE', #525, 0.9500000000000003997, 0.05000000000000007910 ) ;
#731 = AXIS2_PLACEMENT_3D ( 'NONE', #657, #53, #320 ) ;
#732 = TOROIDAL_SURFACE ( 'NONE', #408, 0.9500000000000003997, 0.05000000000000018319 ) ;
#733 =( NAMED_UNIT ( * ) SI_UNIT ( $, .STERADIAN. ) SOLID_ANGLE_UNIT ( ) );
#734 = EDGE_LOOP ( 'NONE', ( #395, #827 ) ) ;
#735 = CARTESIAN_POINT ( 'NONE',  ( -1.249999999999999778, 1.224646799147353454E-16, -1.000000000000000222 ) ) ;
#736 = SURFACE_STYLE_USAGE ( .BOTH. , #537 ) ;
#737 = ORIENTED_EDGE ( 'NONE', *, *, #2, .F. ) ;
#738 =( NAMED_UNIT ( * ) PLANE_ANGLE_UNIT ( ) SI_UNIT ( $, .RADIAN. ) );
#739 = DIRECTION ( 'NONE',  ( -1.000000000000000000, -0.0000000000000000000, -0.0000000000000000000 ) ) ;
#740 = SURFACE_STYLE_USAGE ( .BOTH. , #478 ) ;
#741 = CIRCLE ( 'NONE', #356, 1.000000000000000444 ) ;
#742 = CARTESIAN_POINT ( 'NONE',  ( 1.250000000000000000, 0.0000000000000000000, 0.7999999999999999334 ) ) ;
#743 = PRESENTATION_LAYER_ASSIGNMENT (  '', '', ( #587 ) ) ;
#744 = CARTESIAN_POINT ( 'NONE',  ( -1.750000000000000000, 0.0000000000000000000, 1.000000000000000444 ) ) ;
#745 = ORIENTED_EDGE ( 'NONE', *, *, #699, .T. ) ;
#746 = SURFACE_STYLE_USAGE ( .BOTH. , #400 ) ;
#747 = DIRECTION ( 'NONE',  ( -1.000000000000000000, -0.0000000000000000000, -0.0000000000000000000 ) ) ;
#748 = ORIENTED_EDGE ( 'NONE', *, *, #839, .F. ) ;
#749 = FACE_OUTER_BOUND ( 'NONE', #27, .T. ) ;
#750 = EDGE_CURVE ( 'NONE', #196, #666, #520, .T. ) ;
#751 = DIRECTION ( 'NONE',  ( -1.000000000000000000, -0.0000000000000000000, -0.0000000000000000000 ) ) ;
#752 = CARTESIAN_POINT ( 'NONE',  ( -0.2499999999999997780, -0.3607939817898559998, -0.9499562292181726875 ) ) ;
#753 = DIRECTION ( 'NONE',  ( -1.000000000000000000, -0.0000000000000000000, -0.0000000000000000000 ) ) ;
#754 = AXIS2_PLACEMENT_3D ( 'NONE', #13, #751, #824 ) ;
#755 = AXIS2_PLACEMENT_3D ( 'NONE', #173, #867, #448 ) ;
#756 = CIRCLE ( 'NONE', #675, 0.05000000000000023870 ) ;
#757 = AXIS2_PLACEMENT_3D ( 'NONE', #714, #441, #39 ) ;
#758 =( LENGTH_UNIT ( ) NAMED_UNIT ( * ) SI_UNIT ( .MILLI., .METRE. ) );
#759 = FACE_OUTER_BOUND ( 'NONE', #734, .T. ) ;
#760 = CARTESIAN_POINT ( 'NONE',  ( -0.2499999999999997780, -0.9680218096642859704, -0.3090678092918597852 ) ) ;
#761 = ADVANCED_FACE ( 'NONE', ( #454 ), #668, .T. ) ;
#762 = CARTESIAN_POINT ( 'NONE',  ( 1.450000000000000622, 0.0000000000000000000, 0.0000000000000000000 ) ) ;
#763 = CARTESIAN_POINT ( 'NONE',  ( 1.250000000000000000, 0.0000000000000000000, 0.0000000000000000000 ) ) ;
#764 = PLANE ( 'NONE',  #303 ) ;
#765 = ORIENTED_EDGE ( 'NONE', *, *, #402, .T. ) ;
#766 = FILL_AREA_STYLE_COLOUR ( '', #541 ) ;
#767 = STYLED_ITEM ( 'NONE', ( #378 ), #165 ) ;
#768 = FILL_AREA_STYLE ('',( #149 ) ) ;
#769 = CIRCLE ( 'NONE', #315, 1.000000000000000222 ) ;
#770 = DIRECTION ( 'NONE',  ( 0.0000000000000000000, 0.0000000000000000000, 1.000000000000000000 ) ) ;
#771 = CIRCLE ( 'NONE', #600, 0.2000000000000003164 ) ;
#772 = PLANE ( 'NONE',  #215 ) ;
#773 = ORIENTED_EDGE ( 'NONE', *, *, #562, .F. ) ;
#774 = DIRECTION ( 'NONE',  ( -1.000000000000000000, -0.0000000000000000000, -0.0000000000000000000 ) ) ;
#775 =( LENGTH_UNIT ( ) NAMED_UNIT ( * ) SI_UNIT ( .MILLI., .METRE. ) );
#776 = UNCERTAINTY_MEASURE_WITH_UNIT (LENGTH_MEASURE( 1.000000000000000082E-05 ), #325, 'distance_accuracy_value', 'NONE');
#777 = ORIENTED_EDGE ( 'NONE', *, *, #70, .F. ) ;
#778 = EDGE_CURVE ( 'NONE', #17, #685, #588, .T. ) ;
#779 = DIRECTION ( 'NONE',  ( -1.000000000000000000, -0.0000000000000000000, -0.0000000000000000000 ) ) ;
#780 = CARTESIAN_POINT ( 'NONE',  ( -0.2499999999999997780, 0.7302668532270674140, 0.6831620035378410671 ) ) ;
#781 = ORIENTED_EDGE ( 'NONE', *, *, #524, .F. ) ;
#782 = EDGE_CURVE ( 'NONE', #437, #251, #703, .T. ) ;
#783 = DIRECTION ( 'NONE',  ( -1.000000000000000000, -0.0000000000000000000, -0.0000000000000000000 ) ) ;
#784 = PRESENTATION_STYLE_ASSIGNMENT (( #586 ) ) ;
#785 = VERTEX_POINT ( 'NONE', #199 ) ;
#786 = B_SPLINE_CURVE_WITH_KNOTS ( 'NONE', 3,
 ( #539, #788, #805, #48, #177, #337 ),
 .UNSPECIFIED., .F., .F.,
 ( 4, 2, 4 ),
 ( 0.1552233920984035509, 0.2203744614966672843, 0.2855255308949310455 ),
 .UNSPECIFIED. ) ;
#787 = CIRCLE ( 'NONE', #757, 0.9500000000000003997 ) ;
#788 = CARTESIAN_POINT ( 'NONE',  ( -0.2499999999999997224, 0.1364520806633998662, 1.000000000000000444 ) ) ;
#789 = CARTESIAN_POINT ( 'NONE',  ( -1.249999999999999778, 0.0000000000000000000, 0.0000000000000000000 ) ) ;
#790 = ADVANCED_FACE ( 'NONE', ( #195 ), #527, .T. ) ;
#791 = EDGE_LOOP ( 'NONE', ( #812, #429, #399, #721 ) ) ;
#792 = CARTESIAN_POINT ( 'NONE',  ( -1.750000000000000000, 0.0000000000000000000, 1.000000000000000666 ) ) ;
#793 = ORIENTED_EDGE ( 'NONE', *, *, #261, .T. ) ;
#794 = PRODUCT ( 'User Library-SOD-87', 'User Library-SOD-87', '', ( #453 ) ) ;
#795 = ORIENTED_EDGE ( 'NONE', *, *, #611, .T. ) ;
#796 = CIRCLE ( 'NONE', #114, 0.7999999999999999334 ) ;
#797 = FILL_AREA_STYLE ('',( #298 ) ) ;
#798 = CIRCLE ( 'NONE', #189, 0.7999999999999999334 ) ;
#799 = VERTEX_POINT ( 'NONE', #463 ) ;
#800 = CARTESIAN_POINT ( 'NONE',  ( -0.2499999999999997780, -0.3249476370594088781, 0.9595995994975320409 ) ) ;
#801 = EDGE_CURVE ( 'NONE', #96, #264, #471, .T. ) ;
#802 = EDGE_LOOP ( 'NONE', ( #480, #777 ) ) ;
#803 = B_SPLINE_CURVE_WITH_KNOTS ( 'NONE', 3,
 ( #278, #208, #752, #418, #538, #760, #608, #691, #347, #678 ),
 .UNSPECIFIED., .F., .F.,
 ( 4, 2, 2, 2, 4 ),
 ( 0.6552233920984043003, 0.7414175440738032252, 0.8276116960492021501, 0.9138058480246010751, 1.000000000000000000 ),
 .UNSPECIFIED. ) ;
#804 = FILL_AREA_STYLE_COLOUR ( '', #185 ) ;
#805 = CARTESIAN_POINT ( 'NONE',  ( -0.2499999999999997780, 0.2728408083050074540, 0.9716877397810691486 ) ) ;
#806 = CARTESIAN_POINT ( 'NONE',  ( 1.750000000000000000, 0.0000000000000000000, 0.0000000000000000000 ) ) ;
#807 = CIRCLE ( 'NONE', #341, 1.000000000000000444 ) ;
#808 = AXIS2_PLACEMENT_3D ( 'NONE', #582, #844, #770 ) ;
#809 = CARTESIAN_POINT ( 'NONE',  ( -1.500000000000000666, 0.0000000000000000000, 0.0000000000000000000 ) ) ;
#810 =( GEOMETRIC_REPRESENTATION_CONTEXT ( 3 ) GLOBAL_UNCERTAINTY_ASSIGNED_CONTEXT ( ( #464 ) ) GLOBAL_UNIT_ASSIGNED_CONTEXT ( ( #775, #394, #851 ) ) REPRESENTATION_CONTEXT ( 'NONE', 'WORKASPACE' ) );
#811 = FILL_AREA_STYLE ('',( #607 ) ) ;
#812 = ORIENTED_EDGE ( 'NONE', *, *, #43, .T. ) ;
#813 =( NAMED_UNIT ( * ) SI_UNIT ( $, .STERADIAN. ) SOLID_ANGLE_UNIT ( ) );
#814 = EDGE_LOOP ( 'NONE', ( #55, #455, #389, #122, #342, #511 ) ) ;
#815 = CYLINDRICAL_SURFACE ( 'NONE', #247, 1.000000000000000222 ) ;
#816 = PRODUCT_RELATED_PRODUCT_CATEGORY ( 'part', '', ( #794 ) ) ;
#817 = CYLINDRICAL_SURFACE ( 'NONE', #754, 1.000000000000000444 ) ;
#818 = SURFACE_STYLE_USAGE ( .BOTH. , #212 ) ;
#819 = CIRCLE ( 'NONE', #808, 0.9500000000000003997 ) ;
#820 = EDGE_CURVE ( 'NONE', #71, #283, #104, .T. ) ;
#821 = CIRCLE ( 'NONE', #392, 0.9500000000000003997 ) ;
#822 = AXIS2_PLACEMENT_3D ( 'NONE', #363, #284, #554 ) ;
#823 = FACE_BOUND ( 'NONE', #465, .T. ) ;
#824 = DIRECTION ( 'NONE',  ( 0.0000000000000000000, 0.0000000000000000000, 1.000000000000000000 ) ) ;
#825 = FACE_OUTER_BOUND ( 'NONE', #715, .T. ) ;
#826 = CARTESIAN_POINT ( 'NONE',  ( 1.500000000000000666, 0.0000000000000000000, 0.0000000000000000000 ) ) ;
#827 = ORIENTED_EDGE ( 'NONE', *, *, #672, .T. ) ;
#828 = DIRECTION ( 'NONE',  ( 0.0000000000000000000, 0.0000000000000000000, 1.000000000000000000 ) ) ;
#829 =( NAMED_UNIT ( * ) SI_UNIT ( $, .STERADIAN. ) SOLID_ANGLE_UNIT ( ) );
#830 = DIRECTION ( 'NONE',  ( 0.0000000000000000000, 0.0000000000000000000, 1.000000000000000000 ) ) ;
#831 = CARTESIAN_POINT ( 'NONE',  ( -1.750000000000000000, 1.224646799147354193E-16, -1.000000000000000666 ) ) ;
#832 = ORIENTED_EDGE ( 'NONE', *, *, #661, .F. ) ;
#833 = STYLED_ITEM ( 'NONE', ( #225 ), #847 ) ;
#834 = AXIS2_PLACEMENT_3D ( 'NONE', #425, #293, #310 ) ;
#835 = DIRECTION ( 'NONE',  ( -1.000000000000000000, -0.0000000000000000000, -0.0000000000000000000 ) ) ;
#836 = DIRECTION ( 'NONE',  ( -1.000000000000000000, -0.0000000000000000000, -0.0000000000000000000 ) ) ;
#837 = AXIS2_PLACEMENT_3D ( 'NONE', #233, #238, #383 ) ;
#838 = VERTEX_POINT ( 'NONE', #219 ) ;
#839 = EDGE_CURVE ( 'NONE', #264, #71, #807, .T. ) ;
#840 = DIRECTION ( 'NONE',  ( -1.000000000000000000, -0.0000000000000000000, -0.0000000000000000000 ) ) ;
#841 = FACE_OUTER_BOUND ( 'NONE', #866, .T. ) ;
#842 = ORIENTED_EDGE ( 'NONE', *, *, #131, .T. ) ;
#843 = ADVANCED_FACE ( 'NONE', ( #416 ), #817, .T. ) ;
#844 = DIRECTION ( 'NONE',  ( -1.000000000000000000, -0.0000000000000000000, -0.0000000000000000000 ) ) ;
#845 = CARTESIAN_POINT ( 'NONE',  ( -1.450000000000000400, 0.0000000000000000000, 0.7999999999999999334 ) ) ;
#846 = ORIENTED_EDGE ( 'NONE', *, *, #625, .T. ) ;
#847 = ADVANCED_FACE ( 'NONE', ( #361 ), #170, .T. ) ;
#848 = SURFACE_STYLE_FILL_AREA ( #653 ) ;
#849 = PLANE ( 'NONE',  #101 ) ;
#850 = CIRCLE ( 'NONE', #470, 1.000000000000000666 ) ;
#851 =( NAMED_UNIT ( * ) SI_UNIT ( $, .STERADIAN. ) SOLID_ANGLE_UNIT ( ) );
#852 = COLOUR_RGB ( '',0.2509803921568627416, 0.2509803921568627416, 0.2509803921568627416 ) ;
#853 = VECTOR ( 'NONE', #180, 1000.000000000000000 ) ;
#854 = MANIFOLD_SOLID_BREP ( 'Wrap2', #75 ) ;
#855 = CARTESIAN_POINT ( 'NONE',  ( -1.500000000000000666, 1.163414459189986175E-16, -0.9500000000000003997 ) ) ;
#856 = ORIENTED_EDGE ( 'NONE', *, *, #106, .F. ) ;
#857 = EDGE_LOOP ( 'NONE', ( #842, #450, #856, #78 ) ) ;
#858 = CYLINDRICAL_SURFACE ( 'NONE', #431, 1.000000000000000666 ) ;
#859 = VERTEX_POINT ( 'NONE', #557 ) ;
#860 = VECTOR ( 'NONE', #681, 1000.000000000000000 ) ;
#861 = CARTESIAN_POINT ( 'NONE',  ( -1.249999999999999778, -0.8278687073570961674, 0.5609219227119681683 ) ) ;
#862 = EDGE_CURVE ( 'NONE', #666, #799, #551, .T. ) ;
#863 = VECTOR ( 'NONE', #411, 1000.000000000000000 ) ;
#864 = DIRECTION ( 'NONE',  ( -1.000000000000000000, 0.0000000000000000000, -0.0000000000000000000 ) ) ;
#865 = UNCERTAINTY_MEASURE_WITH_UNIT (LENGTH_MEASURE( 1.000000000000000082E-05 ), #467, 'distance_accuracy_value', 'NONE');
#866 = EDGE_LOOP ( 'NONE', ( #638, #191, #832, #42, #627 ) ) ;
#867 = DIRECTION ( 'NONE',  ( 0.0000000000000000000, -1.000000000000000000, 0.0000000000000000000 ) ) ;
#868 =( NAMED_UNIT ( * ) SI_UNIT ( $, .STERADIAN. ) SOLID_ANGLE_UNIT ( ) );
#869 = EDGE_LOOP ( 'NONE', ( #613, #403, #519, #381 ) ) ;
#870 = FILL_AREA_STYLE ('',( #804 ) ) ;
ENDSEC;
END-ISO-10303-21;
