(module MX.A20_COMPOSANT_1 (layer F.Cu) (tedit 5E9B8EA6)
  (attr smd)
  (fp_text reference IC40 (at 1.00893 -7.2166 unlocked) (layer F.SilkS)
    (effects (font (size 1.0496 1.104) (thickness 0.1)))
  )
  (fp_text value L-BC-SO20 (at -3.00743 -0.0332 unlocked) (layer F.SilkS) hide
    (effects (font (size 1.0496 1.104) (thickness 0.1)))
  )
  (fp_arc (start -5.41654 0) (end -5.41654 0.635) (angle -180) (layer F.Fab) (width 0.1))
  (fp_line (start -2.78104 -3.5) (end -2.29896 -3.5) (layer F.SilkS) (width 0.18))
  (fp_line (start 4.83896 -3.5) (end 6.35 -3.5) (layer F.SilkS) (width 0.18))
  (fp_line (start 6.35 3.5) (end 6.35 -3.5) (layer F.SilkS) (width 0.18))
  (fp_line (start 3.56896 -3.5) (end 4.05104 -3.5) (layer F.SilkS) (width 0.18))
  (fp_line (start -5.44804 -3.5) (end -4.96596 -3.5) (layer F.SilkS) (width 0.18))
  (fp_line (start 2.29896 -3.5) (end 2.78104 -3.5) (layer F.SilkS) (width 0.18))
  (fp_line (start -4.17804 -3.5) (end -3.56896 -3.5) (layer F.SilkS) (width 0.18))
  (fp_line (start 1.02896 -3.5) (end 1.51104 -3.5) (layer F.SilkS) (width 0.18))
  (fp_line (start -1.51104 -3.5) (end 0.24104 -3.5) (layer F.SilkS) (width 0.18))
  (fp_line (start -6.35 3.5) (end -6.35 -2.58092) (layer F.SilkS) (width 0.18))
  (fp_line (start -6.35 -3.38808) (end -6.35 -3.5) (layer F.SilkS) (width 0.18))
  (fp_line (start -6.35 3.5) (end 6.35 3.5) (layer F.SilkS) (width 0.18))
  (fp_line (start -6.35 -3.5) (end -6.23596 -3.5) (layer F.SilkS) (width 0.18))
  (fp_line (start 5.715 4.92125) (end 5.715 3.96875) (layer F.Fab) (width 0.1))
  (fp_line (start -6.35 3.96875) (end 6.35 3.96875) (layer F.Fab) (width 0.1))
  (fp_line (start 5.715 -3.96875) (end 5.715 -4.92125) (layer F.Fab) (width 0.1))
  (fp_line (start 6.35 3.96875) (end 6.35 -3.96875) (layer F.Fab) (width 0.1))
  (fp_line (start 4.445 -3.96875) (end 4.445 -4.92125) (layer F.Fab) (width 0.1))
  (fp_line (start -5.715 4.92125) (end -5.715 3.96875) (layer F.Fab) (width 0.1))
  (fp_line (start -6.35 -3.96875) (end 6.35 -3.96875) (layer F.Fab) (width 0.1))
  (fp_line (start 3.175 -3.96875) (end 3.175 -4.92125) (layer F.Fab) (width 0.1))
  (fp_line (start -4.445 -3.96875) (end -4.445 -4.92125) (layer F.Fab) (width 0.1))
  (fp_line (start -4.445 4.92125) (end -4.445 3.96875) (layer F.Fab) (width 0.1))
  (fp_line (start 1.905 -3.96875) (end 1.905 -4.92125) (layer F.Fab) (width 0.1))
  (fp_line (start 3.175 4.92125) (end 3.175 3.96875) (layer F.Fab) (width 0.1))
  (fp_line (start -3.175 4.92125) (end -3.175 3.96875) (layer F.Fab) (width 0.1))
  (fp_line (start 0.635 -3.96875) (end 0.635 -4.92125) (layer F.Fab) (width 0.1))
  (fp_line (start -6.35 0.635) (end -5.41655 0.635) (layer F.Fab) (width 0.1))
  (fp_line (start -1.905 4.92125) (end -1.905 3.96875) (layer F.Fab) (width 0.1))
  (fp_line (start 4.445 4.92125) (end 4.445 3.96875) (layer F.Fab) (width 0.1))
  (fp_line (start -0.635 -3.96875) (end -0.635 -4.92125) (layer F.Fab) (width 0.1))
  (fp_line (start -6.35 -0.635) (end -5.41655 -0.635) (layer F.Fab) (width 0.1))
  (fp_line (start -0.635 4.92125) (end -0.635 3.96875) (layer F.Fab) (width 0.1))
  (fp_line (start -5.715 -3.96875) (end -5.715 -4.92125) (layer F.Fab) (width 0.1))
  (fp_line (start -1.905 -3.96875) (end -1.905 -4.92125) (layer F.Fab) (width 0.1))
  (fp_line (start 0.635 4.92125) (end 0.635 3.96875) (layer F.Fab) (width 0.1))
  (fp_line (start -6.35 3.96875) (end -6.35 -3.96875) (layer F.Fab) (width 0.1))
  (fp_line (start -3.175 -3.96875) (end -3.175 -4.92125) (layer F.Fab) (width 0.1))
  (fp_line (start 1.905 4.92125) (end 1.905 3.96875) (layer F.Fab) (width 0.1))
  (pad 20 smd rect (at -5.84 -4.845) (size 0.86 2) (layers F.Cu F.Paste F.Mask))
  (pad 19 smd rect (at -4.445 -4.845) (size 0.61 2) (layers F.Cu F.Paste F.Mask))
  (pad 18 smd rect (at -3.175 -4.845) (size 0.61 2) (layers F.Cu F.Paste F.Mask))
  (pad 17 smd rect (at -1.905 -4.845) (size 0.61 2) (layers F.Cu F.Paste F.Mask))
  (pad 16 smd rect (at -0.635 -4.845) (size 0.61 2) (layers F.Cu F.Paste F.Mask))
  (pad 15 smd rect (at 0.635 -4.845) (size 0.61 2) (layers F.Cu F.Paste F.Mask))
  (pad 14 smd rect (at 1.905 -4.845) (size 0.61 2) (layers F.Cu F.Paste F.Mask))
  (pad 13 smd rect (at 3.175 -4.845) (size 0.61 2) (layers F.Cu F.Paste F.Mask))
  (pad 12 smd rect (at 4.445 -4.845) (size 0.61 2) (layers F.Cu F.Paste F.Mask))
  (pad 11 smd rect (at 5.84 -4.845) (size 0.86 2) (layers F.Cu F.Paste F.Mask))
  (pad 10 smd rect (at 5.84 4.845) (size 0.86 2) (layers F.Cu F.Paste F.Mask))
  (pad 9 smd rect (at 4.445 4.845) (size 0.61 2) (layers F.Cu F.Paste F.Mask))
  (pad 8 smd rect (at 3.175 4.845) (size 0.61 2) (layers F.Cu F.Paste F.Mask))
  (pad 7 smd rect (at 1.905 4.845) (size 0.61 2) (layers F.Cu F.Paste F.Mask))
  (pad 6 smd rect (at 0.635 4.845) (size 0.61 2) (layers F.Cu F.Paste F.Mask))
  (pad 5 smd rect (at -0.635 4.845) (size 0.61 2) (layers F.Cu F.Paste F.Mask))
  (pad 4 smd rect (at -1.905 4.845) (size 0.61 2) (layers F.Cu F.Paste F.Mask))
  (pad 3 smd rect (at -3.175 4.845) (size 0.61 2) (layers F.Cu F.Paste F.Mask))
  (pad 2 smd rect (at -4.445 4.845) (size 0.61 2) (layers F.Cu F.Paste F.Mask))
  (pad 1 smd rect (at -5.84 4.845) (size 0.86 2) (layers F.Cu F.Paste F.Mask))
  (model ${KISYS3DMOD}/Package_SO.3dshapes/SOIC-20W_7.5x12.8mm_P1.27mm.wrl
    (at (xyz 0 0 0))
    (scale (xyz 1 1 1))
    (rotate (xyz 0 0 -90))
  )
)
