(module MOL52610-22_1 (layer F.Cu) (tedit 5E9B3B76)
  (attr smd)
  (fp_text reference J1 (at -0.57723 6.2514 -180 unlocked) (layer F.SilkS)
    (effects (font (size 1.0496 1.104) (thickness 0.1)))
  )
  (fp_text value F-COCMS-MOL52610-2290 (at 7.21173 1.7858 -180 unlocked) (layer F.SilkS) hide
    (effects (font (size 1.0496 1.104) (thickness 0.1)))
  )
  (fp_line (start -14.3 3.1) (end -13.8 3.6) (layer F.SilkS) (width 0.18))
  (fp_line (start -14.3 3.1) (end -14.3 3.09861) (layer F.SilkS) (width 0.18))
  (fp_line (start -13.8 3.6) (end -13.21043 3.6) (layer F.SilkS) (width 0.18))
  (fp_line (start 11.0964 0) (end 14.3 0) (layer F.SilkS) (width 0.18))
  (fp_line (start 14.3 3.1) (end 14.3 0) (layer F.SilkS) (width 0.18))
  (fp_line (start -12.18957 3.6) (end -11.0964 3.6) (layer F.SilkS) (width 0.18))
  (fp_line (start -14.3 1.98139) (end -14.3 0) (layer F.SilkS) (width 0.18))
  (fp_line (start -13.5 0) (end -12.9 0.6) (layer F.SilkS) (width 0.18))
  (fp_line (start -12.9 0.6) (end -12.3 0) (layer F.SilkS) (width 0.18))
  (fp_line (start 13.8 3.6) (end 14.3 3.1) (layer F.SilkS) (width 0.18))
  (fp_line (start -14.3 0) (end -11.0964 0) (layer F.SilkS) (width 0.18))
  (fp_line (start 11.0964 3.6) (end 13.8 3.6) (layer F.SilkS) (width 0.18))
  (fp_line (start 0.5 4) (end 0.5 -0.1) (layer Dwgs.User) (width 0.5))
  (fp_line (start -2.5 4) (end -2.5 -0.1) (layer Dwgs.User) (width 0.5))
  (fp_line (start 10.5 4) (end 10.5 -0.1) (layer Dwgs.User) (width 0.5))
  (fp_line (start 9.5 4) (end 9.5 -0.1) (layer Dwgs.User) (width 0.5))
  (fp_line (start 8.5 4) (end 8.5 -0.1) (layer Dwgs.User) (width 0.5))
  (fp_line (start -10.5 4) (end -10.5 -0.1) (layer Dwgs.User) (width 0.5))
  (fp_line (start 7.5 4) (end 7.5 -0.1) (layer Dwgs.User) (width 0.5))
  (fp_line (start -9.5 4) (end -9.5 -0.1) (layer Dwgs.User) (width 0.5))
  (fp_line (start 6.5 4) (end 6.5 -0.1) (layer Dwgs.User) (width 0.5))
  (fp_line (start -8.5 4) (end -8.5 -0.1) (layer Dwgs.User) (width 0.5))
  (fp_line (start -0.5 4) (end -0.5 -0.1) (layer Dwgs.User) (width 0.5))
  (fp_line (start 5.5 4) (end 5.5 -0.1) (layer Dwgs.User) (width 0.5))
  (fp_line (start -7.5 4) (end -7.5 -0.1) (layer Dwgs.User) (width 0.5))
  (fp_line (start 4.5 4) (end 4.5 -0.1) (layer Dwgs.User) (width 0.5))
  (fp_line (start -6.5 4) (end -6.5 -0.1) (layer Dwgs.User) (width 0.5))
  (fp_line (start 3.5 4) (end 3.5 -0.1) (layer Dwgs.User) (width 0.5))
  (fp_line (start -5.5 4) (end -5.5 -0.1) (layer Dwgs.User) (width 0.5))
  (fp_line (start 2.5 4) (end 2.5 -0.1) (layer Dwgs.User) (width 0.5))
  (fp_line (start -4.5 4) (end -4.5 -0.1) (layer Dwgs.User) (width 0.5))
  (fp_line (start -1.5 4) (end -1.5 -0.1) (layer Dwgs.User) (width 0.5))
  (fp_line (start 1.5 4) (end 1.5 -0.1) (layer Dwgs.User) (width 0.5))
  (fp_line (start -3.5 4) (end -3.5 -0.1) (layer Dwgs.User) (width 0.5))
  (fp_line (start 1.3 1.8) (end 1.7 1.8) (layer F.Fab) (width 0.00003))
  (fp_line (start 1.5 4.1) (end 1.5 3.6) (layer F.Fab) (width 0.1))
  (fp_line (start 2.3 0.8) (end 2.7 0.8) (layer F.Fab) (width 0.00003))
  (fp_line (start 3.3 1.8) (end 3.7 1.8) (layer F.Fab) (width 0.00003))
  (fp_line (start 2.7 1.8) (end 2.7 0.8) (layer F.Fab) (width 0.00003))
  (fp_line (start -2.5 0) (end -2.5 -0.5) (layer F.Fab) (width 0.1))
  (fp_line (start -14.3 3.1) (end -13.8 3.6) (layer F.Fab) (width 0.1))
  (fp_line (start -0.7 1.8) (end -0.7 0.8) (layer F.Fab) (width 0.00003))
  (fp_line (start 0.3 0.8) (end 0.7 0.8) (layer F.Fab) (width 0.00003))
  (fp_line (start -14.3 3.1) (end -14.3 0) (layer F.Fab) (width 0.1))
  (fp_line (start 14.3 3.1) (end 14.3 0) (layer F.Fab) (width 0.1))
  (fp_line (start -10.5 4.1) (end -10.5 3.6) (layer F.Fab) (width 0.1))
  (fp_line (start 2.3 1.8) (end 2.3 0.8) (layer F.Fab) (width 0.00003))
  (fp_line (start -13.5 0) (end -12.9 0.6) (layer F.Fab) (width 0.1))
  (fp_line (start -9.5 4.1) (end -9.5 3.6) (layer F.Fab) (width 0.1))
  (fp_line (start 0.5 0) (end 0.5 -0.5) (layer F.Fab) (width 0.1))
  (fp_line (start -0.3 1.8) (end -0.3 0.8) (layer F.Fab) (width 0.00003))
  (fp_line (start -10.7 1.8) (end -10.3 1.8) (layer F.Fab) (width 0.00003))
  (fp_line (start -12.9 0.6) (end -12.3 0) (layer F.Fab) (width 0.1))
  (fp_line (start 0.3 1.8) (end 0.7 1.8) (layer F.Fab) (width 0.00003))
  (fp_line (start -8.5 4.1) (end -8.5 3.6) (layer F.Fab) (width 0.1))
  (fp_line (start -14.3 0) (end 14.3 0) (layer F.Fab) (width 0.1))
  (fp_line (start -10.7 1.8) (end -10.7 0.8) (layer F.Fab) (width 0.00003))
  (fp_line (start -0.7 0.8) (end -0.3 0.8) (layer F.Fab) (width 0.00003))
  (fp_line (start 11.5 1.8) (end 11.5 0) (layer F.Fab) (width 0.1))
  (fp_line (start -11.5 1.8) (end -11.5 0) (layer F.Fab) (width 0.1))
  (fp_line (start 13.8 3.6) (end 14.3 3.1) (layer F.Fab) (width 0.1))
  (fp_line (start 10.5 0) (end 10.5 -0.5) (layer F.Fab) (width 0.1))
  (fp_line (start -10.3 1.8) (end -10.3 0.8) (layer F.Fab) (width 0.00003))
  (fp_line (start -9.7 1.8) (end -9.3 1.8) (layer F.Fab) (width 0.00003))
  (fp_line (start -10.7 0.8) (end -10.3 0.8) (layer F.Fab) (width 0.00003))
  (fp_line (start -7.5 4.1) (end -7.5 3.6) (layer F.Fab) (width 0.1))
  (fp_line (start -9.7 1.8) (end -9.7 0.8) (layer F.Fab) (width 0.00003))
  (fp_line (start 4.5 4.1) (end 4.5 3.6) (layer F.Fab) (width 0.1))
  (fp_line (start 9.5 0) (end 9.5 -0.5) (layer F.Fab) (width 0.1))
  (fp_line (start -9.3 1.8) (end -9.3 0.8) (layer F.Fab) (width 0.00003))
  (fp_line (start -8.7 1.8) (end -8.3 1.8) (layer F.Fab) (width 0.00003))
  (fp_line (start -9.7 0.8) (end -9.3 0.8) (layer F.Fab) (width 0.00003))
  (fp_line (start -6.5 4.1) (end -6.5 3.6) (layer F.Fab) (width 0.1))
  (fp_line (start 10.3 0.8) (end 10.7 0.8) (layer F.Fab) (width 0.00003))
  (fp_line (start 10.7 1.8) (end 10.7 0.8) (layer F.Fab) (width 0.00003))
  (fp_line (start -10.5 0) (end -10.5 -0.5) (layer F.Fab) (width 0.1))
  (fp_line (start -8.7 1.8) (end -8.7 0.8) (layer F.Fab) (width 0.00003))
  (fp_line (start 2.5 4.1) (end 2.5 3.6) (layer F.Fab) (width 0.1))
  (fp_line (start 10.3 1.8) (end 10.3 0.8) (layer F.Fab) (width 0.00003))
  (fp_line (start 8.5 0) (end 8.5 -0.5) (layer F.Fab) (width 0.1))
  (fp_line (start -8.3 1.8) (end -8.3 0.8) (layer F.Fab) (width 0.00003))
  (fp_line (start -7.7 1.8) (end -7.3 1.8) (layer F.Fab) (width 0.00003))
  (fp_line (start -8.7 0.8) (end -8.3 0.8) (layer F.Fab) (width 0.00003))
  (fp_line (start -5.5 4.1) (end -5.5 3.6) (layer F.Fab) (width 0.1))
  (fp_line (start 9.3 0.8) (end 9.7 0.8) (layer F.Fab) (width 0.00003))
  (fp_line (start 10.3 1.8) (end 10.7 1.8) (layer F.Fab) (width 0.00003))
  (fp_line (start 9.7 1.8) (end 9.7 0.8) (layer F.Fab) (width 0.00003))
  (fp_line (start -9.5 0) (end -9.5 -0.5) (layer F.Fab) (width 0.1))
  (fp_line (start -7.7 1.8) (end -7.7 0.8) (layer F.Fab) (width 0.00003))
  (fp_line (start 1.3 0.8) (end 1.7 0.8) (layer F.Fab) (width 0.00003))
  (fp_line (start 9.3 1.8) (end 9.3 0.8) (layer F.Fab) (width 0.00003))
  (fp_line (start 7.5 0) (end 7.5 -0.5) (layer F.Fab) (width 0.1))
  (fp_line (start -7.3 1.8) (end -7.3 0.8) (layer F.Fab) (width 0.00003))
  (fp_line (start -6.7 1.8) (end -6.3 1.8) (layer F.Fab) (width 0.00003))
  (fp_line (start -7.7 0.8) (end -7.3 0.8) (layer F.Fab) (width 0.00003))
  (fp_line (start 2.3 1.8) (end 2.7 1.8) (layer F.Fab) (width 0.00003))
  (fp_line (start -4.5 4.1) (end -4.5 3.6) (layer F.Fab) (width 0.1))
  (fp_line (start 8.3 0.8) (end 8.7 0.8) (layer F.Fab) (width 0.00003))
  (fp_line (start 9.3 1.8) (end 9.7 1.8) (layer F.Fab) (width 0.00003))
  (fp_line (start 8.7 1.8) (end 8.7 0.8) (layer F.Fab) (width 0.00003))
  (fp_line (start -8.5 0) (end -8.5 -0.5) (layer F.Fab) (width 0.1))
  (fp_line (start -11.5 1.8) (end 11.5 1.8) (layer F.Fab) (width 0.1))
  (fp_line (start -13.8 3.6) (end 13.8 3.6) (layer F.Fab) (width 0.1))
  (fp_line (start -6.7 1.8) (end -6.7 0.8) (layer F.Fab) (width 0.00003))
  (fp_line (start 1.7 1.8) (end 1.7 0.8) (layer F.Fab) (width 0.00003))
  (fp_line (start 8.3 1.8) (end 8.3 0.8) (layer F.Fab) (width 0.00003))
  (fp_line (start 6.5 0) (end 6.5 -0.5) (layer F.Fab) (width 0.1))
  (fp_line (start -6.3 1.8) (end -6.3 0.8) (layer F.Fab) (width 0.00003))
  (fp_line (start -5.7 1.8) (end -5.3 1.8) (layer F.Fab) (width 0.00003))
  (fp_line (start -1.5 0) (end -1.5 -0.5) (layer F.Fab) (width 0.1))
  (fp_line (start -6.7 0.8) (end -6.3 0.8) (layer F.Fab) (width 0.00003))
  (fp_line (start 10.5 4.1) (end 10.5 3.6) (layer F.Fab) (width 0.1))
  (fp_line (start -3.5 4.1) (end -3.5 3.6) (layer F.Fab) (width 0.1))
  (fp_line (start 7.3 0.8) (end 7.7 0.8) (layer F.Fab) (width 0.00003))
  (fp_line (start 8.3 1.8) (end 8.7 1.8) (layer F.Fab) (width 0.00003))
  (fp_line (start 7.7 1.8) (end 7.7 0.8) (layer F.Fab) (width 0.00003))
  (fp_line (start -7.5 0) (end -7.5 -0.5) (layer F.Fab) (width 0.1))
  (fp_line (start -5.7 1.8) (end -5.7 0.8) (layer F.Fab) (width 0.00003))
  (fp_line (start 0.3 1.8) (end 0.3 0.8) (layer F.Fab) (width 0.00003))
  (fp_line (start 7.3 1.8) (end 7.3 0.8) (layer F.Fab) (width 0.00003))
  (fp_line (start 5.5 0) (end 5.5 -0.5) (layer F.Fab) (width 0.1))
  (fp_line (start -5.3 1.8) (end -5.3 0.8) (layer F.Fab) (width 0.00003))
  (fp_line (start -4.7 1.8) (end -4.3 1.8) (layer F.Fab) (width 0.00003))
  (fp_line (start -5.7 0.8) (end -5.3 0.8) (layer F.Fab) (width 0.00003))
  (fp_line (start 9.5 4.1) (end 9.5 3.6) (layer F.Fab) (width 0.1))
  (fp_line (start -2.5 4.1) (end -2.5 3.6) (layer F.Fab) (width 0.1))
  (fp_line (start 6.3 0.8) (end 6.7 0.8) (layer F.Fab) (width 0.00003))
  (fp_line (start 7.3 1.8) (end 7.7 1.8) (layer F.Fab) (width 0.00003))
  (fp_line (start 6.7 1.8) (end 6.7 0.8) (layer F.Fab) (width 0.00003))
  (fp_line (start -6.5 0) (end -6.5 -0.5) (layer F.Fab) (width 0.1))
  (fp_line (start -4.7 1.8) (end -4.7 0.8) (layer F.Fab) (width 0.00003))
  (fp_line (start 3.5 4.1) (end 3.5 3.6) (layer F.Fab) (width 0.1))
  (fp_line (start 6.3 1.8) (end 6.3 0.8) (layer F.Fab) (width 0.00003))
  (fp_line (start 4.5 0) (end 4.5 -0.5) (layer F.Fab) (width 0.1))
  (fp_line (start -4.3 1.8) (end -4.3 0.8) (layer F.Fab) (width 0.00003))
  (fp_line (start -3.7 1.8) (end -3.3 1.8) (layer F.Fab) (width 0.00003))
  (fp_line (start -4.7 0.8) (end -4.3 0.8) (layer F.Fab) (width 0.00003))
  (fp_line (start 8.5 4.1) (end 8.5 3.6) (layer F.Fab) (width 0.1))
  (fp_line (start -1.5 4.1) (end -1.5 3.6) (layer F.Fab) (width 0.1))
  (fp_line (start 5.3 0.8) (end 5.7 0.8) (layer F.Fab) (width 0.00003))
  (fp_line (start 6.3 1.8) (end 6.7 1.8) (layer F.Fab) (width 0.00003))
  (fp_line (start 5.7 1.8) (end 5.7 0.8) (layer F.Fab) (width 0.00003))
  (fp_line (start -5.5 0) (end -5.5 -0.5) (layer F.Fab) (width 0.1))
  (fp_line (start -3.7 1.8) (end -3.7 0.8) (layer F.Fab) (width 0.00003))
  (fp_line (start 5.3 1.8) (end 5.3 0.8) (layer F.Fab) (width 0.00003))
  (fp_line (start 3.5 0) (end 3.5 -0.5) (layer F.Fab) (width 0.1))
  (fp_line (start -3.3 1.8) (end -3.3 0.8) (layer F.Fab) (width 0.00003))
  (fp_line (start -2.7 1.8) (end -2.3 1.8) (layer F.Fab) (width 0.00003))
  (fp_line (start -3.7 0.8) (end -3.3 0.8) (layer F.Fab) (width 0.00003))
  (fp_line (start 7.5 4.1) (end 7.5 3.6) (layer F.Fab) (width 0.1))
  (fp_line (start -0.5 4.1) (end -0.5 3.6) (layer F.Fab) (width 0.1))
  (fp_line (start 4.3 0.8) (end 4.7 0.8) (layer F.Fab) (width 0.00003))
  (fp_line (start 5.3 1.8) (end 5.7 1.8) (layer F.Fab) (width 0.00003))
  (fp_line (start 4.7 1.8) (end 4.7 0.8) (layer F.Fab) (width 0.00003))
  (fp_line (start -4.5 0) (end -4.5 -0.5) (layer F.Fab) (width 0.1))
  (fp_line (start -2.7 1.8) (end -2.7 0.8) (layer F.Fab) (width 0.00003))
  (fp_line (start 1.3 1.8) (end 1.3 0.8) (layer F.Fab) (width 0.00003))
  (fp_line (start 4.3 1.8) (end 4.3 0.8) (layer F.Fab) (width 0.00003))
  (fp_line (start 2.5 0) (end 2.5 -0.5) (layer F.Fab) (width 0.1))
  (fp_line (start -2.3 1.8) (end -2.3 0.8) (layer F.Fab) (width 0.00003))
  (fp_line (start -1.7 1.8) (end -1.3 1.8) (layer F.Fab) (width 0.00003))
  (fp_line (start -2.7 0.8) (end -2.3 0.8) (layer F.Fab) (width 0.00003))
  (fp_line (start 6.5 4.1) (end 6.5 3.6) (layer F.Fab) (width 0.1))
  (fp_line (start 0.5 4.1) (end 0.5 3.6) (layer F.Fab) (width 0.1))
  (fp_line (start 3.3 0.8) (end 3.7 0.8) (layer F.Fab) (width 0.00003))
  (fp_line (start -0.5 0) (end -0.5 -0.5) (layer F.Fab) (width 0.1))
  (fp_line (start 4.3 1.8) (end 4.7 1.8) (layer F.Fab) (width 0.00003))
  (fp_line (start 3.7 1.8) (end 3.7 0.8) (layer F.Fab) (width 0.00003))
  (fp_line (start -3.5 0) (end -3.5 -0.5) (layer F.Fab) (width 0.1))
  (fp_line (start -1.7 1.8) (end -1.7 0.8) (layer F.Fab) (width 0.00003))
  (fp_line (start 0.7 1.8) (end 0.7 0.8) (layer F.Fab) (width 0.00003))
  (fp_line (start 3.3 1.8) (end 3.3 0.8) (layer F.Fab) (width 0.00003))
  (fp_line (start 1.5 0) (end 1.5 -0.5) (layer F.Fab) (width 0.1))
  (fp_line (start -1.3 1.8) (end -1.3 0.8) (layer F.Fab) (width 0.00003))
  (fp_line (start -0.7 1.8) (end -0.3 1.8) (layer F.Fab) (width 0.00003))
  (fp_line (start -1.7 0.8) (end -1.3 0.8) (layer F.Fab) (width 0.00003))
  (fp_line (start 5.5 4.1) (end 5.5 3.6) (layer F.Fab) (width 0.1))
  (pad 44 smd rect (at 10.5 3.75) (size 0.6096 1.778) (layers F.Cu F.Paste F.Mask))
  (pad 43 smd rect (at 9.5 3.75) (size 0.6096 1.778) (layers F.Cu F.Paste F.Mask))
  (pad 42 smd rect (at 8.5 3.75) (size 0.6096 1.778) (layers F.Cu F.Paste F.Mask))
  (pad 41 smd rect (at 7.5 3.75) (size 0.6096 1.778) (layers F.Cu F.Paste F.Mask))
  (pad 40 smd rect (at 6.5 3.75) (size 0.6096 1.778) (layers F.Cu F.Paste F.Mask))
  (pad 39 smd rect (at 5.5 3.75) (size 0.6096 1.778) (layers F.Cu F.Paste F.Mask))
  (pad 38 smd rect (at 4.5 3.75) (size 0.6096 1.778) (layers F.Cu F.Paste F.Mask))
  (pad 37 smd rect (at 3.5 3.75) (size 0.6096 1.778) (layers F.Cu F.Paste F.Mask))
  (pad 36 smd rect (at 2.5 3.75) (size 0.6096 1.778) (layers F.Cu F.Paste F.Mask))
  (pad 35 smd rect (at 1.5 3.75) (size 0.6096 1.778) (layers F.Cu F.Paste F.Mask))
  (pad 34 smd rect (at 0.5 3.75) (size 0.6096 1.778) (layers F.Cu F.Paste F.Mask))
  (pad 33 smd rect (at -0.5 3.75) (size 0.6096 1.778) (layers F.Cu F.Paste F.Mask))
  (pad 32 smd rect (at -1.5 3.75) (size 0.6096 1.778) (layers F.Cu F.Paste F.Mask))
  (pad 31 smd rect (at -2.5 3.75) (size 0.6096 1.778) (layers F.Cu F.Paste F.Mask))
  (pad 30 smd rect (at -3.5 3.75) (size 0.6096 1.778) (layers F.Cu F.Paste F.Mask))
  (pad 29 smd rect (at -4.5 3.75) (size 0.6096 1.778) (layers F.Cu F.Paste F.Mask))
  (pad 28 smd rect (at -5.5 3.75) (size 0.6096 1.778) (layers F.Cu F.Paste F.Mask))
  (pad 27 smd rect (at -6.5 3.75) (size 0.6096 1.778) (layers F.Cu F.Paste F.Mask))
  (pad 26 smd rect (at -7.5 3.75) (size 0.6096 1.778) (layers F.Cu F.Paste F.Mask))
  (pad 25 smd rect (at -8.5 3.75) (size 0.6096 1.778) (layers F.Cu F.Paste F.Mask))
  (pad 24 smd rect (at -9.5 3.75) (size 0.6096 1.778) (layers F.Cu F.Paste F.Mask))
  (pad 23 smd rect (at -10.5 3.75) (size 0.6096 1.778) (layers F.Cu F.Paste F.Mask))
  (pad 22 smd rect (at 10.5 0) (size 0.6096 1.778) (layers F.Cu F.Paste F.Mask))
  (pad 21 smd rect (at 9.5 0) (size 0.6096 1.778) (layers F.Cu F.Paste F.Mask))
  (pad 20 smd rect (at 8.5 0) (size 0.6096 1.778) (layers F.Cu F.Paste F.Mask))
  (pad 19 smd rect (at 7.5 0) (size 0.6096 1.778) (layers F.Cu F.Paste F.Mask))
  (pad 18 smd rect (at 6.5 0) (size 0.6096 1.778) (layers F.Cu F.Paste F.Mask))
  (pad 17 smd rect (at 5.5 0) (size 0.6096 1.778) (layers F.Cu F.Paste F.Mask))
  (pad 16 smd rect (at 4.5 0) (size 0.6096 1.778) (layers F.Cu F.Paste F.Mask))
  (pad 15 smd rect (at 3.5 0) (size 0.6096 1.778) (layers F.Cu F.Paste F.Mask))
  (pad 14 smd rect (at 2.5 0) (size 0.6096 1.778) (layers F.Cu F.Paste F.Mask))
  (pad 13 smd rect (at 1.5 0) (size 0.6096 1.778) (layers F.Cu F.Paste F.Mask))
  (pad 12 smd rect (at 0.5 0) (size 0.6096 1.778) (layers F.Cu F.Paste F.Mask))
  (pad 11 smd rect (at -0.5 0) (size 0.6096 1.778) (layers F.Cu F.Paste F.Mask))
  (pad 10 smd rect (at -1.5 0) (size 0.6096 1.778) (layers F.Cu F.Paste F.Mask))
  (pad 9 smd rect (at -2.5 0) (size 0.6096 1.778) (layers F.Cu F.Paste F.Mask))
  (pad 8 smd rect (at -3.5 0) (size 0.6096 1.778) (layers F.Cu F.Paste F.Mask))
  (pad 7 smd rect (at -4.5 0) (size 0.6096 1.778) (layers F.Cu F.Paste F.Mask))
  (pad 6 smd rect (at -5.5 0) (size 0.6096 1.778) (layers F.Cu F.Paste F.Mask))
  (pad 5 smd rect (at -6.5 0) (size 0.6096 1.778) (layers F.Cu F.Paste F.Mask))
  (pad 4 smd rect (at -7.5 0) (size 0.6096 1.778) (layers F.Cu F.Paste F.Mask))
  (pad 3 smd rect (at -8.5 0) (size 0.6096 1.778) (layers F.Cu F.Paste F.Mask))
  (pad 2 smd rect (at -9.5 0) (size 0.6096 1.778) (layers F.Cu F.Paste F.Mask))
  (pad 1 smd rect (at -10.5 0) (size 0.6096 1.778) (layers F.Cu F.Paste F.Mask))
  (model ${KIPRJMOD}/Footprints.3dshapes/526102272.stp
    (offset (xyz 0 -1.75 0))
    (scale (xyz 1 1 1))
    (rotate (xyz -90 0 0))
  )
)
