(module MOL6410-2_1 (layer F.Cu) (tedit 5E9523CF)
  (attr smd)
  (fp_text reference J6 (at 0.697 -0.5095 -270 unlocked) (layer F.SilkS)
    (effects (font (size 1.0496 1.104) (thickness 0.18)))
  )
  (fp_text value F-CO-MOL6410M02 (at -0.8 -6 -270 unlocked) (layer F.SilkS) hide
    (effects (font (size 1.0496 1.104) (thickness 0.18)))
  )
  (fp_line (start -1.27 -1.905) (end 0 -3.175) (layer F.Fab) (width 0.1))
  (fp_line (start -1.27 3.175) (end 3.81 3.175) (layer F.Fab) (width 0.1))
  (fp_line (start 0 1.905) (end 2.54 1.905) (layer F.Fab) (width 0.1))
  (fp_line (start 3.81 3.175) (end 3.81 -3.175) (layer F.Fab) (width 0.1))
  (fp_line (start -1.27 -3.175) (end 3.81 -3.175) (layer F.Fab) (width 0.1))
  (fp_line (start 2.54 3.175) (end 2.54 1.905) (layer F.Fab) (width 0.1))
  (fp_line (start -1.27 3.175) (end -1.27 -3.175) (layer F.Fab) (width 0.1))
  (fp_line (start 0 3.175) (end 0 1.905) (layer F.Fab) (width 0.1))
  (fp_line (start -1.27 -1.905) (end 0 -3.175) (layer F.SilkS) (width 0.18))
  (fp_line (start 3.81 1.28444) (end 3.81 -1.87009) (layer F.SilkS) (width 0.18))
  (fp_line (start -1.27 3.175) (end 3.80936 3.175) (layer F.SilkS) (width 0.18))
  (fp_line (start -0.16923 -3.175) (end 3.645 -3.175) (layer F.SilkS) (width 0.18))
  (fp_line (start 0 1.905) (end 2.54 1.905) (layer F.SilkS) (width 0.18))
  (fp_line (start 2.54 3.175) (end 2.54 1.905) (layer F.SilkS) (width 0.18))
  (fp_line (start 0 3.175) (end 0 1.905) (layer F.SilkS) (width 0.18))
  (fp_line (start -1.27 3.175) (end -1.27 -3.13493) (layer F.SilkS) (width 0.18))
  (pad 1 thru_hole rect (at 0 0) (size 1.778 1.778) (drill 1.1176) (layers *.Cu *.Mask))
  (pad 2 thru_hole circle (at 2.54 0) (size 1.778 1.778) (drill 1.1176) (layers *.Cu *.Mask))
  (model ${KISYS3DMOD}/Connector_Molex.3dshapes/Molex_KK-254_AE-6410-02A_1x02_P2.54mm_Vertical.wrl
    (at (xyz 0 0 0))
    (scale (xyz 1 1 1))
    (rotate (xyz 0 0 0))
  )
)
