(module C1812_1 (layer F.Cu) (tedit 5E951C15)
  (attr smd)
  (fp_text reference PCT1 (at 0.4826 1.016 -90 unlocked) (layer F.SilkS)
    (effects (font (size 1.033069 1.086612) (thickness 0.1778)))
  )
  (fp_text value FU-BC-F1812 (at 0.7874 4.3307 -90 unlocked) (layer F.SilkS) hide
    (effects (font (size 1.033069 1.086612) (thickness 0.1778)))
  )
  (fp_line (start -2.54 -1.778) (end 2.54 -1.778) (layer F.Fab) (width 0.0762))
  (fp_line (start 2.54 1.778) (end 2.54 -1.778) (layer F.Fab) (width 0.0762))
  (fp_line (start -2.54 1.778) (end 2.54 1.778) (layer F.Fab) (width 0.0762))
  (fp_line (start -2.54 1.778) (end -2.54 -1.778) (layer F.Fab) (width 0.0762))
  (fp_line (start -3.302 -2.2098) (end 3.4798 -2.2098) (layer F.SilkS) (width 0.1778))
  (fp_line (start 3.4798 2.2098) (end 3.4798 -2.2098) (layer F.SilkS) (width 0.1778))
  (fp_line (start -3.302 2.2098) (end 3.4798 2.2098) (layer F.SilkS) (width 0.1778))
  (pad 1 smd rect (at -2.2098 0) (size 1.905 3.81) (layers F.Cu F.Paste F.Mask))
  (pad 2 smd rect (at 2.2098 0) (size 1.905 3.81) (layers F.Cu F.Paste F.Mask))
  (model ${KISYS3DMOD}/Capacitor_SMD.3dshapes/C_1812_4532Metric.wrl
    (at (xyz 0 0 0))
    (scale (xyz 1 1 1))
    (rotate (xyz 0 0 0))
  )
)
