(module FEE_COMP_2 (layer F.Cu) (tedit 0)
  (attr smd)
  (fp_text reference CAM14 (at -2.54 1.016 unlocked) (layer F.SilkS) hide
    (effects (font (size 1.332992 1.40208) (thickness 0.254)))
  )
  (fp_text value FEE_COMP (at -4.064 1.016 unlocked) (layer F.SilkS) hide
    (effects (font (size 1.332992 1.40208) (thickness 0.254)))
  )
  (fp_arc (start 2.52124 -3.90355) (end 2.588186 -3.438979) (angle -89.6) (layer Dwgs.User) (width 0.00003))
  (fp_arc (start 3.42455 -1.70571) (end 3.509672 -1.287321) (angle -70.6) (layer Dwgs.User) (width 0.00003))
  (fp_arc (start 3.39309 -0.94432) (end 3.441318 -0.625426) (angle -77.1) (layer Dwgs.User) (width 0.00003))
  (fp_arc (start 2.76413 -3.90174) (end 2.986212 -3.967524) (angle -73.1) (layer Dwgs.User) (width 0.00003))
  (fp_arc (start 2.31057 -1.88402) (end 2.306073 -1.942457) (angle -187.3) (layer Dwgs.User) (width 0.03))
  (fp_arc (start 1.63718 -1.7894) (end 1.646635 -1.731659) (angle -177.3) (layer Dwgs.User) (width 0.03))
  (fp_arc (start 2.40821 -1.18899) (end 2.403815 -1.247435) (angle -187.3) (layer Dwgs.User) (width 0.03))
  (fp_arc (start 3.39631 -1.00566) (end 3.698379 -1.03581) (angle -62.4) (layer Dwgs.User) (width 0.00003))
  (fp_arc (start 1.73589 -1.09451) (end 1.744333 -1.036633) (angle -179.4) (layer Dwgs.User) (width 0.03))
  (fp_arc (start 1.57356 -2.11514) (end 1.554474 -2.388083) (angle -188) (layer Dwgs.User) (width 0.03))
  (fp_arc (start 2.71944 -0.49068) (end 2.35987 -0.473723) (angle -87.8) (layer Dwgs.User) (width 0.00003))
  (fp_arc (start 1.72346 -3.10225) (end 1.675709 -3.310742) (angle -80.3) (layer Dwgs.User) (width 0.00003))
  (fp_arc (start 1.67439 -1.44024) (end 1.646842 -1.731671) (angle -185.1) (layer Dwgs.User) (width 0.03))
  (fp_arc (start 1.39552 -2.68044) (end 1.221825 -3.916344) (angle -90) (layer Dwgs.User) (width 0.00003))
  (fp_arc (start 1.76508 -0.76392) (end 1.744097 -1.036614) (angle -187.3) (layer Dwgs.User) (width 0.03))
  (fp_arc (start 1.58843 -2.11214) (end 1.416896 -2.52626) (angle -122.2) (layer Dwgs.User) (width 0.00003))
  (fp_arc (start 1.17794 -1.84261) (end -0.21761 -1.548522) (angle -90) (layer Dwgs.User) (width 0.00003))
  (fp_arc (start 1.64564 -1.4362) (end 1.329372 -1.745913) (angle -104.9) (layer Dwgs.User) (width 0.00003))
  (fp_arc (start 1.66982 -0.76574) (end 1.42708 -1.050959) (angle -107.9) (layer Dwgs.User) (width 0.00003))
  (fp_arc (start 4.2027 -3.19337) (end 4.235496 -2.922357) (angle -182.2) (layer Dwgs.User) (width 0.00003))
  (fp_arc (start 3.33197 -2.36225) (end 3.387432 -2.094433) (angle -172.7) (layer Dwgs.User) (width 0.03))
  (fp_arc (start 3.94578 -2.05475) (end 3.981879 -1.784198) (angle -180.7) (layer Dwgs.User) (width 0.00003))
  (fp_arc (start 3.44558 -1.68915) (end 3.484763 -1.399347) (angle -180.5) (layer Dwgs.User) (width 0.03))
  (fp_arc (start 4.06578 -1.38255) (end 4.103952 -1.092602) (angle -181) (layer Dwgs.User) (width 0.00003))
  (fp_arc (start 3.54184 -1.77372) (end 3.831216 -1.763109) (angle -90.4) (layer Dwgs.User) (width 0.00003))
  (fp_arc (start 3.33212 -0.98413) (end 3.364917 -0.713107) (angle -182.2) (layer Dwgs.User) (width 0.03))
  (fp_arc (start 3.9844 -0.63283) (end 4.074505 -0.320654) (angle -163.8) (layer Dwgs.User) (width 0.00003))
  (fp_arc (start 3.38536 -2.32922) (end 3.550392 -2.063051) (angle -52) (layer Dwgs.User) (width 0.00003))
  (fp_line (start -0.3424 -2.43652) (end -0.2176 -1.54843) (layer Dwgs.User) (width 0.00003))
  (fp_line (start 1.50989 -3.09057) (end 4.15964 -3.46294) (layer Dwgs.User) (width 0.00003))
  (fp_line (start 1.41688 -2.52625) (end 4.23561 -2.92236) (layer Dwgs.User) (width 0.00003))
  (fp_line (start 1.22154 -3.91631) (end 2.76605 -4.13335) (layer Dwgs.User) (width 0.00003))
  (fp_line (start 3.69671 -2.29538) (end 3.90614 -2.32481) (layer Dwgs.User) (width 0.00003))
  (fp_line (start 1.67582 -3.31077) (end 2.588 -3.43895) (layer Dwgs.User) (width 0.00003))
  (fp_line (start 1.55442 -2.38808) (end 3.3113 -2.63497) (layer Dwgs.User) (width 0.03))
  (fp_line (start 3.83121 -1.76302) (end 3.9821 -1.78423) (layer Dwgs.User) (width 0.00003))
  (fp_line (start 3.84749 -1.64719) (end 4.02244 -1.67177) (layer Dwgs.User) (width 0.00003))
  (fp_line (start 2.30611 -1.94246) (end 3.38727 -2.09439) (layer Dwgs.User) (width 0.03))
  (fp_line (start 2.32239 -1.82662) (end 3.40355 -1.97855) (layer Dwgs.User) (width 0.03))
  (fp_line (start 3.6984 -1.03561) (end 4.10383 -1.09258) (layer Dwgs.User) (width 0.00003))
  (fp_line (start 3.71468 -0.91977) (end 3.98496 -0.95775) (layer Dwgs.User) (width 0.00003))
  (fp_line (start 2.40378 -1.24743) (end 3.48494 -1.39936) (layer Dwgs.User) (width 0.03))
  (fp_line (start 2.42006 -1.13159) (end 3.28885 -1.25368) (layer Dwgs.User) (width 0.03))
  (fp_line (start 2.72305 -0.13073) (end 4.07449 -0.32065) (layer Dwgs.User) (width 0.00003))
  (fp_line (start 1.8203 -0.49605) (end 3.36481 -0.7131) (layer Dwgs.User) (width 0.03))
  (fp_line (start 2.35989 -0.47345) (end 3.44105 -0.62538) (layer Dwgs.User) (width 0.00003))
  (fp_line (start -0.3424 -2.43652) (end 0.15957 -2.50706) (layer Dwgs.User) (width 0.00003))
)
