(module C0805_1 (layer F.Cu) (tedit 5E9B78B1)
  (attr smd)
  (fp_text reference REF** (at 0.6985 -0.6096 unlocked) (layer F.SilkS)
    (effects (font (size 1.033069 1.086612) (thickness 0.127)))
  )
  (fp_text value C-BC-C0805 (at -0.0332 3.35673 -270 unlocked) (layer F.SilkS) hide
    (effects (font (size 1.0496 1.104) (thickness 0.1)))
  )
  (fp_line (start -2.06375 1.11125) (end 2.06375 1.11125) (layer F.SilkS) (width 0.18))
  (fp_line (start -2.06375 1.11125) (end -2.06375 -1.11125) (layer F.SilkS) (width 0.18))
  (fp_line (start 2.06375 1.11125) (end 2.06375 -1.11125) (layer F.SilkS) (width 0.18))
  (fp_line (start -2.06375 -1.11125) (end 2.06375 -1.11125) (layer F.SilkS) (width 0.18))
  (fp_line (start -2.0574 1.0922) (end 2.0574 1.0922) (layer Dwgs.User) (width 0.1778))
  (fp_line (start -2.0574 1.0922) (end -2.0574 -1.0922) (layer Dwgs.User) (width 0.1778))
  (fp_line (start 2.0574 1.0922) (end 2.0574 -1.0922) (layer Dwgs.User) (width 0.1778))
  (fp_line (start -2.0574 -1.0922) (end 2.0574 -1.0922) (layer Dwgs.User) (width 0.1778))
  (fp_line (start -1 0.625) (end -1 -0.625) (layer F.Fab) (width 0.1))
  (fp_line (start 1 0.625) (end 1 -0.625) (layer F.Fab) (width 0.1))
  (fp_line (start -1 -0.625) (end 1 -0.625) (layer F.Fab) (width 0.1))
  (fp_line (start -1 0.625) (end 1 0.625) (layer F.Fab) (width 0.1))
  (pad 2 smd rect (at 1.05 0) (size 1.27 1.4224) (layers F.Cu F.Paste F.Mask))
  (pad 1 smd rect (at -1.05 0) (size 1.27 1.4224) (layers F.Cu F.Paste F.Mask))
  (model ${KISYS3DMOD}/Capacitor_SMD.3dshapes/C_0805_2012Metric.wrl
    (at (xyz 0 0 0))
    (scale (xyz 1 1 1))
    (rotate (xyz 0 0 0))
  )
)
