(module SOT23-BEC_1 (layer F.Cu) (tedit 5E991CBC)
  (attr smd)
  (fp_text reference T1 (at -0.05 -2.74 unlocked) (layer F.SilkS)
    (effects (font (size 1.0496 1.104) (thickness 0.18)))
  )
  (fp_text value Q-BC-SOT23-BEC (at 5.6 -0.8 unlocked) (layer F.SilkS) hide
    (effects (font (size 1.0496 1.104) (thickness 0.18)))
  )
  (fp_line (start -0.9525 -0.9525) (end -0.9525 -1.905) (layer F.SilkS) (width 0.18))
  (fp_line (start -1.74625 1.905) (end 0.48651 1.905) (layer F.SilkS) (width 0.18))
  (fp_line (start -1.74625 -0.9525) (end -0.9525 -0.9525) (layer F.SilkS) (width 0.18))
  (fp_line (start -1.74625 1.905) (end -1.74625 -0.9525) (layer F.SilkS) (width 0.18))
  (fp_line (start 1.44389 1.905) (end 1.74625 1.905) (layer F.SilkS) (width 0.18))
  (fp_line (start 0.9525 -0.9525) (end 0.9525 -1.905) (layer F.SilkS) (width 0.18))
  (fp_line (start -0.9525 -1.905) (end 0.9525 -1.905) (layer F.SilkS) (width 0.18))
  (fp_line (start 0.9525 -0.9525) (end 1.74625 -0.9525) (layer F.SilkS) (width 0.18))
  (fp_line (start 1.74625 1.905) (end 1.74625 -0.9525) (layer F.SilkS) (width 0.18))
  (fp_line (start -0.2032 -1.2446) (end 0.2032 -1.2446) (layer F.Fab) (width 0.1))
  (fp_line (start 0.762 1.2446) (end 1.1684 1.2446) (layer F.Fab) (width 0.1))
  (fp_line (start -1.1684 1.2446) (end -0.762 1.2446) (layer F.Fab) (width 0.1))
  (fp_line (start 0.2032 -0.6604) (end 0.2032 -1.2446) (layer F.Fab) (width 0.1))
  (fp_line (start -1.1684 1.2446) (end -1.1684 0.6604) (layer F.Fab) (width 0.1))
  (fp_line (start -0.2032 -0.6604) (end -0.2032 -1.2446) (layer F.Fab) (width 0.1))
  (fp_line (start -0.762 1.2446) (end -0.762 0.6604) (layer F.Fab) (width 0.1))
  (fp_line (start -1.4478 0.6604) (end 1.4478 0.6604) (layer F.Fab) (width 0.1))
  (fp_line (start 1.1684 1.2446) (end 1.1684 0.6604) (layer F.Fab) (width 0.1))
  (fp_line (start -1.4478 0.6604) (end -1.4478 -0.6604) (layer F.Fab) (width 0.1))
  (fp_line (start 0.762 1.2446) (end 0.762 0.6604) (layer F.Fab) (width 0.1))
  (fp_line (start 1.4478 0.6604) (end 1.4478 -0.6604) (layer F.Fab) (width 0.1))
  (fp_line (start -1.4478 -0.6604) (end 1.4478 -0.6604) (layer F.Fab) (width 0.1))
  (pad E smd rect (at 0.9652 1.0414) (size 0.9144 1.1176) (layers F.Cu F.Paste F.Mask))
  (pad C smd rect (at 0 -1.0414) (size 0.9144 1.1176) (layers F.Cu F.Paste F.Mask))
  (pad B smd rect (at -0.9652 1.0414) (size 0.9144 1.1176) (layers F.Cu F.Paste F.Mask))
  (model ${KISYS3DMOD}/Package_TO_SOT_SMD.3dshapes/SOT-23.wrl
    (at (xyz 0 0 0))
    (scale (xyz 1 1 1))
    (rotate (xyz 0 0 -90))
  )
)
