(module DPAK (layer F.Cu) (tedit 5E94EBA4)
  (attr smd)
  (fp_text reference REF** (at -0.7747 0.0762 unlocked) (layer F.SilkS)
    (effects (font (size 1.033069 1.086612) (thickness 0.0762)))
  )
  (fp_text value DPAK (at -4.3307 0.7874 unlocked) (layer F.SilkS) hide
    (effects (font (size 1.033069 1.086612) (thickness 0.0762)))
  )
  (fp_line (start 3.81 -1.5748) (end 3.81 5.2324) (layer F.SilkS) (width 0.1778))
  (fp_line (start 3.7846 -2.3368) (end -3.81 -2.3368) (layer F.SilkS) (width 0.1778))
  (fp_line (start -3.4036 5.6388) (end -3.81 5.2324) (layer F.SilkS) (width 0.1778))
  (fp_line (start -1.9812 5.715) (end -2.7686 5.715) (layer F.SilkS) (width 0.1778))
  (fp_line (start -3.81 -2.3368) (end -3.81 5.2324) (layer F.SilkS) (width 0.1778))
  (fp_line (start -0.381 5.715) (end -1.1684 5.715) (layer F.SilkS) (width 0.1778))
  (fp_line (start 1.1684 5.715) (end 0.381 5.715) (layer F.SilkS) (width 0.1778))
  (fp_line (start 2.7686 5.715) (end 1.9812 5.715) (layer F.SilkS) (width 0.1778))
  (fp_line (start 3.81 5.2324) (end 3.4036 5.6388) (layer F.SilkS) (width 0.1778))
  (fp_line (start 2.8448 3.683) (end 2.8448 4.318) (layer B.Fab) (width 0.0762))
  (fp_line (start -0.4826 -3.6068) (end -0.4826 -2.3368) (layer B.Fab) (width 0.0762))
  (fp_line (start 0.4826 -2.3368) (end -0.4826 -2.3368) (layer B.Fab) (width 0.0762))
  (fp_line (start 3.3274 -2.3368) (end 3.3274 3.683) (layer B.Fab) (width 0.0762))
  (fp_line (start -2.2098 4.953) (end -2.2098 5.2578) (layer B.Fab) (width 0.0762))
  (fp_line (start -2.2098 4.953) (end -2.8448 4.318) (layer B.Fab) (width 0.0762))
  (fp_line (start -2.8448 3.683) (end -2.8448 4.318) (layer B.Fab) (width 0.0762))
  (fp_line (start 2.2098 5.2578) (end -2.2098 5.2578) (layer B.Fab) (width 0.0762))
  (fp_line (start 2.794 -5.334) (end 1.778 -5.334) (layer B.Fab) (width 0.0762))
  (fp_line (start 3.3274 3.683) (end -3.3274 3.683) (layer B.Fab) (width 0.0762))
  (fp_line (start -3.3274 -2.3368) (end -3.3274 3.683) (layer B.Fab) (width 0.0762))
  (fp_line (start -1.778 -5.207) (end -1.778 -2.3368) (layer B.Fab) (width 0.0762))
  (fp_line (start -1.778 -2.3368) (end -2.794 -2.3368) (layer B.Fab) (width 0.0762))
  (fp_line (start 3.3274 -2.3368) (end -3.3274 -2.3368) (layer B.Fab) (width 0.0762))
  (fp_line (start 2.794 -5.334) (end 2.794 -2.3368) (layer B.Fab) (width 0.0762))
  (fp_line (start 1.778 -5.334) (end 1.778 -2.3368) (layer B.Fab) (width 0.0762))
  (fp_line (start 2.794 -2.3368) (end 1.778 -2.3368) (layer B.Fab) (width 0.0762))
  (fp_line (start 2.2098 4.953) (end 2.2098 5.2578) (layer B.Fab) (width 0.0762))
  (fp_line (start -2.794 -5.207) (end -2.794 -2.3368) (layer B.Fab) (width 0.0762))
  (fp_line (start 2.8448 4.318) (end 2.2098 4.953) (layer B.Fab) (width 0.0762))
  (fp_line (start 0.4826 -3.6068) (end -0.4826 -3.6068) (layer B.Fab) (width 0.0762))
  (fp_line (start 0.4826 -3.6068) (end 0.4826 -2.3368) (layer B.Fab) (width 0.0762))
  (fp_line (start -1.778 -5.207) (end -2.794 -5.207) (layer B.Fab) (width 0.0762))
  (pad 3 smd rect (at -2.286 -4.8768 180) (size 1.5748 3.175) (layers F.Cu F.Paste F.Mask))
  (pad 2 smd rect (at 0 1.778 180) (size 6.7056 6.7056) (layers F.Cu F.Paste F.Mask))
  (pad 1 smd rect (at 2.286 -4.8768 180) (size 1.5748 3.175) (layers F.Cu F.Paste F.Mask))
  (model "${KIPRJMOD}/10096315 Blower Driver.pretty/TO228P972X240-3N-R540X510.stp"
    (at (xyz 0 0 0))
    (scale (xyz 1 1 1))
    (rotate (xyz 0 0 90))
  )
)
