EESchema Schematic File Version 4
EELAYER 30 0
EELAYER END
$Descr A3 16535 11693
encoding utf-8
Sheet 6 8
Title ""
Date ""
Rev ""
Comp ""
Comment1 ""
Comment2 ""
Comment3 ""
Comment4 ""
$EndDescr
$Comp
L 10005011_Power_Management:VACDC #PWR0205
U 1 1 5E9388D2
P 1300 3000
F 0 "#PWR0205" H 1300 2850 50  0001 C CNN
F 1 "VACDC" H 1300 3165 50  0000 C CNN
F 2 "" H 1300 3000 50  0001 C CNN
F 3 "" H 1300 3000 50  0001 C CNN
	1    1300 3000
	1    0    0    -1  
$EndComp
$Comp
L 10005011_Power_Management:PGND #PWR0206
U 1 1 5E955002
P 1300 3700
F 0 "#PWR0206" H 1300 3450 50  0001 C CNN
F 1 "PGND" H 1300 3550 50  0000 C CNN
F 2 "" H 1300 3700 50  0001 C CNN
F 3 "" H 1300 3700 50  0001 C CNN
	1    1300 3700
	1    0    0    -1  
$EndComp
Wire Wire Line
	1300 3200 1300 3100
Wire Wire Line
	1300 3100 1700 3100
Wire Wire Line
	3200 3100 3200 3500
Connection ~ 1300 3100
Wire Wire Line
	1300 3100 1300 3000
Text GLabel 1600 5600 0    50   Input ~ 0
ICHARGE-SETTING
$Comp
L Device:R R79
U 1 1 5E95C8F2
P 3200 3650
F 0 "R79" H 3270 3696 50  0000 L CNN
F 1 "1.5M" H 3270 3605 50  0000 L CNN
F 2 "10005011 Power Management:R0603_1" V 3130 3650 50  0001 C CNN
F 3 "https://www.yageo.com/upload/media/product/productsearch/datasheet/rchip/PYu-RC_Group_51_RoHS_L_10.pdf" H 3200 3650 50  0001 C CNN
F 4 "Yageo" H 3200 3650 50  0001 C CNN "Mfgr"
F 5 "RC0603FR-071M5L" H 3200 3650 50  0001 C CNN "Mfgr_PN"
F 6 "Digi-Key" H 3200 3650 50  0001 C CNN "Source"
F 7 "311-1.50MHRCT-ND" H 3200 3650 50  0001 C CNN "Source_PN"
F 8 "0603" H 3270 3559 50  0001 L CNN "Bom_Footprint"
F 9 "RES SMD 1.5M OHM 1% 1/10W 0603" H 3200 3650 50  0001 C CNN "Description"
F 10 "1%" H 3200 3650 50  0001 C CNN "Tolerance"
F 11 "1/10W" H 3200 3650 50  0001 C CNN "Wattage"
	1    3200 3650
	1    0    0    -1  
$EndComp
$Comp
L Device:R R91
U 1 1 5E95D4BD
P 1450 5200
F 0 "R91" V 1335 5200 50  0000 C CNN
F 1 "16.2k" V 1244 5200 50  0000 C CNN
F 2 "10005011 Power Management:R0603_1" V 1380 5200 50  0001 C CNN
F 3 "https://industrial.panasonic.com/cdbs/www-data/pdf/RDM0000/AOA0000C307.pdf" H 1450 5200 50  0001 C CNN
F 4 "Panasonic Electronic Components" H 1450 5200 50  0001 C CNN "Mfgr"
F 5 "ERA-3AEB1622V" H 1450 5200 50  0001 C CNN "Mfgr_PN"
F 6 "Digi-Key" H 1450 5200 50  0001 C CNN "Source"
F 7 "P16.2KDBCT-ND" H 1450 5200 50  0001 C CNN "Source_PN"
F 8 "0603" V 1657 5200 50  0001 C CNN "Bom_Footprint"
F 9 "RES SMD 16.2KOHM 0.1% 1/10W 0603" H 1450 5200 50  0001 C CNN "Description"
F 10 "0.1%" V 1566 5200 50  0001 C CNN "Tolerance"
F 11 "1/10W" H 1450 5200 50  0001 C CNN "Wattage"
	1    1450 5200
	0    -1   -1   0   
$EndComp
Wire Wire Line
	1300 3500 1300 3600
Wire Wire Line
	1300 3600 1700 3600
Wire Wire Line
	2900 3600 2900 3500
Connection ~ 1300 3600
Wire Wire Line
	1300 3600 1300 3700
Wire Wire Line
	1700 3500 1700 3600
Connection ~ 1700 3600
Wire Wire Line
	1700 3600 2100 3600
Wire Wire Line
	2100 3500 2100 3600
Connection ~ 2100 3600
Wire Wire Line
	2100 3600 2500 3600
Wire Wire Line
	2100 3200 2100 3100
Wire Wire Line
	1700 3100 1700 3200
Connection ~ 1700 3100
Wire Wire Line
	1700 3100 2100 3100
Wire Wire Line
	2900 3200 2900 3100
Wire Wire Line
	2500 3100 2500 3200
Wire Wire Line
	2500 3500 2500 3600
Connection ~ 2500 3600
Wire Wire Line
	2500 3600 2900 3600
Wire Wire Line
	2100 3100 2500 3100
Connection ~ 2100 3100
Connection ~ 2500 3100
Wire Wire Line
	2500 3100 2900 3100
Connection ~ 2900 3100
Wire Wire Line
	2900 3100 3200 3100
$Comp
L 10005011_Power_Management:LT1620CMS8 IC14
U 1 1 5E97706E
P 2350 4900
F 0 "IC14" H 2000 5350 50  0000 R CNN
F 1 "LT1620CMS8" H 2000 5450 50  0000 R CNN
F 2 "10005011 Power Management:uSO08_1" H 2450 5000 50  0001 C CNN
F 3 "https://www.analog.com/media/en/technical-documentation/data-sheets/16201f.pdf" H 2450 5000 50  0001 C CNN
F 4 "IC,CURRENT AMPLIFIER,MSOP" H 2450 5000 50  0001 C CNN "Description"
F 5 "10022893" H 2450 5000 50  0001 C CNN "Item Number"
F 6 "LINEAR TECHNOLOGY_RMS1" H 2450 5000 50  0001 C CNN "Manufacturer"
F 7 "LT1620CMS8#TRPBF" H 2450 5000 50  0001 C CNN "Manufacturer_No"
	1    2350 4900
	-1   0    0    1   
$EndComp
Wire Wire Line
	2650 5400 2650 5500
Wire Wire Line
	2250 5400 2250 5500
Wire Wire Line
	2250 5500 2300 5500
Connection ~ 2250 5500
Wire Wire Line
	2250 5500 2250 6100
Wire Wire Line
	2600 5500 2650 5500
Connection ~ 2650 5500
Wire Wire Line
	2650 5500 2650 6100
Text Label 2250 6100 1    50   ~ 0
-ISENSE
Text Label 2650 6100 1    50   ~ 0
+ISENSE
Wire Wire Line
	9800 3800 9800 3200
Wire Wire Line
	9300 3800 9300 3200
Text Label 9800 3200 3    50   ~ 0
-ISENSE
Text Label 9300 3200 3    50   ~ 0
+ISENSE
Wire Wire Line
	2650 4200 2650 4100
Wire Wire Line
	2650 4100 2600 4100
Wire Wire Line
	2250 4200 2250 4100
Wire Wire Line
	2250 4100 2300 4100
$Comp
L power:GND #PWR0207
U 1 1 5E984F6F
P 2050 4000
F 0 "#PWR0207" H 2050 3750 50  0001 C CNN
F 1 "GND" H 2050 3850 50  0000 C CNN
F 2 "" H 2050 4000 50  0001 C CNN
F 3 "" H 2050 4000 50  0001 C CNN
	1    2050 4000
	1    0    0    -1  
$EndComp
Wire Wire Line
	2050 4000 2050 3900
Wire Wire Line
	2050 3900 2250 3900
Wire Wire Line
	2250 3900 2250 4100
Connection ~ 2250 4100
Wire Wire Line
	2650 4100 2650 3800
Wire Wire Line
	2650 3800 1600 3800
Wire Wire Line
	1600 3800 1600 4200
Connection ~ 2650 4100
$Comp
L Device:R R85
U 1 1 5E987A09
P 1250 4650
F 0 "R85" H 1180 4604 50  0000 R CNN
F 1 "2.87k" H 1180 4695 50  0000 R CNN
F 2 "10005011 Power Management:R0603_1" V 1180 4650 50  0001 C CNN
F 3 "https://www.mouser.com/datasheet/2/414/PCF-1528243.pdf" H 1250 4650 50  0001 C CNN
F 4 "IRC / TT Electronics" H 1250 4650 50  0001 C CNN "Mfgr"
F 5 "PCF0603R-2K87BI" H 1250 4650 50  0001 C CNN "Mfgr_PN"
F 6 "Mouser" H 1250 4650 50  0001 C CNN "Source"
F 7 "756-PCF0603R2K87BI" H 1250 4650 50  0001 C CNN "Source_PN"
F 8 "0603" H 1320 4650 50  0001 L CNN "Bom_Footprint"
F 9 "Thin Film Resistors - SMD 0603 2K87Ohms 0.1% 25 PPM" H 1250 4650 50  0001 C CNN "Description"
F 10 "0.1%" H 1320 4559 50  0001 L CNN "Tolerance"
F 11 "1/16W" H 1320 4468 50  0001 L CNN "Wattage"
	1    1250 4650
	-1   0    0    1   
$EndComp
Wire Wire Line
	1000 4500 1000 4200
Wire Wire Line
	1000 4200 1250 4200
Connection ~ 1600 4200
Wire Wire Line
	1600 4200 1600 4300
Wire Wire Line
	1250 4500 1250 4200
Connection ~ 1250 4200
Wire Wire Line
	1250 4200 1600 4200
Text Label 1000 4200 0    50   ~ 0
INTVCC-2
Wire Wire Line
	1850 5000 1250 5000
Wire Wire Line
	1000 5000 1000 4800
Wire Wire Line
	1250 4800 1250 5000
Connection ~ 1250 5000
Wire Wire Line
	1250 5000 1000 5000
Wire Wire Line
	1000 5000 1000 5200
Wire Wire Line
	1000 5200 1300 5200
Connection ~ 1000 5000
Wire Wire Line
	1600 5200 1700 5200
Wire Wire Line
	1700 5200 1700 5600
Wire Wire Line
	1700 5600 1600 5600
Text Label 1000 5000 0    50   ~ 0
PROG-LT1620
$Comp
L 10005011_Power_Management:LTC1435CS IC13
U 1 1 5E9A46CA
P 6300 4500
F 0 "IC13" H 5900 5300 50  0000 C CNN
F 1 "LTC1435CS" H 6450 5300 50  0000 L CNN
F 2 "10005011 Power Management:SSOP16_1" V 6250 4550 50  0001 C CNN
F 3 "https://www.analog.com/media/en/technical-documentation/data-sheets/1435f.pdf" H 6300 4500 50  0001 C CNN
F 4 "IC,SWITCHING REGULATOR,SSOP" H 6300 4500 50  0001 C CNN "Description"
F 5 "10022897" H 6300 4500 50  0001 C CNN "Item Number"
F 6 "LINEAR TECHNOLOGY" H 6300 4500 50  0001 C CNN "Manufacturer"
F 7 "LTC1435IG#TRPBF" H 6300 4500 50  0001 C CNN "Manufacturer_No"
	1    6300 4500
	1    0    0    -1  
$EndComp
Wire Wire Line
	5700 4900 4700 4900
Wire Wire Line
	3200 3800 3200 4900
Connection ~ 3200 4900
Wire Wire Line
	3200 4900 3100 4900
Text Label 5200 5100 0    50   ~ 0
INTVCC-2
Text Label 5150 4700 0    50   ~ 0
VOSENSE-2
Wire Wire Line
	6100 5400 6100 5500
Wire Wire Line
	4200 5500 4200 5300
Wire Wire Line
	4200 4700 4200 5000
Wire Wire Line
	4700 5300 4700 5400
Wire Wire Line
	4700 4900 4700 5000
Connection ~ 4700 4900
Wire Wire Line
	4700 4900 3200 4900
Wire Wire Line
	5200 4500 5700 4500
Text Label 5200 4500 0    50   ~ 0
INTVCC-2
Wire Wire Line
	4700 3800 4700 4100
Wire Wire Line
	4700 4100 5700 4100
Wire Wire Line
	5700 3900 5100 3900
Wire Wire Line
	5100 3900 5100 3800
$Comp
L power:GND #PWR0208
U 1 1 5E9C9BAD
P 4300 3400
F 0 "#PWR0208" H 4300 3150 50  0001 C CNN
F 1 "GND" H 4300 3250 50  0000 C CNN
F 2 "" H 4300 3400 50  0001 C CNN
F 3 "" H 4300 3400 50  0001 C CNN
	1    4300 3400
	1    0    0    -1  
$EndComp
Wire Wire Line
	4300 3400 4300 3300
Wire Wire Line
	4300 3300 4700 3300
Wire Wire Line
	4700 3300 4700 3500
Wire Wire Line
	4700 3300 5100 3300
Wire Wire Line
	5100 3300 5100 3500
Connection ~ 4700 3300
$Comp
L power:GND #PWR0209
U 1 1 5E9CDE4D
P 6100 5600
F 0 "#PWR0209" H 6100 5350 50  0001 C CNN
F 1 "GND" H 6100 5450 50  0000 C CNN
F 2 "" H 6100 5600 50  0001 C CNN
F 3 "" H 6100 5600 50  0001 C CNN
	1    6100 5600
	1    0    0    -1  
$EndComp
$Comp
L 10005011_Power_Management:PGND #PWR0210
U 1 1 5E9CFB35
P 8500 5600
F 0 "#PWR0210" H 8500 5350 50  0001 C CNN
F 1 "PGND" H 8500 5450 50  0000 C CNN
F 2 "" H 8500 5600 50  0001 C CNN
F 3 "" H 8500 5600 50  0001 C CNN
	1    8500 5600
	1    0    0    -1  
$EndComp
Wire Wire Line
	6400 5400 6400 5500
Wire Wire Line
	6100 5600 6100 5500
Connection ~ 6100 5500
Wire Wire Line
	4500 4300 4600 4300
Wire Wire Line
	4200 4300 4000 4300
Wire Wire Line
	4000 4300 4000 4400
Wire Wire Line
	4000 4700 4000 5500
Wire Wire Line
	4000 5500 4200 5500
$Comp
L Device:R R82
U 1 1 5E9DD03B
P 3700 4550
F 0 "R82" H 3630 4641 50  0000 R CNN
F 1 "1k" H 3630 4550 50  0000 R CNN
F 2 "10005011 Power Management:R0603_1" V 3630 4550 50  0001 C CNN
F 3 "https://www.bourns.com/docs/Product-Datasheets/CHPREZTR.pdf" H 3700 4550 50  0001 C CNN
F 4 "Bourns Inc." H 3700 4550 50  0001 C CNN "Mfgr"
F 5 "CR0603-FX-1001ELF" H 3700 4550 50  0001 C CNN "Mfgr_PN"
F 6 "Digi-Key" H 3700 4550 50  0001 C CNN "Source"
F 7 "CR0603-FX-1001ELFCT-ND" H 3700 4550 50  0001 C CNN "Source_PN"
F 8 "0603" H 3630 4459 50  0000 R CNN "Bom_Footprint"
F 9 "RES SMD 1K OHM 1% 1/10W 0603" H 3700 4550 50  0001 C CNN "Description"
F 10 "1%" H 3700 4550 50  0001 C CNN "Tolerance"
F 11 "1/10W" H 3700 4550 50  0001 C CNN "Wattage"
	1    3700 4550
	1    0    0    -1  
$EndComp
Wire Wire Line
	4000 4300 3700 4300
Wire Wire Line
	3700 4300 3700 4400
Connection ~ 4000 4300
Wire Wire Line
	3700 4700 3700 5500
Wire Wire Line
	3700 5500 4000 5500
Connection ~ 4000 5500
Wire Wire Line
	3000 4600 3400 4600
Wire Wire Line
	3400 4600 3400 4100
Wire Wire Line
	3400 4100 4600 4100
Wire Wire Line
	4600 4100 4600 4300
Connection ~ 4600 4300
Wire Wire Line
	4600 4300 5700 4300
Text Label 3750 4100 0    50   ~ 0
ITH
Text Label 3750 4300 0    50   ~ 0
ITHTH
NoConn ~ 6150 3600
Wire Wire Line
	3200 3100 6400 3100
Wire Wire Line
	6400 3100 6400 3600
Connection ~ 3200 3100
$Comp
L 10005011_Power_Management:PGND #PWR0211
U 1 1 5E9F0A22
P 7000 3600
F 0 "#PWR0211" H 7000 3350 50  0001 C CNN
F 1 "PGND" H 7000 3450 50  0000 C CNN
F 2 "" H 7000 3600 50  0001 C CNN
F 3 "" H 7000 3600 50  0001 C CNN
	1    7000 3600
	1    0    0    -1  
$EndComp
Wire Wire Line
	6400 3100 7000 3100
Wire Wire Line
	7000 3100 7000 3200
Connection ~ 6400 3100
Wire Wire Line
	7000 3500 7000 3600
Wire Wire Line
	6900 4500 7300 4500
Text Label 6900 4500 0    50   ~ 0
INTVCC-2
Wire Wire Line
	6900 4700 7900 4700
Wire Wire Line
	7900 4700 7900 4500
Wire Wire Line
	7900 4500 7800 4500
Wire Wire Line
	7900 4500 8000 4500
Connection ~ 7900 4500
Wire Wire Line
	6400 5500 7300 5500
Wire Wire Line
	7300 5500 7300 5400
Wire Wire Line
	8500 5500 8500 5600
Wire Wire Line
	7300 5100 7300 4500
Connection ~ 7300 4500
Wire Wire Line
	7300 4500 7500 4500
$Comp
L 10005011_Power_Management:PMEG4005ET D8
U 1 1 5EA2258B
P 7650 4200
F 0 "D8" H 7650 4300 50  0000 C CNN
F 1 "PMEG4005ET" H 7650 4100 50  0000 C CNN
F 2 "10005011 Power Management:SOT23-1G_1" H 7650 4025 50  0001 C CNN
F 3 "https://assets.nexperia.com/documents/data-sheet/PMEGXX05ET_SER.pdf" H 7650 4200 50  0001 C CNN
F 4 "DIODE SCHOTTKY, 40V, 500MA" H 7650 4200 50  0001 C CNN "Description"
F 5 "10039586" H 7650 4200 50  0001 C CNN "Item Number"
F 6 "PHILIPS" H 7650 4200 50  0001 C CNN "Manufacturer"
F 7 "PMEG4005ET" H 7650 4200 50  0001 C CNN "Manufacturer_No"
	1    7650 4200
	1    0    0    -1  
$EndComp
Wire Wire Line
	6900 4100 7400 4100
Wire Wire Line
	7400 4100 7400 4200
Wire Wire Line
	7400 4200 7500 4200
Wire Wire Line
	7400 4100 7400 3900
Wire Wire Line
	7400 3900 7500 3900
Connection ~ 7400 4100
$Comp
L 10005011_Power_Management:IRFR024NTRPBF T24
U 1 1 5EA3C34E
P 8400 3550
F 0 "T24" H 8605 3596 50  0000 L CNN
F 1 "IRFR024NTRPBF" H 8605 3505 50  0000 L CNN
F 2 "10005011 Power Management:DPAK-GDS_1" H 9250 3475 50  0001 C CIN
F 3 "https://www.infineon.com/dgdl/irfr024npbf.pdf?fileId=5546d462533600a40153562cf721203c" H 8725 3250 50  0001 L CNN
F 4 "IRFR024NTRPBF" H 8925 3475 50  0001 C CNN "Mfgr_PN"
F 5 "Infineon Technologies" H 9050 3475 50  0001 C CNN "Mfgr"
F 6 "Digi-Key" H 8800 3475 50  0001 C CNN "Source"
F 7 "IRFR024NPBFCT-ND" H 9000 3475 50  0001 C CNN "Source_PN"
F 8 "MOSFET N-CH 55V 17A DPAK" H 9200 3475 50  0001 C CNN "Description"
F 9 "10022559" H 8400 3550 50  0001 C CNN "Item Number"
	1    8400 3550
	1    0    0    -1  
$EndComp
Wire Wire Line
	7000 3100 8500 3100
Wire Wire Line
	8500 3100 8500 3350
Connection ~ 7000 3100
Wire Wire Line
	8200 3550 7200 3550
Wire Wire Line
	7200 3550 7200 3900
Wire Wire Line
	7200 3900 6900 3900
Wire Wire Line
	8500 3750 8500 3900
Wire Wire Line
	8500 4500 8300 4500
$Comp
L 10005011_Power_Management:IRFR024NTRPBF T27
U 1 1 5EA4B749
P 8400 5000
F 0 "T27" H 8600 5075 50  0000 L CNN
F 1 "IRFR024NTRPBF" H 8600 5000 50  0000 L CNN
F 2 "10005011 Power Management:DPAK-GDS_1" H 9250 4925 50  0001 C CIN
F 3 "https://www.infineon.com/dgdl/irfr024npbf.pdf?fileId=5546d462533600a40153562cf721203c" H 8725 4700 50  0001 L CNN
F 4 "IRFR024NTRPBF" H 8925 4925 50  0001 C CNN "Mfgr_PN"
F 5 "Infineon Technologies" H 9050 4925 50  0001 C CNN "Mfgr"
F 6 "Digi-Key" H 8800 4925 50  0001 C CNN "Source"
F 7 "IRFR024NPBFCT-ND" H 9000 4925 50  0001 C CNN "Source_PN"
F 8 "MOSFET N-CH 55V 17A DPAK" H 9200 4925 50  0001 C CNN "Description"
F 9 "10022559" H 8400 5000 50  0001 C CNN "Item Number"
	1    8400 5000
	1    0    0    -1  
$EndComp
Wire Wire Line
	6900 5000 8200 5000
Wire Wire Line
	7800 4200 8100 4200
Connection ~ 8500 4200
Wire Wire Line
	8500 4200 8500 4500
Wire Wire Line
	7800 3900 8100 3900
Wire Wire Line
	8100 3900 8100 4200
Connection ~ 8100 4200
Wire Wire Line
	8100 4200 8500 4200
Wire Wire Line
	8500 4800 8500 4500
Connection ~ 8500 4500
Wire Wire Line
	8500 5200 8500 5500
Wire Wire Line
	8500 5500 7300 5500
Connection ~ 7300 5500
Connection ~ 8500 5500
$Comp
L Device:L_Core_Iron L?
U 1 1 5E93C62C
P 9050 3900
AR Path="/5FB0520C/5E93C62C" Ref="L?"  Part="1" 
AR Path="/5FEC1BCD/5E93C62C" Ref="L12"  Part="1" 
F 0 "L12" V 9275 3900 50  0000 C CNN
F 1 "47uH" V 9184 3900 50  0000 C CNN
F 2 "10005011 Power Management:WEPD-XXL_1" H 9050 3900 50  0001 C CNN
F 3 "~" H 9050 3900 50  0001 C CNN
	1    9050 3900
	0    -1   -1   0   
$EndComp
$Comp
L Device:R R80
U 1 1 5E9442A8
P 9550 3900
F 0 "R80" V 9665 3900 50  0000 C CNN
F 1 "0.05_2010" V 9750 3900 50  0000 C CNN
F 2 "10005011 Power Management:R2010_1" V 9480 3900 50  0001 C CNN
F 3 "https://www.seielect.com/catalog/sei-csr_csrn.pdf" H 9550 3900 50  0001 C CNN
F 4 "Stackpole Electronics Inc" H 9550 3900 50  0001 C CNN "Mfgr"
F 5 "CSRN2010FK50L0" H 9550 3900 50  0001 C CNN "Mfgr_PN"
F 6 "Digi-Key" H 9550 3900 50  0001 C CNN "Source"
F 7 "CSRN2010FK50L0CT-ND" H 9550 3900 50  0001 C CNN "Source_PN"
F 8 "2010" V 9847 3900 50  0001 C CNN "Bom_Footprint"
F 9 "RES 0.05 OHM 1% 1W 2010" H 9550 3900 50  0001 C CNN "Description"
F 10 "1%" H 9550 3900 50  0001 C CNN "Tolerance"
F 11 "1W" V 9938 3900 50  0001 C CNN "Wattage"
	1    9550 3900
	0    -1   -1   0   
$EndComp
Wire Wire Line
	9400 3900 9300 3800
Wire Wire Line
	9700 3900 9800 3800
Wire Wire Line
	9200 3900 9400 3900
Wire Wire Line
	8900 3900 8500 3900
Connection ~ 8500 3900
Wire Wire Line
	8500 3900 8500 4200
Wire Wire Line
	10700 4400 10700 4300
Wire Wire Line
	9900 4300 9900 4400
Wire Wire Line
	9900 4000 9900 3900
Wire Wire Line
	10700 4000 10700 3900
Wire Wire Line
	10300 3900 10300 4000
Wire Wire Line
	10300 4300 10300 4400
Connection ~ 10300 4400
Wire Wire Line
	10300 4400 10700 4400
$Comp
L 10005011_Power_Management:PGND #PWR0212
U 1 1 5E964DD2
P 9900 4500
F 0 "#PWR0212" H 9900 4250 50  0001 C CNN
F 1 "PGND" H 9900 4350 50  0000 C CNN
F 2 "" H 9900 4500 50  0001 C CNN
F 3 "" H 9900 4500 50  0001 C CNN
	1    9900 4500
	1    0    0    -1  
$EndComp
Wire Wire Line
	9900 4400 9900 4500
Connection ~ 9900 4400
Wire Wire Line
	9900 4400 10300 4400
$Comp
L Device:R R81
U 1 1 5E9724D0
P 11100 4150
F 0 "R81" H 11030 4104 50  0000 R CNN
F 1 "13.7k" H 11030 4195 50  0000 R CNN
F 2 "10005011 Power Management:R0603_1" V 11030 4150 50  0001 C CNN
F 3 "https://industrial.panasonic.com/cdbs/www-data/pdf/RDM0000/AOA0000C307.pdf" H 11100 4150 50  0001 C CNN
F 4 "Panasonic Electronic Components" H 11100 4150 50  0001 C CNN "Mfgr"
F 5 "ERA-3AEB1372V" H 11100 4150 50  0001 C CNN "Mfgr_PN"
F 6 "Digi-Key" H 11100 4150 50  0001 C CNN "Source"
F 7 "P13.7KDBCT-ND" H 11100 4150 50  0001 C CNN "Source_PN"
F 8 "0603" H 11170 4105 50  0001 L CNN "Bom_Footprint"
F 9 "RES SMD 13.7KOHM 0.1% 1/10W 0603" H 11100 4150 50  0001 C CNN "Description"
F 10 "0.1%" H 11170 4014 50  0001 L CNN "Tolerance"
F 11 "1/10W" H 11100 4150 50  0001 C CNN "Wattage"
	1    11100 4150
	-1   0    0    1   
$EndComp
$Comp
L Device:R R90
U 1 1 5E973CFC
P 11100 4650
F 0 "R90" H 11030 4604 50  0000 R CNN
F 1 "1.37k" H 11030 4695 50  0000 R CNN
F 2 "10005011 Power Management:R0603_1" V 11030 4650 50  0001 C CNN
F 3 "https://industrial.panasonic.com/cdbs/www-data/pdf/RDM0000/AOA0000C307.pdf" H 11100 4650 50  0001 C CNN
F 4 "Panasonic Electronic Components" H 11100 4650 50  0001 C CNN "Mfgr"
F 5 "ERA-3AEB1371V" H 11100 4650 50  0001 C CNN "Mfgr_PN"
F 6 "Digi-Key" H 11100 4650 50  0001 C CNN "Source"
F 7 "P1.37KDBCT-ND" H 11100 4650 50  0001 C CNN "Source_PN"
F 8 "0603" H 11170 4605 50  0001 L CNN "Bom_Footprint"
F 9 "RES SMD 1.37KOHM 0.1% 1/10W 0603" H 11100 4650 50  0001 C CNN "Description"
F 10 "0.1%" H 11170 4514 50  0001 L CNN "Tolerance"
F 11 "1/10W" H 11100 4650 50  0001 C CNN "Wattage"
	1    11100 4650
	-1   0    0    1   
$EndComp
Text GLabel 11300 4400 2    50   Output ~ 0
MES-VCHARGE
Wire Wire Line
	11100 4300 11100 4400
Wire Wire Line
	9700 3900 9900 3900
Wire Wire Line
	11100 3900 11100 4000
Connection ~ 9900 3900
Wire Wire Line
	9900 3900 10300 3900
Connection ~ 10300 3900
Wire Wire Line
	10300 3900 10700 3900
Connection ~ 10700 3900
Wire Wire Line
	10700 3900 11100 3900
Wire Wire Line
	11100 4400 11300 4400
Connection ~ 11100 4400
Wire Wire Line
	11100 4400 11100 4500
$Comp
L power:GND #PWR0213
U 1 1 5E98398D
P 11100 4900
F 0 "#PWR0213" H 11100 4650 50  0001 C CNN
F 1 "GND" H 11100 4750 50  0000 C CNN
F 2 "" H 11100 4900 50  0001 C CNN
F 3 "" H 11100 4900 50  0001 C CNN
	1    11100 4900
	1    0    0    -1  
$EndComp
Wire Wire Line
	11100 4900 11100 4800
$Comp
L Device:R R87
U 1 1 5E9889ED
P 12000 3950
F 0 "R87" H 12069 3859 50  0000 L CNN
F 1 "86.6k" H 12069 3950 50  0000 L CNN
F 2 "10005011 Power Management:R0603_1" V 11930 3950 50  0001 C CNN
F 3 "https://industrial.panasonic.com/cdbs/www-data/pdf/RDA0000/AOA0000C304.pdf" H 12000 3950 50  0001 C CNN
F 4 "Panasonic Electronic Components" H 12000 3950 50  0001 C CNN "Mfgr"
F 5 "ERJ-3EKF8662V" H 12000 3950 50  0001 C CNN "Mfgr_PN"
F 6 "Digi-Key" H 12000 3950 50  0001 C CNN "Source"
F 7 "P86.6KHCT-ND" H 12000 3950 50  0001 C CNN "Source_PN"
F 8 "0603" H 12069 4041 50  0000 L CNN "Bom_Footprint"
F 9 "RES SMD 86.6K OHM 1% 1/10W 0603" H 12000 3950 50  0001 C CNN "Description"
F 10 "1%" H 12000 3950 50  0001 C CNN "Tolerance"
F 11 "1/10W" H 12000 3950 50  0001 C CNN "Wattage"
	1    12000 3950
	-1   0    0    1   
$EndComp
$Comp
L Device:R R92
U 1 1 5E98B144
P 12000 4650
F 0 "R92" H 11930 4604 50  0000 R CNN
F 1 "3.3k" H 11930 4695 50  0000 R CNN
F 2 "10005011 Power Management:R0603_1" V 11930 4650 50  0001 C CNN
F 3 "https://www.yageo.com/upload/media/product/productsearch/datasheet/rchip/PYu-RC_Group_51_RoHS_L_10.pdf" H 12000 4650 50  0001 C CNN
F 4 "Yageo" H 12000 4650 50  0001 C CNN "Mfgr"
F 5 "RC0603FR-073K3L" H 12000 4650 50  0001 C CNN "Mfgr_PN"
F 6 "Digi-Key" H 12000 4650 50  0001 C CNN "Source"
F 7 "311-3.30KHRCT-ND" H 12000 4650 50  0001 C CNN "Source_PN"
F 8 "0603" H 11930 4559 50  0001 R CNN "Bom_Footprint"
F 9 "RES SMD 3.3K OHM 1% 1/10W 0603" H 12000 4650 50  0001 C CNN "Description"
F 10 "1%" H 12000 4650 50  0001 C CNN "Tolerance"
F 11 "1/10W" H 12000 4650 50  0001 C CNN "Wattage"
	1    12000 4650
	-1   0    0    1   
$EndComp
$Comp
L Device:R R95
U 1 1 5E98BB58
P 12000 5150
F 0 "R95" H 11930 5104 50  0000 R CNN
F 1 "33" H 11930 5195 50  0000 R CNN
F 2 "10005011 Power Management:R0603_1" V 11930 5150 50  0001 C CNN
F 3 "https://www.yageo.com/upload/media/product/productsearch/datasheet/rchip/PYu-RC_Group_51_RoHS_L_10.pdf" H 12000 5150 50  0001 C CNN
F 4 "Yageo" H 12000 5150 50  0001 C CNN "Mfgr"
F 5 "RC0603FR-0733RL" H 12000 5150 50  0001 C CNN "Mfgr_PN"
F 6 "Digi-Key" H 12000 5150 50  0001 C CNN "Source"
F 7 "311-33.0HRCT-ND" H 12000 5150 50  0001 C CNN "Source_PN"
F 8 "0603" H 12070 5059 50  0001 L CNN "Bom_Footprint"
F 9 "RES SMD 33 OHM 1% 1/10W 0603" H 12000 5150 50  0001 C CNN "Description"
F 10 "1%" H 12000 5150 50  0001 C CNN "Tolerance"
F 11 "1/10W" H 12000 5150 50  0001 C CNN "Wattage"
	1    12000 5150
	-1   0    0    1   
$EndComp
Wire Wire Line
	12000 4800 12000 4900
Wire Wire Line
	12000 4100 12000 4300
Wire Wire Line
	12000 3800 12000 3700
Wire Wire Line
	12000 3700 11600 3700
Wire Wire Line
	11600 3700 11600 3900
Wire Wire Line
	11600 3900 11100 3900
Connection ~ 11100 3900
Text Label 11500 4300 0    50   ~ 0
VOSENSE-2
Wire Wire Line
	11500 4300 12000 4300
Connection ~ 12000 4300
Wire Wire Line
	12000 4300 12000 4500
$Comp
L Device:R R88
U 1 1 5E9EAD9B
P 12200 4250
F 0 "R88" H 12270 4296 50  0000 L CNN
F 1 "390_2616" H 12270 4205 50  0000 L CNN
F 2 "10005011 Power Management:SM2_1" V 12130 4250 50  0001 C CNN
F 3 "https://www.te.com/commerce/DocumentDelivery/DDEController?Action=srchrtrv&DocNm=1773242&DocType=DS&DocLang=English" H 12200 4250 50  0001 C CNN
F 4 "TE Connectivity Passive Product" H 12200 4250 50  0001 C CNN "Mfgr"
F 5 "SMF2390RJT" H 12200 4250 50  0001 C CNN "Mfgr_PN"
F 6 "Digi-Key" H 12200 4250 50  0001 C CNN "Source"
F 7 "A131672CT-ND" H 12200 4250 50  0001 C CNN "Source_PN"
F 8 "2616" H 12270 4250 50  0001 L CNN "Bom_Footprint"
F 9 "RES SMD 390 OHM 5% 2W 2616" H 12200 4250 50  0001 C CNN "Description"
F 10 "5%" H 12270 4159 50  0001 L CNN "Tolerance"
F 11 "2W" H 12270 4068 50  0001 L CNN "Wattage"
	1    12200 4250
	1    0    0    -1  
$EndComp
$Comp
L Device:R R126
U 1 1 5E9EBAF9
P 12700 4250
F 0 "R126" H 12770 4296 50  0000 L CNN
F 1 "390_2616" H 12770 4205 50  0000 L CNN
F 2 "10005011 Power Management:SM2_1" V 12630 4250 50  0001 C CNN
F 3 "https://www.te.com/commerce/DocumentDelivery/DDEController?Action=srchrtrv&DocNm=1773242&DocType=DS&DocLang=English" H 12700 4250 50  0001 C CNN
F 4 "TE Connectivity Passive Product" H 12700 4250 50  0001 C CNN "Mfgr"
F 5 "SMF2390RJT" H 12700 4250 50  0001 C CNN "Mfgr_PN"
F 6 "Digi-Key" H 12700 4250 50  0001 C CNN "Source"
F 7 "A131672CT-ND" H 12700 4250 50  0001 C CNN "Source_PN"
F 8 "2616" H 12770 4250 50  0001 L CNN "Bom_Footprint"
F 9 "RES SMD 390 OHM 5% 2W 2616" H 12700 4250 50  0001 C CNN "Description"
F 10 "5%" H 12770 4159 50  0001 L CNN "Tolerance"
F 11 "2W" H 12770 4068 50  0001 L CNN "Wattage"
	1    12700 4250
	1    0    0    -1  
$EndComp
Wire Wire Line
	12000 3700 12200 3700
Wire Wire Line
	12700 3700 12700 4100
Connection ~ 12000 3700
Wire Wire Line
	12200 4100 12200 3700
Connection ~ 12200 3700
Wire Wire Line
	12200 3700 12700 3700
Wire Wire Line
	12200 4400 12200 4500
Wire Wire Line
	12200 4500 12300 4500
Wire Wire Line
	12700 4500 12700 4400
Wire Wire Line
	11600 5300 11600 5400
Wire Wire Line
	12000 5400 12000 5300
$Comp
L 10005011_Power_Management:PGND #PWR0214
U 1 1 5EA1062A
P 11600 5500
F 0 "#PWR0214" H 11600 5250 50  0001 C CNN
F 1 "PGND" H 11600 5350 50  0000 C CNN
F 2 "" H 11600 5500 50  0001 C CNN
F 3 "" H 11600 5500 50  0001 C CNN
	1    11600 5500
	1    0    0    -1  
$EndComp
Wire Wire Line
	11600 5400 11600 5500
Wire Wire Line
	11600 4900 11600 5000
Connection ~ 12000 4900
Wire Wire Line
	12000 4900 12000 5000
$Comp
L Device:R R93
U 1 1 5EA1CAFD
P 11050 5300
F 0 "R93" V 11165 5300 50  0000 C CNN
F 1 "1k" V 11256 5300 50  0000 C CNN
F 2 "10005011 Power Management:R0603_1" V 10980 5300 50  0001 C CNN
F 3 "https://www.bourns.com/docs/Product-Datasheets/CHPREZTR.pdf" H 11050 5300 50  0001 C CNN
F 4 "Bourns Inc." H 11050 5300 50  0001 C CNN "Mfgr"
F 5 "CR0603-FX-1001ELF" H 11050 5300 50  0001 C CNN "Mfgr_PN"
F 6 "Digi-Key" H 11050 5300 50  0001 C CNN "Source"
F 7 "CR0603-FX-1001ELFCT-ND" H 11050 5300 50  0001 C CNN "Source_PN"
F 8 "0603" V 11347 5300 50  0001 C CNN "Bom_Footprint"
F 9 "RES SMD 1K OHM 1% 1/10W 0603" H 11050 5300 50  0001 C CNN "Description"
F 10 "1%" H 11050 5300 50  0001 C CNN "Tolerance"
F 11 "1/10W" H 11050 5300 50  0001 C CNN "Wattage"
	1    11050 5300
	0    1    1    0   
$EndComp
Wire Wire Line
	11200 5300 11400 5300
Wire Wire Line
	11400 5300 11400 4900
Wire Wire Line
	11400 4900 11600 4900
Text GLabel 10700 5300 0    50   Input ~ 0
VCHARGE-SETTING
Wire Wire Line
	10700 5300 10900 5300
Wire Wire Line
	12300 5600 12300 4500
Connection ~ 12300 4500
Wire Wire Line
	12300 4500 12700 4500
Text GLabel 11500 5800 0    50   Input ~ 0
IFC-SWITCH
Wire Wire Line
	11500 5800 11800 5800
$Comp
L Device:R R96
U 1 1 5EA52FC7
P 11800 6050
F 0 "R96" H 11869 6004 50  0000 L CNN
F 1 "100k" H 11869 6095 50  0000 L CNN
F 2 "10005011 Power Management:R0603_1" V 11730 6050 50  0001 C CNN
F 3 "https://www.yageo.com/upload/media/product/productsearch/datasheet/rchip/PYu-RC_Group_51_RoHS_L_10.pdf" H 11800 6050 50  0001 C CNN
F 4 "Yageo" H 11800 6050 50  0001 C CNN "Mfgr"
F 5 "RC0603FR-07100KL" H 11800 6050 50  0001 C CNN "Mfgr_PN"
F 6 "Digi-Key" H 11800 6050 50  0001 C CNN "Source"
F 7 "311-100KHRTR-ND" H 11800 6050 50  0001 C CNN "Source_PN"
F 8 "0603" H 11730 5959 50  0001 R CNN "Bom_Footprint"
F 9 "RES SMD 100K OHM 1% 1/10W 0603" H 11800 6050 50  0001 C CNN "Description"
F 10 "1%" H 11800 6050 50  0001 C CNN "Tolerance"
F 11 "1/10W" H 11800 6050 50  0001 C CNN "Wattage"
	1    11800 6050
	-1   0    0    1   
$EndComp
Wire Wire Line
	11800 5800 11800 5900
Connection ~ 11800 5800
Wire Wire Line
	11800 5800 12000 5800
Wire Wire Line
	12300 6000 12300 6300
Wire Wire Line
	11800 6300 11800 6200
$Comp
L 10005011_Power_Management:PGND #PWR0215
U 1 1 5EA65F7F
P 12300 6400
F 0 "#PWR0215" H 12300 6150 50  0001 C CNN
F 1 "PGND" H 12300 6250 50  0000 C CNN
F 2 "" H 12300 6400 50  0001 C CNN
F 3 "" H 12300 6400 50  0001 C CNN
	1    12300 6400
	1    0    0    -1  
$EndComp
Wire Wire Line
	12300 6300 12300 6400
Connection ~ 11600 5400
Wire Wire Line
	11600 5400 12000 5400
Connection ~ 12300 6300
Wire Wire Line
	11800 6300 12300 6300
$Comp
L Device:R R83
U 1 1 5EA8A2F5
P 13250 4100
F 0 "R83" V 13043 4100 50  0000 C CNN
F 1 "10k" V 13134 4100 50  0000 C CNN
F 2 "10005011 Power Management:R0603_1" V 13180 4100 50  0001 C CNN
F 3 "https://www.yageo.com/upload/media/product/productsearch/datasheet/rchip/PYu-RC_Group_51_RoHS_L_10.pdf" H 13250 4100 50  0001 C CNN
F 4 "Yageo" H 13250 4100 50  0001 C CNN "Mfgr"
F 5 "RC0603FR-0710KL" H 13250 4100 50  0001 C CNN "Mfgr_PN"
F 6 "Digi-Key" H 13250 4100 50  0001 C CNN "Source"
F 7 "311-10.0KHRCT-ND" H 13250 4100 50  0001 C CNN "Source_PN"
F 8 "0603" V 13135 4100 50  0001 C CNN "Bom_Footprint"
F 9 "RES SMD 10K OHM 1% 1/10W 0603" H 13250 4100 50  0001 C CNN "Description"
F 10 "1%" H 13250 4100 50  0001 C CNN "Tolerance"
F 11 "1/10W" H 13250 4100 50  0001 C CNN "Wattage"
	1    13250 4100
	0    1    1    0   
$EndComp
$Comp
L Device:R R86
U 1 1 5EA8CA00
P 13600 4450
F 0 "R86" H 13530 4404 50  0000 R CNN
F 1 "10k" H 13530 4495 50  0000 R CNN
F 2 "10005011 Power Management:R0603_1" V 13530 4450 50  0001 C CNN
F 3 "https://www.yageo.com/upload/media/product/productsearch/datasheet/rchip/PYu-RC_Group_51_RoHS_L_10.pdf" H 13600 4450 50  0001 C CNN
F 4 "Yageo" H 13600 4450 50  0001 C CNN "Mfgr"
F 5 "RC0603FR-0710KL" H 13600 4450 50  0001 C CNN "Mfgr_PN"
F 6 "Digi-Key" H 13600 4450 50  0001 C CNN "Source"
F 7 "311-10.0KHRCT-ND" H 13600 4450 50  0001 C CNN "Source_PN"
F 8 "0603" H 13670 4359 50  0001 L CNN "Bom_Footprint"
F 9 "RES SMD 10K OHM 1% 1/10W 0603" H 13600 4450 50  0001 C CNN "Description"
F 10 "1%" H 13600 4450 50  0001 C CNN "Tolerance"
F 11 "1/10W" H 13600 4450 50  0001 C CNN "Wattage"
	1    13600 4450
	-1   0    0    1   
$EndComp
$Comp
L 10005011_Power_Management:2N7002 T28
U 1 1 5EA8FD1C
P 13500 5000
F 0 "T28" H 13706 5046 50  0000 L CNN
F 1 "2N7002" H 13706 4955 50  0000 L CNN
F 2 "10005011 Power Management:SOT23-GSD_1" H 13700 4925 50  0001 L CIN
F 3 "https://www.diodes.com/assets/Datasheets/2N7002AQ.pdf" H 13725 4875 50  0001 L CNN
F 4 "MOSFET N-CH 60V 350MA SOT23" H 14375 4875 50  0001 C CNN "Description"
F 5 "Diodes Incorporated" H 14075 4875 50  0001 C CNN "Mfgr"
F 6 "2N7002AQ-7" H 14000 4900 50  0001 C CNN "Mfgr_PN"
F 7 "Digi-Key" H 14300 5675 50  0001 C CNN "Source"
F 8 "2N7002AQ-7DICT-ND" H 14400 5775 50  0001 C CNN "Source_PN"
F 9 "10022882" H 13500 5000 50  0001 C CNN "Item Number"
	1    13500 5000
	1    0    0    -1  
$EndComp
Text GLabel 13100 5000 0    50   Input ~ 0
CHARGER-SWITCH
Wire Wire Line
	13100 5000 13200 5000
$Comp
L Device:R R94
U 1 1 5EAA0C5D
P 13200 5200
F 0 "R94" H 13131 5246 50  0000 R CNN
F 1 "100k" H 13131 5155 50  0000 R CNN
F 2 "10005011 Power Management:R0603_1" V 13130 5200 50  0001 C CNN
F 3 "https://www.yageo.com/upload/media/product/productsearch/datasheet/rchip/PYu-RC_Group_51_RoHS_L_10.pdf" H 13200 5200 50  0001 C CNN
F 4 "Yageo" H 13200 5200 50  0001 C CNN "Mfgr"
F 5 "RC0603FR-07100KL" H 13200 5200 50  0001 C CNN "Mfgr_PN"
F 6 "Digi-Key" H 13200 5200 50  0001 C CNN "Source"
F 7 "311-100KHRTR-ND" H 13200 5200 50  0001 C CNN "Source_PN"
F 8 "0603" H 13130 5109 50  0001 R CNN "Bom_Footprint"
F 9 "RES SMD 100K OHM 1% 1/10W 0603" H 13200 5200 50  0001 C CNN "Description"
F 10 "1%" H 13200 5200 50  0001 C CNN "Tolerance"
F 11 "1/10W" H 13200 5200 50  0001 C CNN "Wattage"
	1    13200 5200
	1    0    0    -1  
$EndComp
Wire Wire Line
	13200 5000 13200 5050
Connection ~ 13200 5000
Wire Wire Line
	13200 5000 13300 5000
Wire Wire Line
	13200 5350 13200 5400
Wire Wire Line
	13600 5450 13600 5400
$Comp
L power:GND #PWR0216
U 1 1 5EAC8E69
P 13600 5450
F 0 "#PWR0216" H 13600 5200 50  0001 C CNN
F 1 "GND" H 13600 5300 50  0000 C CNN
F 2 "" H 13600 5450 50  0001 C CNN
F 3 "" H 13600 5450 50  0001 C CNN
	1    13600 5450
	1    0    0    -1  
$EndComp
$Comp
L 10005011_Power_Management:SUD50P06-15L-E3 T25
U 1 1 5EACB30D
P 13600 3800
F 0 "T25" V 13942 3800 50  0000 C CNN
F 1 "SUD50P06-15L" V 13851 3800 50  0000 C CNN
F 2 "10005011 Power Management:DPAK-GDS_1" H 13895 3725 50  0001 L CIN
F 3 "http://www.vishay.com/docs/72250/sud50p06.pdf" H 13600 3800 50  0001 C CNN
F 4 "Vishay Siliconix" H 14200 3725 50  0001 C CNN "Mfgr"
F 5 "SUD50P06-15L-E3" H 14275 3725 50  0001 C CNN "Mfgr_PN"
F 6 "Digi-Key" H 14050 3725 50  0001 C CNN "Source"
F 7 "SUD50P06-15L-E3CT-ND" H 14375 3725 50  0001 C CNN "Source_PN"
F 8 "MOSFET P-CH 60V 50A TO252" H 14475 3725 50  0001 C CNN "Description"
F 9 "10022560" H 13600 3800 50  0001 C CNN "Item Number"
	1    13600 3800
	0    -1   -1   0   
$EndComp
$Comp
L 10005011_Power_Management:SUD50P06-15L-E3 T26
U 1 1 5EACE576
P 14350 3800
F 0 "T26" V 14692 3800 50  0000 C CNN
F 1 "SUD50P06-15L" V 14601 3800 50  0000 C CNN
F 2 "10005011 Power Management:DPAK-GDS_1" H 14645 3725 50  0001 L CIN
F 3 "http://www.vishay.com/docs/72250/sud50p06.pdf" H 14350 3800 50  0001 C CNN
F 4 "Vishay Siliconix" H 14950 3725 50  0001 C CNN "Mfgr"
F 5 "SUD50P06-15L-E3" H 15025 3725 50  0001 C CNN "Mfgr_PN"
F 6 "Digi-Key" H 14800 3725 50  0001 C CNN "Source"
F 7 "SUD50P06-15L-E3CT-ND" H 15125 3725 50  0001 C CNN "Source_PN"
F 8 "MOSFET P-CH 60V 50A TO252" H 15225 3725 50  0001 C CNN "Description"
F 9 "10022560" H 14350 3800 50  0001 C CNN "Item Number"
	1    14350 3800
	0    1    -1   0   
$EndComp
Wire Wire Line
	12700 3700 12900 3700
Connection ~ 12700 3700
Wire Wire Line
	13600 4000 13600 4100
Wire Wire Line
	13600 4100 13400 4100
Connection ~ 13600 4100
Wire Wire Line
	13600 4100 13600 4300
Wire Wire Line
	13100 4100 12900 4100
Wire Wire Line
	12900 4100 12900 3700
Connection ~ 12900 3700
Wire Wire Line
	12900 3700 13400 3700
Wire Wire Line
	13600 4600 13600 4800
$Comp
L 10005011_Power_Management:2N7002 T30
U 1 1 5EB05587
P 14250 5800
F 0 "T30" H 14456 5846 50  0000 L CNN
F 1 "2N7002" H 14456 5755 50  0000 L CNN
F 2 "10005011 Power Management:SOT23-GSD_1" H 14450 5725 50  0001 L CIN
F 3 "https://www.diodes.com/assets/Datasheets/2N7002AQ.pdf" H 14475 5675 50  0001 L CNN
F 4 "MOSFET N-CH 60V 350MA SOT23" H 15125 5675 50  0001 C CNN "Description"
F 5 "Diodes Incorporated" H 14825 5675 50  0001 C CNN "Mfgr"
F 6 "2N7002AQ-7" H 14750 5700 50  0001 C CNN "Mfgr_PN"
F 7 "Digi-Key" H 15050 6475 50  0001 C CNN "Source"
F 8 "2N7002AQ-7DICT-ND" H 15150 6575 50  0001 C CNN "Source_PN"
F 9 "10022882" H 14250 5800 50  0001 C CNN "Item Number"
	1    14250 5800
	1    0    0    -1  
$EndComp
Text GLabel 13700 5800 0    50   Input ~ 0
SHUNT-DIODE-CH
Wire Wire Line
	13700 5800 13800 5800
$Comp
L Device:R R97
U 1 1 5EB05597
P 13800 6050
F 0 "R97" H 13869 6004 50  0000 L CNN
F 1 "100k" H 13869 6095 50  0000 L CNN
F 2 "10005011 Power Management:R0603_1" V 13730 6050 50  0001 C CNN
F 3 "https://www.yageo.com/upload/media/product/productsearch/datasheet/rchip/PYu-RC_Group_51_RoHS_L_10.pdf" H 13800 6050 50  0001 C CNN
F 4 "Yageo" H 13800 6050 50  0001 C CNN "Mfgr"
F 5 "RC0603FR-07100KL" H 13800 6050 50  0001 C CNN "Mfgr_PN"
F 6 "Digi-Key" H 13800 6050 50  0001 C CNN "Source"
F 7 "311-100KHRTR-ND" H 13800 6050 50  0001 C CNN "Source_PN"
F 8 "0603" H 13730 5959 50  0001 R CNN "Bom_Footprint"
F 9 "RES SMD 100K OHM 1% 1/10W 0603" H 13800 6050 50  0001 C CNN "Description"
F 10 "1%" H 13800 6050 50  0001 C CNN "Tolerance"
F 11 "1/10W" H 13800 6050 50  0001 C CNN "Wattage"
	1    13800 6050
	-1   0    0    1   
$EndComp
Wire Wire Line
	13800 5800 13800 5900
Connection ~ 13800 5800
Wire Wire Line
	13800 5800 14050 5800
Wire Wire Line
	13800 6200 13800 6300
Wire Wire Line
	13800 6300 14350 6300
Wire Wire Line
	14350 6300 14350 6000
Wire Wire Line
	14350 6300 14350 6400
Connection ~ 14350 6300
$Comp
L power:GND #PWR0217
U 1 1 5EB055A5
P 14350 6400
F 0 "#PWR0217" H 14350 6150 50  0001 C CNN
F 1 "GND" H 14350 6250 50  0000 C CNN
F 2 "" H 14350 6400 50  0001 C CNN
F 3 "" H 14350 6400 50  0001 C CNN
	1    14350 6400
	1    0    0    -1  
$EndComp
Connection ~ 13600 5400
Wire Wire Line
	13600 5400 13600 5200
$Comp
L Device:R R89
U 1 1 5EB40CCA
P 14350 4650
F 0 "R89" H 14280 4604 50  0000 R CNN
F 1 "10k" H 14280 4695 50  0000 R CNN
F 2 "10005011 Power Management:R0603_1" V 14280 4650 50  0001 C CNN
F 3 "https://www.yageo.com/upload/media/product/productsearch/datasheet/rchip/PYu-RC_Group_51_RoHS_L_10.pdf" H 14350 4650 50  0001 C CNN
F 4 "Yageo" H 14350 4650 50  0001 C CNN "Mfgr"
F 5 "RC0603FR-0710KL" H 14350 4650 50  0001 C CNN "Mfgr_PN"
F 6 "Digi-Key" H 14350 4650 50  0001 C CNN "Source"
F 7 "311-10.0KHRCT-ND" H 14350 4650 50  0001 C CNN "Source_PN"
F 8 "0603" H 14420 4559 50  0001 L CNN "Bom_Footprint"
F 9 "RES SMD 10K OHM 1% 1/10W 0603" H 14350 4650 50  0001 C CNN "Description"
F 10 "1%" H 14350 4650 50  0001 C CNN "Tolerance"
F 11 "1/10W" H 14350 4650 50  0001 C CNN "Wattage"
	1    14350 4650
	-1   0    0    1   
$EndComp
Wire Wire Line
	13800 3700 14150 3700
Wire Wire Line
	14350 5600 14350 4800
Wire Wire Line
	14350 4500 14350 4400
$Comp
L Device:R R84
U 1 1 5EB60E3E
P 14750 4150
F 0 "R84" H 14680 4059 50  0000 R CNN
F 1 "10k" H 14680 4150 50  0000 R CNN
F 2 "10005011 Power Management:R0603_1" V 14680 4150 50  0001 C CNN
F 3 "https://www.yageo.com/upload/media/product/productsearch/datasheet/rchip/PYu-RC_Group_51_RoHS_L_10.pdf" H 14750 4150 50  0001 C CNN
F 4 "Yageo" H 14750 4150 50  0001 C CNN "Mfgr"
F 5 "RC0603FR-0710KL" H 14750 4150 50  0001 C CNN "Mfgr_PN"
F 6 "Digi-Key" H 14750 4150 50  0001 C CNN "Source"
F 7 "311-10.0KHRCT-ND" H 14750 4150 50  0001 C CNN "Source_PN"
F 8 "0603" H 14680 4241 50  0000 R CNN "Bom_Footprint"
F 9 "RES SMD 10K OHM 1% 1/10W 0603" H 14750 4150 50  0001 C CNN "Description"
F 10 "1%" H 14750 4150 50  0001 C CNN "Tolerance"
F 11 "1/10W" H 14750 4150 50  0001 C CNN "Wattage"
	1    14750 4150
	-1   0    0    1   
$EndComp
Wire Wire Line
	14550 3700 14750 3700
Wire Wire Line
	14750 3700 14750 4000
Wire Wire Line
	14750 4300 14750 4400
Wire Wire Line
	14750 4400 14350 4400
Connection ~ 14350 4400
Wire Wire Line
	14350 4400 14350 4000
Text GLabel 14950 3700 2    50   Output ~ 0
I-CHARGE
Wire Wire Line
	14950 3700 14750 3700
Connection ~ 14750 3700
Wire Wire Line
	1850 4600 1600 4600
Wire Wire Line
	3100 4900 3100 5000
Wire Wire Line
	3100 5000 3000 5000
$Comp
L Device:C C78
U 1 1 5E9F2BD7
P 1000 4650
F 0 "C78" H 1114 4513 50  0000 L CNN
F 1 "100nF" H 1114 4604 50  0000 L CNN
F 2 "10005011 Power Management:C0402_1" H 1038 4500 50  0001 C CNN
F 3 "https://psearch.en.murata.com/capacitor/product/GCM155R71C104KA55%23.pdf" H 1000 4650 50  0001 C CNN
F 4 "Murata Electronics" H 1000 4650 50  0001 C CNN "Mfgr"
F 5 "GCM155R71C104KA55J" H 1000 4650 50  0001 C CNN "Mfgr_PN"
F 6 "Digi-Key" H 1000 4650 50  0001 C CNN "Source"
F 7 "490-7998-1-ND" H 1000 4650 50  0001 C CNN "Source_PN"
F 8 "" H 1114 4695 50  0000 L CNN "Bom_Footprint"
F 9 "CAPACITOR,100NF,16V,+/-10%,X7R,0402" H 1000 4650 50  0001 C CNN "Description"
F 10 "X7R" H 1000 4650 50  0001 C CNN "Dielectric"
F 11 "16V" H 1114 4786 50  0000 L CNN "Voltage"
F 12 "10022607" H 1000 4650 50  0001 C CNN "Item Number"
F 13 "MURATA" H 1000 4650 50  0001 C CNN "Manufacturer"
F 14 "GRM155R71C104JA88J" H 1000 4650 50  0001 C CNN "Manufacturer_No"
	1    1000 4650
	-1   0    0    1   
$EndComp
$Comp
L Device:C C75
U 1 1 5EA0AA5D
P 1600 4450
F 0 "C75" H 1485 4313 50  0000 R CNN
F 1 "100nF" H 1485 4404 50  0000 R CNN
F 2 "10005011 Power Management:C0402_1" H 1638 4300 50  0001 C CNN
F 3 "https://psearch.en.murata.com/capacitor/product/GCM155R71C104KA55%23.pdf" H 1600 4450 50  0001 C CNN
F 4 "Murata Electronics" H 1600 4450 50  0001 C CNN "Mfgr"
F 5 "GCM155R71C104KA55J" H 1600 4450 50  0001 C CNN "Mfgr_PN"
F 6 "Digi-Key" H 1600 4450 50  0001 C CNN "Source"
F 7 "490-7998-1-ND" H 1600 4450 50  0001 C CNN "Source_PN"
F 8 "" H 1485 4495 50  0000 R CNN "Bom_Footprint"
F 9 "CAPACITOR,100NF,16V,+/-10%,X7R,0402" H 1600 4450 50  0001 C CNN "Description"
F 10 "X7R" H 1600 4450 50  0001 C CNN "Dielectric"
F 11 "16V" H 1485 4586 50  0000 R CNN "Voltage"
F 12 "10022607" H 1600 4450 50  0001 C CNN "Item Number"
F 13 "MURATA" H 1600 4450 50  0001 C CNN "Manufacturer"
F 14 "GRM155R71C104JA88J" H 1600 4450 50  0001 C CNN "Manufacturer_No"
	1    1600 4450
	-1   0    0    1   
$EndComp
$Comp
L Device:C C71
U 1 1 5EA0B23F
P 2450 4100
F 0 "C71" V 2884 4100 50  0000 C CNN
F 1 "100nF" V 2793 4100 50  0000 C CNN
F 2 "10005011 Power Management:C0402_1" H 2488 3950 50  0001 C CNN
F 3 "https://psearch.en.murata.com/capacitor/product/GCM155R71C104KA55%23.pdf" H 2450 4100 50  0001 C CNN
F 4 "Murata Electronics" H 2450 4100 50  0001 C CNN "Mfgr"
F 5 "GCM155R71C104KA55J" H 2450 4100 50  0001 C CNN "Mfgr_PN"
F 6 "Digi-Key" H 2450 4100 50  0001 C CNN "Source"
F 7 "490-7998-1-ND" H 2450 4100 50  0001 C CNN "Source_PN"
F 8 "" V 2702 4100 50  0000 C CNN "Bom_Footprint"
F 9 "CAPACITOR,100NF,16V,+/-10%,X7R,0402" H 2450 4100 50  0001 C CNN "Description"
F 10 "X7R" H 2450 4100 50  0001 C CNN "Dielectric"
F 11 "16V" V 2611 4100 50  0000 C CNN "Voltage"
F 12 "10022607" H 2450 4100 50  0001 C CNN "Item Number"
F 13 "MURATA" H 2450 4100 50  0001 C CNN "Manufacturer"
F 14 "GRM155R71C104JA88J" H 2450 4100 50  0001 C CNN "Manufacturer_No"
	1    2450 4100
	0    -1   -1   0   
$EndComp
$Comp
L Device:C C83
U 1 1 5EA10664
P 2450 5500
F 0 "C83" V 2290 5500 50  0000 C CNN
F 1 "0.01uF" V 2199 5500 50  0000 C CNN
F 2 "10005011 Power Management:C0603_1" H 2488 5350 50  0001 C CNN
F 3 "https://www.yageo.com/upload/media/product/productsearch/datasheet/mlcc/UPY-GPHC_X7R_6.3V-to-50V_18.pdf" H 2450 5500 50  0001 C CNN
F 4 "Yageo" H 2450 5500 50  0001 C CNN "Mfgr"
F 5 "CC0603KRX7R9BB103" H 2450 5500 50  0001 C CNN "Mfgr_PN"
F 6 "Digi-Key" H 2450 5500 50  0001 C CNN "Source"
F 7 "311-1085-1-ND" H 2450 5500 50  0001 C CNN "Source_PN"
F 8 "0603" V 2108 5500 50  0000 C CNN "Bom_Footprint"
F 9 "CAP CER 10000PF 50V X7R 0603" H 2450 5500 50  0001 C CNN "Description"
F 10 "X7R" H 2450 5500 50  0001 C CNN "Dielectric"
F 11 "50V" H 2450 5500 50  0001 C CNN "Voltage"
	1    2450 5500
	0    -1   -1   0   
$EndComp
$Comp
L Device:C C66
U 1 1 5EA3A154
P 1300 3350
F 0 "C66" H 1415 3259 50  0000 L CNN
F 1 "10uF" H 1415 3350 50  0000 L CNN
F 2 "10005011 Power Management:C2220_1" H 1338 3200 50  0001 C CNN
F 3 "https://product.tdk.com/info/en/catalog/datasheets/mlcc_automotive_general_en.pdf?ref_disty=digikey" H 1300 3350 50  0001 C CNN
F 4 "TDK Corporation" H 1300 3350 50  0001 C CNN "Mfgr"
F 5 "CGA9N3X7R1H106K230KB" H 1300 3350 50  0001 C CNN "Mfgr_PN"
F 6 "Digi-Key" H 1300 3350 50  0001 C CNN "Source"
F 7 "445-7932-1-ND" H 1300 3350 50  0001 C CNN "Source_PN"
F 8 "" H 1415 3441 50  0000 L CNN "Bom_Footprint"
F 9 "CAPACITOR CERAMIC, 10UF,+/-10%,50V" H 1300 3350 50  0001 C CNN "Description"
F 10 "X7R" H 1300 3350 50  0001 C CNN "Dielectric"
F 11 "50V" H 1300 3350 50  0001 C CNN "Voltage"
F 12 "10039581" H 1300 3350 50  0001 C CNN "Item Number"
F 13 "AVX" H 1300 3350 50  0001 C CNN "Manufacturer"
F 14 "22205C106K4Z4A" H 1300 3350 50  0001 C CNN "Manufacturer_No"
	1    1300 3350
	-1   0    0    1   
$EndComp
$Comp
L Device:C C67
U 1 1 5EA3E4AC
P 1700 3350
F 0 "C67" H 1585 3259 50  0000 R CNN
F 1 "10uF" H 1585 3350 50  0000 R CNN
F 2 "10005011 Power Management:C2220_1" H 1738 3200 50  0001 C CNN
F 3 "https://product.tdk.com/info/en/catalog/datasheets/mlcc_automotive_general_en.pdf?ref_disty=digikey" H 1700 3350 50  0001 C CNN
F 4 "TDK Corporation" H 1700 3350 50  0001 C CNN "Mfgr"
F 5 "CGA9N3X7R1H106K230KB" H 1700 3350 50  0001 C CNN "Mfgr_PN"
F 6 "Digi-Key" H 1700 3350 50  0001 C CNN "Source"
F 7 "445-7932-1-ND" H 1700 3350 50  0001 C CNN "Source_PN"
F 8 "" H 1585 3441 50  0000 R CNN "Bom_Footprint"
F 9 "CAPACITOR CERAMIC, 10UF,+/-10%,50V" H 1700 3350 50  0001 C CNN "Description"
F 10 "X7R" H 1700 3350 50  0001 C CNN "Dielectric"
F 11 "50V" H 1700 3350 50  0001 C CNN "Voltage"
F 12 "10039581" H 1700 3350 50  0001 C CNN "Item Number"
F 13 "AVX" H 1700 3350 50  0001 C CNN "Manufacturer"
F 14 "22205C106K4Z4A" H 1700 3350 50  0001 C CNN "Manufacturer_No"
	1    1700 3350
	-1   0    0    1   
$EndComp
$Comp
L Device:C C11
U 1 1 5EA3EBA0
P 2100 3350
F 0 "C11" H 1985 3259 50  0000 R CNN
F 1 "10uF" H 1985 3350 50  0000 R CNN
F 2 "10005011 Power Management:C2220_1" H 2138 3200 50  0001 C CNN
F 3 "https://product.tdk.com/info/en/catalog/datasheets/mlcc_automotive_general_en.pdf?ref_disty=digikey" H 2100 3350 50  0001 C CNN
F 4 "TDK Corporation" H 2100 3350 50  0001 C CNN "Mfgr"
F 5 "CGA9N3X7R1H106K230KB" H 2100 3350 50  0001 C CNN "Mfgr_PN"
F 6 "Digi-Key" H 2100 3350 50  0001 C CNN "Source"
F 7 "445-7932-1-ND" H 2100 3350 50  0001 C CNN "Source_PN"
F 8 "" H 1985 3441 50  0000 R CNN "Bom_Footprint"
F 9 "CAPACITOR CERAMIC, 10UF,+/-10%,50V" H 2100 3350 50  0001 C CNN "Description"
F 10 "X7R" H 2100 3350 50  0001 C CNN "Dielectric"
F 11 "50V" H 2100 3350 50  0001 C CNN "Voltage"
F 12 "10039581" H 2100 3350 50  0001 C CNN "Item Number"
F 13 "AVX" H 2100 3350 50  0001 C CNN "Manufacturer"
F 14 "22205C106K4Z4A" H 2100 3350 50  0001 C CNN "Manufacturer_No"
	1    2100 3350
	-1   0    0    1   
$EndComp
$Comp
L Device:C C20
U 1 1 5EA3F14D
P 2500 3350
F 0 "C20" H 2385 3259 50  0000 R CNN
F 1 "10uF" H 2385 3350 50  0000 R CNN
F 2 "10005011 Power Management:C2220_1" H 2538 3200 50  0001 C CNN
F 3 "https://product.tdk.com/info/en/catalog/datasheets/mlcc_automotive_general_en.pdf?ref_disty=digikey" H 2500 3350 50  0001 C CNN
F 4 "TDK Corporation" H 2500 3350 50  0001 C CNN "Mfgr"
F 5 "CGA9N3X7R1H106K230KB" H 2500 3350 50  0001 C CNN "Mfgr_PN"
F 6 "Digi-Key" H 2500 3350 50  0001 C CNN "Source"
F 7 "445-7932-1-ND" H 2500 3350 50  0001 C CNN "Source_PN"
F 8 "" H 2385 3441 50  0000 R CNN "Bom_Footprint"
F 9 "CAPACITOR CERAMIC, 10UF,+/-10%,50V" H 2500 3350 50  0001 C CNN "Description"
F 10 "X7R" H 2500 3350 50  0001 C CNN "Dielectric"
F 11 "50V" H 2500 3350 50  0001 C CNN "Voltage"
F 12 "10039581" H 2500 3350 50  0001 C CNN "Item Number"
F 13 "AVX" H 2500 3350 50  0001 C CNN "Manufacturer"
F 14 "22205C106K4Z4A" H 2500 3350 50  0001 C CNN "Manufacturer_No"
	1    2500 3350
	-1   0    0    1   
$EndComp
$Comp
L Device:C C21
U 1 1 5EA448DF
P 2900 3350
F 0 "C21" H 2785 3259 50  0000 R CNN
F 1 "4.7uF" H 2785 3350 50  0000 R CNN
F 2 "10005011 Power Management:C1210_1" H 2938 3200 50  0001 C CNN
F 3 "https://api.kemet.com/component-edge/download/specsheet/C1210C475K5RACAUTO.pdf" H 2900 3350 50  0001 C CNN
F 4 "KEMET" H 2900 3350 50  0001 C CNN "Mfgr"
F 5 "C1210C475K5RACAUTO" H 2900 3350 50  0001 C CNN "Mfgr_PN"
F 6 "Digi-Key" H 2900 3350 50  0001 C CNN "Source"
F 7 "399-7049-1-ND" H 2900 3350 50  0001 C CNN "Source_PN"
F 8 "1210" H 2785 3441 50  0000 R CNN "Bom_Footprint"
F 9 "CAP CER 4.7UF 50V X7R 1210" H 2900 3350 50  0001 C CNN "Description"
F 10 "X7R" H 2900 3350 50  0001 C CNN "Dielectric"
F 11 "50V" H 2900 3350 50  0001 C CNN "Voltage"
	1    2900 3350
	-1   0    0    1   
$EndComp
$Comp
L Device:C C69
U 1 1 5EAD94FD
P 4700 3650
F 0 "C69" H 4815 3787 50  0000 L CNN
F 1 "100nF" H 4815 3696 50  0000 L CNN
F 2 "10005011 Power Management:C0402_1" H 4738 3500 50  0001 C CNN
F 3 "https://psearch.en.murata.com/capacitor/product/GCM155R71C104KA55%23.pdf" H 4700 3650 50  0001 C CNN
F 4 "Murata Electronics" H 4700 3650 50  0001 C CNN "Mfgr"
F 5 "GCM155R71C104KA55J" H 4700 3650 50  0001 C CNN "Mfgr_PN"
F 6 "Digi-Key" H 4700 3650 50  0001 C CNN "Source"
F 7 "490-7998-1-ND" H 4700 3650 50  0001 C CNN "Source_PN"
F 8 "" H 4815 3605 50  0000 L CNN "Bom_Footprint"
F 9 "CAPACITOR,100NF,16V,+/-10%,X7R,0402" H 4700 3650 50  0001 C CNN "Description"
F 10 "X7R" H 4700 3650 50  0001 C CNN "Dielectric"
F 11 "16V" H 4815 3514 50  0000 L CNN "Voltage"
F 12 "10022607" H 4700 3650 50  0001 C CNN "Item Number"
F 13 "MURATA" H 4700 3650 50  0001 C CNN "Manufacturer"
F 14 "GRM155R71C104JA88J" H 4700 3650 50  0001 C CNN "Manufacturer_No"
	1    4700 3650
	1    0    0    -1  
$EndComp
$Comp
L Device:C C68
U 1 1 5EB00C9C
P 5100 3650
F 0 "C68" H 4985 3559 50  0000 R CNN
F 1 "56pF" H 4985 3650 50  0000 R CNN
F 2 "10005011 Power Management:C0603_1" H 5138 3500 50  0001 C CNN
F 3 "https://www.yageo.com/upload/media/product/productsearch/datasheet/mlcc/UPY-GP_NP0_16V-to-50V_18.pdf" H 5100 3650 50  0001 C CNN
F 4 "Yageo" H 5100 3650 50  0001 C CNN "Mfgr"
F 5 "CC0603JRNPO9BN560" H 5100 3650 50  0001 C CNN "Mfgr_PN"
F 6 "Digi-Key" H 5100 3650 50  0001 C CNN "Source"
F 7 "311-1066-1-ND" H 5100 3650 50  0001 C CNN "Source_PN"
F 8 "0603" H 4985 3741 50  0000 R CNN "Bom_Footprint"
F 9 "CAP CER 56PF 50V C0G/NPO 0603" H 5100 3650 50  0001 C CNN "Description"
F 10 "C0G/NPO" H 5100 3650 50  0001 C CNN "Dielectric"
F 11 "50V" H 5100 3650 50  0001 C CNN "Voltage"
	1    5100 3650
	-1   0    0    1   
$EndComp
$Comp
L Device:C C77
U 1 1 5EB08BA4
P 4200 5150
F 0 "C77" H 4315 5241 50  0000 L CNN
F 1 "100pF" H 4315 5150 50  0000 L CNN
F 2 "10005011 Power Management:C0402_1" H 4238 5000 50  0001 C CNN
F 3 "http://www.samsungsem.com/kr/support/product-search/mlcc/CL10C101JB81PNC.jsp" H 4200 5150 50  0001 C CNN
F 4 "YAGEO/PHYCOMP" H 4200 5150 50  0001 C CNN "Mfgr"
F 5 "CC0402JRNPO9BN101" H 4200 5150 50  0001 C CNN "Mfgr_PN"
F 6 "CAPACITOR,100PF,50V,+/-5%,C0G,0402" H 4200 5150 50  0001 C CNN "Description"
F 7 "10022629" H 4200 5150 50  0001 C CNN "Item Number"
	1    4200 5150
	1    0    0    -1  
$EndComp
$Comp
L Device:C C74
U 1 1 5EB59912
P 4000 4550
F 0 "C74" H 3885 4459 50  0000 R CNN
F 1 "1000pF" H 3885 4550 50  0000 R CNN
F 2 "10005011 Power Management:C0603_1" H 4038 4400 50  0001 C CNN
F 3 "http://datasheets.avx.com/X7RDielectric.pdf" H 4000 4550 50  0001 C CNN
F 4 "AVX Corporation" H 4000 4550 50  0001 C CNN "Mfgr"
F 5 "06035C102KAT2A" H 4000 4550 50  0001 C CNN "Mfgr_PN"
F 6 "Digi-Key" H 4000 4550 50  0001 C CNN "Source"
F 7 "478-1215-1-ND" H 4000 4550 50  0001 C CNN "Source_PN"
F 8 "0603" H 3885 4641 50  0000 R CNN "Bom_Footprint"
F 9 "CAP CER 1000PF 50V X7R 0603" H 4000 4550 50  0001 C CNN "Description"
F 10 "X7R" H 4000 4550 50  0001 C CNN "Dielectric"
F 11 "50V" H 4000 4550 50  0001 C CNN "Voltage"
	1    4000 4550
	-1   0    0    1   
$EndComp
$Comp
L Device:C C72
U 1 1 5EB5EC13
P 4350 4300
F 0 "C72" V 3900 4300 50  0000 C CNN
F 1 "0.033uF" V 4000 4300 50  0000 C CNN
F 2 "10005011 Power Management:C0603_1" H 4388 4150 50  0001 C CNN
F 3 "http://datasheets.avx.com/X7RDielectric.pdf" H 4350 4300 50  0001 C CNN
F 4 "AVX Corporation" H 4350 4300 50  0001 C CNN "Mfgr"
F 5 "0603YC333KAT2A" H 4350 4300 50  0001 C CNN "Mfgr_PN"
F 6 "Digi-Key" H 4350 4300 50  0001 C CNN "Source"
F 7 "478-5898-1-ND" H 4350 4300 50  0001 C CNN "Source_PN"
F 8 "0603" V 4100 4300 50  0000 C CNN "Bom_Footprint"
F 9 "CAP CER 0.033UF 16V X7R 0603" H 4350 4300 50  0001 C CNN "Description"
F 10 "X7R" H 4350 4300 50  0001 C CNN "Dielectric"
F 11 "16V" V 4200 4300 50  0000 C CNN "Voltage"
	1    4350 4300
	0    1    1    0   
$EndComp
$Comp
L Device:C C79
U 1 1 5EB6AE6E
P 7000 3350
F 0 "C79" H 6885 3259 50  0000 R CNN
F 1 "100nF" H 6885 3350 50  0000 R CNN
F 2 "10005011 Power Management:C0805_1" H 7038 3200 50  0001 C CNN
F 3 "https://psearch.en.murata.com/capacitor/product/GCM155R71C104KA55%23.pdf" H 7000 3350 50  0001 C CNN
F 4 "Murata Electronics" H 7000 3350 50  0001 C CNN "Mfgr"
F 5 "GCM155R71C104KA55J" H 7000 3350 50  0001 C CNN "Mfgr_PN"
F 6 "Digi-Key" H 7000 3350 50  0001 C CNN "Source"
F 7 "490-7998-1-ND" H 7000 3350 50  0001 C CNN "Source_PN"
F 8 "" H 7114 3395 50  0000 L CNN "Bom_Footprint"
F 9 "CAPACITOR CERAMIC, 100NF, +/-10%, 50V, X7R,0805" H 7000 3350 50  0001 C CNN "Description"
F 10 "X7R" H 7000 3350 50  0001 C CNN "Dielectric"
F 11 "16V" H 6885 3441 50  0000 R CNN "Voltage"
F 12 "10022135" H 7000 3350 50  0001 C CNN "Item Number"
	1    7000 3350
	-1   0    0    1   
$EndComp
$Comp
L Device:C C80
U 1 1 5EB72966
P 7300 5250
F 0 "C80" H 7185 5159 50  0000 R CNN
F 1 "4.7uF" H 7185 5250 50  0000 R CNN
F 2 "10005011 Power Management:C0805_1" H 7338 5100 50  0001 C CNN
F 3 "https://api.kemet.com/component-edge/download/specsheet/C1210C475K5RACAUTO.pdf" H 7300 5250 50  0001 C CNN
F 4 "AVX_RMS1" H 7300 5250 50  0001 C CNN "Mfgr"
F 5 "0805YD475KAT2A" H 7300 5250 50  0001 C CNN "Mfgr_PN"
F 6 "CAPACITOR,4.7UF,+/-10%,16V, X5R, 0805" H 7300 5250 50  0001 C CNN "Description"
F 7 "10022616" H 7300 5250 50  0001 C CNN "Item Number"
	1    7300 5250
	-1   0    0    1   
$EndComp
$Comp
L Device:C C70
U 1 1 5EB79AA8
P 7650 3900
F 0 "C70" V 7300 3900 50  0000 C CNN
F 1 "100nF" V 7400 3900 50  0000 C CNN
F 2 "10005011 Power Management:C0805_1" H 7688 3750 50  0001 C CNN
F 3 "https://psearch.en.murata.com/capacitor/product/GCM155R71C104KA55%23.pdf" H 7650 3900 50  0001 C CNN
F 4 "Murata Electronics" H 7650 3900 50  0001 C CNN "Mfgr"
F 5 "GCM155R71C104KA55J" H 7650 3900 50  0001 C CNN "Mfgr_PN"
F 6 "Digi-Key" H 7650 3900 50  0001 C CNN "Source"
F 7 "490-7998-1-ND" H 7650 3900 50  0001 C CNN "Source_PN"
F 8 "" V 7400 3900 50  0000 C CNN "Bom_Footprint"
F 9 "CAPACITOR CERAMIC, 100NF, +/-10%, 50V, X7R,0805" H 7650 3900 50  0001 C CNN "Description"
F 10 "X7R" H 7650 3900 50  0001 C CNN "Dielectric"
F 11 "16V" V 7500 3900 50  0000 C CNN "Voltage"
F 12 "10022135" V 7650 3900 50  0001 C CNN "Item Number"
	1    7650 3900
	0    1    1    0   
$EndComp
$Comp
L Device:C C76
U 1 1 5EB893B9
P 8150 4500
F 0 "C76" V 7716 4500 50  0000 C CNN
F 1 "0.33uF" V 7807 4500 50  0000 C CNN
F 2 "10005011 Power Management:C0805_1" H 8188 4350 50  0001 C CNN
F 3 "https://www.yageo.com/upload/media/product/productsearch/datasheet/mlcc/UPY-GPHC_X7R_6.3V-to-50V_18.pdf" H 8150 4500 50  0001 C CNN
F 4 "Yageo" H 8150 4500 50  0001 C CNN "Mfgr"
F 5 "CC0805JKX7R7BB334" H 8150 4500 50  0001 C CNN "Mfgr_PN"
F 6 "Digi-Key" H 8150 4500 50  0001 C CNN "Source"
F 7 "311-4215-1-ND" H 8150 4500 50  0001 C CNN "Source_PN"
F 8 "0805" V 7898 4500 50  0000 C CNN "Bom_Footprint"
F 9 "CAP CER 0.33UF 16V X7R 0805" H 8150 4500 50  0001 C CNN "Description"
F 10 "X7R" H 8150 4500 50  0001 C CNN "Dielectric"
F 11 "16V" V 7989 4500 50  0000 C CNN "Voltage"
	1    8150 4500
	0    1    1    0   
$EndComp
$Comp
L Device:C C84
U 1 1 5EB949C7
P 11600 5150
F 0 "C84" H 11715 5332 50  0000 L CNN
F 1 "1uF" H 11715 5241 50  0000 L CNN
F 2 "10005011 Power Management:C0603_1" H 11638 5000 50  0001 C CNN
F 3 "https://api.kemet.com/component-edge/download/datasheet/C0603C105K9PACTU.pdf" H 11600 5150 50  0001 C CNN
F 4 "KEMET" H 11600 5150 50  0001 C CNN "Mfgr"
F 5 "C0603C105K9PACTU" H 11600 5150 50  0001 C CNN "Mfgr_PN"
F 6 "Digi-Key" H 11600 5150 50  0001 C CNN "Source"
F 7 "399-7848-1-ND" H 11600 5150 50  0001 C CNN "Source_PN"
F 8 "0603" H 11715 5150 50  0000 L CNN "Bom_Footprint"
F 9 "CAP CER 1UF 6.3V X5R 0603" H 11600 5150 50  0001 C CNN "Description"
F 10 "X5R" H 11715 5059 50  0000 L CNN "Dielectric"
F 11 "6.3V" H 11715 4968 50  0000 L CNN "Voltage"
	1    11600 5150
	1    0    0    -1  
$EndComp
$Comp
L 10005011_Power_Management:PMEG4005ET D9
U 1 1 5EA0347E
P 7650 4500
F 0 "D9" H 7650 4600 50  0000 C CNN
F 1 "PMEG4005ET" H 7650 4400 50  0000 C CNN
F 2 "10005011 Power Management:SOT23-1G_1" H 7650 4325 50  0001 C CNN
F 3 "https://assets.nexperia.com/documents/data-sheet/PMEGXX05ET_SER.pdf" H 7650 4500 50  0001 C CNN
F 4 "DIODE SCHOTTKY, 40V, 500MA" H 7650 4500 50  0001 C CNN "Description"
F 5 "10039586" H 7650 4500 50  0001 C CNN "Item Number"
F 6 "PHILIPS" H 7650 4500 50  0001 C CNN "Manufacturer"
F 7 "PMEG4005ET" H 7650 4500 50  0001 C CNN "Manufacturer_No"
	1    7650 4500
	1    0    0    -1  
$EndComp
Connection ~ 9400 3900
Connection ~ 9700 3900
$Comp
L Device:C C90
U 1 1 5EA78ACA
P 10700 4150
F 0 "C90" H 10815 4241 50  0000 L CNN
F 1 "4.7uF" H 10815 4150 50  0000 L CNN
F 2 "10005011 Power Management:C1210_1" H 10738 4000 50  0001 C CNN
F 3 "https://api.kemet.com/component-edge/download/specsheet/C1210C475K5RACAUTO.pdf" H 10700 4150 50  0001 C CNN
F 4 "KEMET" H 10700 4150 50  0001 C CNN "Mfgr"
F 5 "C1210C475K5RACAUTO" H 10700 4150 50  0001 C CNN "Mfgr_PN"
F 6 "Digi-Key" H 10700 4150 50  0001 C CNN "Source"
F 7 "399-7049-1-ND" H 10700 4150 50  0001 C CNN "Source_PN"
F 8 "1210" H 10815 4059 50  0000 L CNN "Bom_Footprint"
F 9 "CAP CER 4.7UF 50V X7R 1210" H 10700 4150 50  0001 C CNN "Description"
F 10 "X7R" H 10700 4150 50  0001 C CNN "Dielectric"
F 11 "50V" H 10700 4150 50  0001 C CNN "Voltage"
	1    10700 4150
	1    0    0    -1  
$EndComp
$Comp
L Device:C C51
U 1 1 5EA78ABC
P 10300 4150
F 0 "C51" H 10415 4241 50  0000 L CNN
F 1 "10uF" H 10415 4150 50  0000 L CNN
F 2 "10005011 Power Management:C2220_1" H 10338 4000 50  0001 C CNN
F 3 "https://product.tdk.com/info/en/catalog/datasheets/mlcc_automotive_general_en.pdf?ref_disty=digikey" H 10300 4150 50  0001 C CNN
F 4 "TDK Corporation" H 10300 4150 50  0001 C CNN "Mfgr"
F 5 "CGA9N3X7R1H106K230KB" H 10300 4150 50  0001 C CNN "Mfgr_PN"
F 6 "Digi-Key" H 10300 4150 50  0001 C CNN "Source"
F 7 "445-7932-1-ND" H 10300 4150 50  0001 C CNN "Source_PN"
F 8 "" H 10415 4059 50  0000 L CNN "Bom_Footprint"
F 9 "CAPACITOR CERAMIC, 10UF,+/-10%,50V" H 10300 4150 50  0001 C CNN "Description"
F 10 "X7R" H 10300 4150 50  0001 C CNN "Dielectric"
F 11 "50V" H 10300 4150 50  0001 C CNN "Voltage"
F 12 "10039581" H 10300 4150 50  0001 C CNN "Item Number"
F 13 "AVX" H 10300 4150 50  0001 C CNN "Manufacturer"
F 14 "22205C106K4Z4A" H 10300 4150 50  0001 C CNN "Manufacturer_No"
	1    10300 4150
	1    0    0    -1  
$EndComp
$Comp
L Device:C C73
U 1 1 5EA78AAE
P 9900 4150
F 0 "C73" H 9785 4241 50  0000 R CNN
F 1 "10uF" H 9785 4150 50  0000 R CNN
F 2 "10005011 Power Management:C2220_1" H 9938 4000 50  0001 C CNN
F 3 "https://product.tdk.com/info/en/catalog/datasheets/mlcc_automotive_general_en.pdf?ref_disty=digikey" H 9900 4150 50  0001 C CNN
F 4 "TDK Corporation" H 9900 4150 50  0001 C CNN "Mfgr"
F 5 "CGA9N3X7R1H106K230KB" H 9900 4150 50  0001 C CNN "Mfgr_PN"
F 6 "Digi-Key" H 9900 4150 50  0001 C CNN "Source"
F 7 "445-7932-1-ND" H 9900 4150 50  0001 C CNN "Source_PN"
F 8 "" H 9785 4059 50  0000 R CNN "Bom_Footprint"
F 9 "CAPACITOR CERAMIC, 10UF,+/-10%,50V" H 9900 4150 50  0001 C CNN "Description"
F 10 "X7R" H 9900 4150 50  0001 C CNN "Dielectric"
F 11 "50V" H 9900 4150 50  0001 C CNN "Voltage"
F 12 "10039581" H 9900 4150 50  0001 C CNN "Item Number"
F 13 "AVX" H 9900 4150 50  0001 C CNN "Manufacturer"
F 14 "22205C106K4Z4A" H 9900 4150 50  0001 C CNN "Manufacturer_No"
	1    9900 4150
	1    0    0    -1  
$EndComp
Connection ~ 11600 4900
Wire Wire Line
	11600 4900 12000 4900
$Comp
L 10005011_Power_Management:IRLML2803TRPBF T29
U 1 1 5EA312AA
P 12200 5800
F 0 "T29" H 12404 5846 50  0000 L CNN
F 1 "IRLML2803" H 12404 5755 50  0000 L CNN
F 2 "10005011 Power Management:SOT23-GSD_1" H 13150 5725 50  0001 C CIN
F 3 "https://www.infineon.com/dgdl/irlml2803pbf.pdf?fileId=5546d462533600a4015356682aff260f" H 12525 5500 50  0001 L CNN
F 4 "IRLML2803TRPBF" H 12825 5725 50  0001 C CNN "Mfgr_PN"
F 5 "Infineon Technologies" H 12950 5725 50  0001 C CNN "Mfgr"
F 6 "Digi-Key" H 12700 5725 50  0001 C CNN "Source"
F 7 "IRLML2803PBFCT-ND" H 12900 5725 50  0001 C CNN "Source_PN"
F 8 "TRANSISTOR MOSFET, 30V, 0.93A, 0.25 OHM, N CHANNEL" H 13000 5725 50  0001 C CNN "Description"
F 9 "10022558" H 12200 5800 50  0001 C CNN "Item Number"
	1    12200 5800
	1    0    0    -1  
$EndComp
Wire Wire Line
	13200 5400 13600 5400
Wire Wire Line
	5150 5100 5150 5400
Wire Wire Line
	5150 5100 5700 5100
Wire Wire Line
	4700 5400 5150 5400
Connection ~ 4200 5500
Wire Wire Line
	4200 5500 6100 5500
Wire Wire Line
	4200 4700 5700 4700
$Comp
L Device:C C81
U 1 1 5E9D8460
P 4700 5150
F 0 "C81" H 4585 5104 50  0000 R CNN
F 1 "100pF" H 4585 5195 50  0000 R CNN
F 2 "10005011 Power Management:C0402_1" H 4738 5000 50  0001 C CNN
F 3 "http://www.samsungsem.com/kr/support/product-search/mlcc/CL10C101JB81PNC.jsp" H 4700 5150 50  0001 C CNN
F 4 "YAGEO/PHYCOMP" H 4700 5150 50  0001 C CNN "Mfgr"
F 5 "CC0402JRNPO9BN101" H 4700 5150 50  0001 C CNN "Mfgr_PN"
F 6 "CAPACITOR,100PF,50V,+/-5%,C0G,0402" H 4700 5150 50  0001 C CNN "Description"
F 7 "10022629" H 4700 5150 50  0001 C CNN "Item Number"
	1    4700 5150
	-1   0    0    1   
$EndComp
$Comp
L Device:R ZR80
U 1 1 5E9791C3
P 9550 3900
F 0 "ZR80" V 9450 3950 50  0000 C CNN
F 1 "???_2512" V 9350 4050 50  0000 C CNN
F 2 "10005011 Power Management:R2512_1" V 9480 3900 50  0001 C CNN
F 3 "" H 9550 3900 50  0001 C CNN
F 4 "" H 9550 3900 50  0001 C CNN "Mfgr"
F 5 "" H 9550 3900 50  0001 C CNN "Mfgr_PN"
F 6 "" H 9550 3900 50  0001 C CNN "Source"
F 7 "" H 9550 3900 50  0001 C CNN "Source_PN"
F 8 "" V 9847 3900 50  0001 C CNN "Bom_Footprint"
F 9 "" H 9550 3900 50  0001 C CNN "Description"
F 10 "" H 9550 3900 50  0001 C CNN "Tolerance"
F 11 "" V 9938 3900 50  0001 C CNN "Wattage"
	1    9550 3900
	0    -1   -1   0   
$EndComp
$Comp
L Device:R ZR88
U 1 1 5E995D45
P 12200 4250
F 0 "ZR88" H 12150 4500 50  0000 R CNN
F 1 "???_2512" H 12150 4400 50  0000 R CNN
F 2 "10005011 Power Management:R2512_1" V 12130 4250 50  0001 C CNN
F 3 "" H 12200 4250 50  0001 C CNN
F 4 "" H 12200 4250 50  0001 C CNN "Mfgr"
F 5 "" H 12200 4250 50  0001 C CNN "Mfgr_PN"
F 6 "" H 12200 4250 50  0001 C CNN "Source"
F 7 "" H 12200 4250 50  0001 C CNN "Source_PN"
F 8 "" V 12497 4250 50  0001 C CNN "Bom_Footprint"
F 9 "" H 12200 4250 50  0001 C CNN "Description"
F 10 "" H 12200 4250 50  0001 C CNN "Tolerance"
F 11 "" V 12588 4250 50  0001 C CNN "Wattage"
	1    12200 4250
	-1   0    0    -1  
$EndComp
Connection ~ 12200 4400
Connection ~ 12200 4100
$EndSCHEMATC
