(module MX.A8M_1 (layer F.Cu) (tedit 5E95250F)
  (attr smd)
  (fp_text reference IC17 (at -0.4826 -1.016 -270 unlocked) (layer F.SilkS)
    (effects (font (size 1.033069 1.086612) (thickness 0.1778)))
  )
  (fp_text value L-BC-SO08M (at -0.7874 -3.937 -270 unlocked) (layer F.SilkS) hide
    (effects (font (size 1.033069 1.086612) (thickness 0.1778)))
  )
  (fp_line (start 0.635 3.81) (end 0.635 2.6924) (layer F.Fab) (width 0.0762))
  (fp_line (start -2.8448 0.508) (end -1.778 0.508) (layer F.Fab) (width 0.0762))
  (fp_line (start -2.8448 0.508) (end -2.8448 -0.508) (layer F.Fab) (width 0.0762))
  (fp_line (start -1.905 -2.6924) (end -1.905 -3.81) (layer F.Fab) (width 0.2286))
  (fp_line (start -0.635 3.81) (end -0.635 2.6924) (layer F.Fab) (width 0.0762))
  (fp_line (start -0.635 -2.6924) (end -0.635 -3.81) (layer F.Fab) (width 0.2286))
  (fp_line (start -2.8448 2.6924) (end -2.8448 -2.6924) (layer F.Fab) (width 0.0762))
  (fp_line (start -1.905 3.81) (end -1.905 2.6924) (layer F.Fab) (width 0.0762))
  (fp_line (start 0.635 -2.6924) (end 0.635 -3.81) (layer F.Fab) (width 0.2286))
  (fp_line (start 2.8448 2.6924) (end 2.8448 -2.6924) (layer F.Fab) (width 0.0762))
  (fp_line (start -2.8448 -2.6924) (end 2.8448 -2.6924) (layer F.Fab) (width 0.0762))
  (fp_line (start 1.905 -2.6924) (end 1.905 -3.81) (layer F.Fab) (width 0.2286))
  (fp_line (start 1.905 3.81) (end 1.905 2.6924) (layer F.Fab) (width 0.0762))
  (fp_line (start -2.8448 -0.508) (end -1.778 -0.508) (layer F.Fab) (width 0.0762))
  (fp_line (start -2.8448 2.6924) (end 2.8448 2.6924) (layer F.Fab) (width 0.0762))
  (fp_line (start -2.8448 2.3622) (end -2.8448 1.8288) (layer F.SilkS) (width 0.1778))
  (fp_line (start -2.8448 2.3622) (end -2.7178 2.3622) (layer F.SilkS) (width 0.1778))
  (fp_line (start -1.4478 2.3622) (end 2.7432 2.3622) (layer F.SilkS) (width 0.1778))
  (fp_line (start -0.0508 -2.3622) (end 2.8448 -2.3622) (layer F.SilkS) (width 0.1778))
  (fp_line (start 2.8448 -1.6764) (end 2.8448 -2.3622) (layer F.SilkS) (width 0.1778))
  (fp_line (start -2.8448 -1.778) (end -2.8448 -2.3622) (layer F.SilkS) (width 0.1778))
  (fp_line (start 2.8448 2.2606) (end 2.8448 1.9304) (layer F.SilkS) (width 0.1778))
  (fp_line (start -2.8448 -2.3622) (end -1.1938 -2.3622) (layer F.SilkS) (width 0.1778))
  (fp_arc (start -1.778 0) (end -1.778 0.508) (angle -180) (layer F.Fab) (width 0.0762))
  (pad 1 smd rect (at -2.032 3.7846) (size 0.8636 2.032) (layers F.Cu F.Paste F.Mask))
  (pad 2 smd rect (at -0.635 3.7846) (size 0.8636 2.032) (layers F.Cu F.Paste F.Mask))
  (pad 3 smd rect (at 0.635 3.7846) (size 0.8636 2.032) (layers F.Cu F.Paste F.Mask))
  (pad 4 smd rect (at 2.032 3.7846) (size 0.8636 2.032) (layers F.Cu F.Paste F.Mask))
  (pad 5 smd rect (at 2.032 -3.7846) (size 0.8636 2.032) (layers F.Cu F.Paste F.Mask))
  (pad 6 smd rect (at 0.635 -3.7846) (size 0.8636 2.032) (layers F.Cu F.Paste F.Mask))
  (pad 7 smd rect (at -0.635 -3.7846) (size 0.8636 2.032) (layers F.Cu F.Paste F.Mask))
  (pad 8 smd rect (at -2.032 -3.7846) (size 0.8636 2.032) (layers F.Cu F.Paste F.Mask))
  (model ${KISYS3DMOD}/Package_SO.3dshapes/SO-8_5.3x6.2mm_P1.27mm.wrl
    (at (xyz 0 0 0))
    (scale (xyz 1 1 1))
    (rotate (xyz 0 0 -90))
  )
)
