EESchema Schematic File Version 4
EELAYER 30 0
EELAYER END
$Descr A3 16535 11693
encoding utf-8
Sheet 2 2
Title "GR106768 buzzer charger"
Date "2020-04-04"
Rev "1.0"
Comp ""
Comment1 ""
Comment2 ""
Comment3 ""
Comment4 ""
$EndDescr
$Comp
L power:+12V #PWR034
U 1 1 5E89E8AE
P 1250 2100
F 0 "#PWR034" H 1250 1950 50  0001 C CNN
F 1 "+12V" H 1265 2273 50  0000 C CNN
F 2 "" H 1250 2100 50  0001 C CNN
F 3 "" H 1250 2100 50  0001 C CNN
    1    1250 2100
    1    0    0    -1
$EndComp
$Comp
L Diode:BZX84Cxx D7
U 1 1 5E89FF76
P 1700 3300
F 0 "D7" V 1725 3375 50  0000 L CNN
F 1 "BZX84C5V1" V 1800 2850 50  0000 L CNN
F 2 "AllModules:SOT23-1G_1" H 1700 3125 50  0001 C CNN
F 3 "https://diotec.com/tl_files/diotec/files/pdf/datasheets/bzx84c2v4.pdf" H 1700 3300 50  0001 C CNN
    1    1700 3300
    0    1    1    0
$EndComp
$Comp
L Device:C C15
U 1 1 5E8A0888
P 1250 2700
F 0 "C15" H 1300 2800 50  0000 L CNN
F 1 "100nF" H 1275 2600 50  0000 L CNN
F 2 "AllModules:C0402_1b" H 1288 2550 50  0001 C CNN
F 3 "~" H 1250 2700 50  0001 C CNN
    1    1250 2700
    1    0    0    -1
$EndComp
$Comp
L Device:D_Schottky D8
U 1 1 5E89B119
P 4000 2425
F 0 "D8" H 4000 2325 50  0000 C CNN
F 1 "MBRM120" H 3950 2550 50  0000 C CNN
F 2 "AllModules:DO216AA_1" H 4000 2425 50  0001 C CNN
F 3 "~" H 4000 2425 50  0001 C CNN
    1    4000 2425
    -1   0    0    1
$EndComp
$Comp
L Diode:BZX84Cxx D15
U 1 1 5E89BB9F
P 4350 2625
F 0 "D15" V 4304 2704 50  0000 L CNN
F 1 "BZX84_B6V8" V 4395 2704 50  0000 L CNN
F 2 "AllModules:SOT23-1G_1" H 4350 2450 50  0001 C CNN
F 3 "https://diotec.com/tl_files/diotec/files/pdf/datasheets/bzx84c2v4.pdf" H 4350 2625 50  0001 C CNN
    1    4350 2625
    0    1    1    0
$EndComp
$Comp
L Device:Battery BAT1
U 1 1 5E89FEB7
P 5800 3100
F 0 "BAT1" H 5908 3146 50  0000 L CNN
F 1 "Battery" H 5908 3055 50  0000 L CNN
F 2 "AllModules:BT-4-V150H-4.8V_1" V 5800 3160 50  0001 C CNN
F 3 "https://datasheet.octopart.com/55615604940-Varta-datasheet-21225580.pdf" V 5800 3160 50  0001 C CNN
F 4 "VARTA 55615604940" H 5800 3100 50  0001 C CNN "MPN"
    1    5800 3100
    1    0    0    -1
$EndComp
$Comp
L Device:LED LD1
U 1 1 5E8A01A4
P 4475 4025
F 0 "LD1" V 4575 3975 50  0000 R CNN
F 1 "NC" V 4450 3925 50  0000 R CNN
F 2 "AllModules:D0603_1" H 4475 4025 50  0001 C CNN
F 3 "~" H 4475 4025 50  0001 C CNN
    1    4475 4025
    0    -1   -1   0
$EndComp
$Comp
L Switch:SW_SPDT SW1
U 1 1 5E8A33F6
P 6075 3850
F 0 "SW1" V 6025 3650 50  0000 L CNN
F 1 "SW_SPDT" V 6075 3950 50  0000 L CNN
F 2 "AllModules:NK236_1_1" H 6075 3850 50  0001 C CNN
F 3 "~" H 6075 3850 50  0001 C CNN
    1    6075 3850
    0    1    1    0
$EndComp
$Comp
L Device:C C31
U 1 1 5E8A58B8
P 15475 3700
F 0 "C31" H 15500 3825 50  0000 L CNN
F 1 "100nF" H 15500 3600 50  0000 L CNN
F 2 "AllModules:C0402_1b" H 15513 3550 50  0001 C CNN
F 3 "~" H 15475 3700 50  0001 C CNN
    1    15475 3700
    1    0    0    -1
$EndComp
$Comp
L Device:L L2
U 1 1 5E8C0A82
P 13025 3375
F 0 "L2" V 13100 3375 50  0000 C CNN
F 1 "10μH" V 12975 3375 50  0000 C CNN
F 2 "AllModules:WETPC-S_1" H 13025 3375 50  0001 C CNN
F 3 "~" H 13025 3375 50  0001 C CNN
    1    13025 3375
    0    -1   -1   0
$EndComp
$Comp
L Device:L L3
U 1 1 5E96380A
P 12925 6000
F 0 "L3" V 13025 6000 50  0000 C CNN
F 1 "15μH" V 12850 6000 50  0000 C CNN
F 2 "AllModules:WETPC-S_1" H 12925 6000 50  0001 C CNN
F 3 "~" H 12925 6000 50  0001 C CNN
    1    12925 6000
    0    -1   -1   0
$EndComp
$Comp
L power:+12V #PWR041
U 1 1 5E965347
P 15475 3200
F 0 "#PWR041" H 15475 3050 50  0001 C CNN
F 1 "+12V" H 15490 3373 50  0000 C CNN
F 2 "" H 15475 3200 50  0001 C CNN
F 3 "" H 15475 3200 50  0001 C CNN
    1    15475 3200
    1    0    0    -1
$EndComp
$Comp
L Device:C C28
U 1 1 5E966C43
P 14900 3700
F 0 "C28" H 14925 3800 50  0000 L CNN
F 1 "100pF" H 14925 3600 50  0000 L CNN
F 2 "AllModules:C0402_1b" H 14938 3550 50  0001 C CNN
F 3 "~" H 14900 3700 50  0001 C CNN
    1    14900 3700
    1    0    0    -1
$EndComp
$Comp
L lt3471:LT3471 IC8
U 1 1 5E96B49A
P 12825 4375
F 0 "IC8" H 12225 4825 50  0000 C CNN
F 1 "LT3471" H 13100 4025 50  0000 C CNN
F 2 "AllModules:DFN10_1" H 12825 3975 50  0001 C CNN
F 3 "https://www.analog.com/media/en/technical-documentation/data-sheets/3471fb.pdf" H 12825 4325 50  0001 C CNN
    1    12825 4375
    -1   0    0    -1
$EndComp
$Comp
L Device:C C22
U 1 1 5E96C675
P 12600 2900
F 0 "C22" H 12400 3050 50  0000 L CNN
F 1 "10μF" H 12375 2800 50  0000 L CNN
F 2 "AllModules:RC1206_1" H 12638 2750 50  0001 C CNN
F 3 "~" H 12600 2900 50  0001 C CNN
    1    12600 2900
    1    0    0    -1
$EndComp
$Comp
L power:GND #PWR047
U 1 1 5E975EE9
P 15475 4025
F 0 "#PWR047" H 15475 3775 50  0001 C CNN
F 1 "GND" H 15480 3852 50  0000 C CNN
F 2 "" H 15475 4025 50  0001 C CNN
F 3 "" H 15475 4025 50  0001 C CNN
    1    15475 4025
    1    0    0    -1
$EndComp
Wire Wire Line
    1250 2100 1250 2425
Connection ~ 1250 2425
Wire Wire Line
    1250 2425 1250 2550
Wire Wire Line
    1700 2600 1700 2425
Connection ~ 1700 2425
Wire Wire Line
    1700 2425 1250 2425
Wire Wire Line
    2825 1975 1700 1975
Wire Wire Line
    1700 1975 1700 2425
$Comp
L power:GND #PWR038
U 1 1 5E8BECDF
P 1250 2975
F 0 "#PWR038" H 1250 2725 50  0001 C CNN
F 1 "GND" H 1255 2802 50  0000 C CNN
F 2 "" H 1250 2975 50  0001 C CNN
F 3 "" H 1250 2975 50  0001 C CNN
    1    1250 2975
    1    0    0    -1
$EndComp
Wire Wire Line
    1250 2850 1250 2975
$Comp
L power:GND #PWR044
U 1 1 5E8C2540
P 1700 3525
F 0 "#PWR044" H 1700 3275 50  0001 C CNN
F 1 "GND" H 1705 3352 50  0000 C CNN
F 2 "" H 1700 3525 50  0001 C CNN
F 3 "" H 1700 3525 50  0001 C CNN
    1    1700 3525
    1    0    0    -1
$EndComp
Wire Wire Line
    1700 3525 1700 3450
Wire Wire Line
    3325 2425 3250 2425
Wire Wire Line
    3125 1975 3725 1975
Wire Wire Line
    3725 1975 3725 2425
Wire Wire Line
    3725 2800 3625 2800
Wire Wire Line
    3625 2425 3725 2425
Connection ~ 3725 2425
Wire Wire Line
    3725 2425 3725 2800
Wire Wire Line
    3850 2425 3725 2425
$Comp
L power:GND #PWR036
U 1 1 5E8D0614
P 4350 2825
F 0 "#PWR036" H 4350 2575 50  0001 C CNN
F 1 "GND" H 4355 2652 50  0000 C CNN
F 2 "" H 4350 2825 50  0001 C CNN
F 3 "" H 4350 2825 50  0001 C CNN
    1    4350 2825
    1    0    0    -1
$EndComp
Wire Wire Line
    4350 2425 4350 2475
Wire Wire Line
    4150 2425 4350 2425
Wire Wire Line
    4350 2775 4350 2825
Wire Wire Line
    1700 2900 1700 3025
Wire Wire Line
    3325 2800 2950 2800
Wire Wire Line
    2950 2800 2950 2725
Wire Wire Line
    1700 2425 2650 2425
Wire Wire Line
    2950 2800 2950 3475
Wire Wire Line
    2950 4300 3100 4300
Connection ~ 2950 2800
$Comp
L power:GND #PWR048
U 1 1 5E94F1D0
P 2650 4200
F 0 "#PWR048" H 2650 3950 50  0001 C CNN
F 1 "GND" H 2500 4150 50  0000 C CNN
F 2 "" H 2650 4200 50  0001 C CNN
F 3 "" H 2650 4200 50  0001 C CNN
    1    2650 4200
    1    0    0    -1
$EndComp
Wire Wire Line
    2650 4125 2650 4200
Wire Wire Line
    2650 3725 2650 3475
Wire Wire Line
    2650 3475 2950 3475
Connection ~ 2950 3475
Wire Wire Line
    2950 3475 2950 4300
$Comp
L power:GND #PWR046
U 1 1 5E95AFAB
P 4125 4000
F 0 "#PWR046" H 4125 3750 50  0001 C CNN
F 1 "GND" H 4125 3850 50  0000 C CNN
F 2 "" H 4125 4000 50  0001 C CNN
F 3 "" H 4125 4000 50  0001 C CNN
    1    4125 4000
    1    0    0    -1
$EndComp
Wire Wire Line
    4125 3625 4125 3575
Wire Wire Line
    4125 3575 3875 3575
Wire Wire Line
    3875 3575 3875 4300
Wire Wire Line
    3875 4300 3800 4300
Connection ~ 4125 3575
Wire Wire Line
    4125 3575 4125 3525
Wire Wire Line
    4125 4000 4125 3925
Wire Wire Line
    4125 3225 4125 3025
Wire Wire Line
    4125 3025 2125 3025
Connection ~ 1700 3025
Wire Wire Line
    1700 3025 1700 3150
$Comp
L power:GND #PWR055
U 1 1 5E967967
P 3000 5300
F 0 "#PWR055" H 3000 5050 50  0001 C CNN
F 1 "GND" H 3000 5150 50  0000 C CNN
F 2 "" H 3000 5300 50  0001 C CNN
F 3 "" H 3000 5300 50  0001 C CNN
    1    3000 5300
    1    0    0    -1
$EndComp
Wire Wire Line
    3100 4600 3000 4600
Wire Wire Line
    3000 4600 3000 4700
Wire Wire Line
    3000 5300 3000 5200
$Comp
L Device:C C16
U 1 1 5E9712FB
P 2300 5050
F 0 "C16" H 2350 5175 50  0000 L CNN
F 1 "100nF" H 2325 4950 50  0000 L CNN
F 2 "AllModules:C0402_1b" H 2338 4900 50  0001 C CNN
F 3 "~" H 2300 5050 50  0001 C CNN
    1    2300 5050
    1    0    0    -1
$EndComp
$Comp
L power:GND #PWR054
U 1 1 5E972DD2
P 2300 5300
F 0 "#PWR054" H 2300 5050 50  0001 C CNN
F 1 "GND" H 2300 5150 50  0000 C CNN
F 2 "" H 2300 5300 50  0001 C CNN
F 3 "" H 2300 5300 50  0001 C CNN
    1    2300 5300
    1    0    0    -1
$EndComp
Wire Wire Line
    2300 5300 2300 5200
Wire Wire Line
    2300 4900 2300 4700
Wire Wire Line
    2300 4700 2500 4700
Wire Wire Line
    3100 4500 2300 4500
Wire Wire Line
    2300 4500 2300 4700
Connection ~ 2300 4700
Wire Wire Line
    2125 4500 2125 3025
Connection ~ 2125 3025
Wire Wire Line
    2125 3025 1700 3025
Wire Wire Line
    600  4300 500  4300
$Comp
L Device:C C17
U 1 1 5E9BFCE7
P 4750 4900
F 0 "C17" H 4775 5000 50  0000 L CNN
F 1 "100nF" H 4775 4800 50  0000 L CNN
F 2 "AllModules:C0402_1b" H 4788 4750 50  0001 C CNN
F 3 "~" H 4750 4900 50  0001 C CNN
    1    4750 4900
    1    0    0    -1
$EndComp
$Comp
L power:+12V #PWR042
U 1 1 5E9DCF7E
P 4475 3400
F 0 "#PWR042" H 4475 3250 50  0001 C CNN
F 1 "+12V" H 4490 3573 50  0000 C CNN
F 2 "" H 4475 3400 50  0001 C CNN
F 3 "" H 4475 3400 50  0001 C CNN
    1    4475 3400
    1    0    0    -1
$EndComp
Wire Wire Line
    3800 4400 4475 4400
Wire Wire Line
    4475 4400 4475 4175
Wire Wire Line
    4475 3800 4475 3875
Wire Wire Line
    4475 3400 4475 3500
Wire Wire Line
    4750 4500 4750 4750
Wire Wire Line
    4750 4500 5225 4500
Wire Wire Line
    5225 4500 5225 4750
Wire Wire Line
    5225 5050 5225 5125
Wire Wire Line
    5225 5125 4750 5125
Connection ~ 4750 5125
Wire Wire Line
    4750 5125 4750 5050
Wire Wire Line
    4350 2425 5225 2425
Wire Wire Line
    5225 2425 5225 4100
Connection ~ 4350 2425
Wire Wire Line
    5225 4500 5225 4400
Connection ~ 5225 4500
$Comp
L power:GND #PWR049
U 1 1 5EA135B0
P 5975 4250
F 0 "#PWR049" H 5975 4000 50  0001 C CNN
F 1 "GND" H 5975 4100 50  0000 C CNN
F 2 "" H 5975 4250 50  0001 C CNN
F 3 "" H 5975 4250 50  0001 C CNN
    1    5975 4250
    1    0    0    -1
$EndComp
$Comp
L Device:Jumper_NC_Small SJ1
U 1 1 5EA158D9
P 5500 3725
F 0 "SJ1" V 5550 3925 50  0000 R CNN
F 1 "Jumper_Small" H 5725 3625 50  0000 R CNN
F 2 "AllModules:TB-CMS-AIROX-2_1" H 5500 3725 50  0001 C CNN
F 3 "~" H 5500 3725 50  0001 C CNN
    1    5500 3725
    0    -1   -1   0
$EndComp
Wire Wire Line
    5500 3825 5500 4150
Wire Wire Line
    5500 4150 5975 4150
Wire Wire Line
    5975 4150 5975 4050
Wire Wire Line
    5975 4250 5975 4150
Connection ~ 5975 4150
Wire Wire Line
    5800 3300 5800 3375
Wire Wire Line
    5800 3375 6075 3375
Wire Wire Line
    6075 3375 6075 3650
Wire Wire Line
    5800 3375 5500 3375
Wire Wire Line
    5500 3375 5500 3625
Connection ~ 5800 3375
$Comp
L power:+BATT #PWR035
U 1 1 5EA25041
P 5800 2800
F 0 "#PWR035" H 5800 2650 50  0001 C CNN
F 1 "+BATT" H 5815 2973 50  0000 C CNN
F 2 "" H 5800 2800 50  0001 C CNN
F 3 "" H 5800 2800 50  0001 C CNN
    1    5800 2800
    1    0    0    -1
$EndComp
Wire Wire Line
    5800 2800 5800 2900
$Comp
L power:GND #PWR056
U 1 1 5EA31DDC
P 4075 5250
F 0 "#PWR056" H 4075 5000 50  0001 C CNN
F 1 "GND" H 4075 5100 50  0000 C CNN
F 2 "" H 4075 5250 50  0001 C CNN
F 3 "" H 4075 5250 50  0001 C CNN
    1    4075 5250
    1    0    0    -1
$EndComp
Wire Wire Line
    3800 4600 4075 4600
Wire Wire Line
    4075 4600 4075 5125
Wire Wire Line
    4750 5125 4075 5125
Connection ~ 4075 5125
Wire Wire Line
    4075 5125 4075 5250
Wire Wire Line
    3800 4500 4750 4500
Connection ~ 4750 4500
Wire Wire Line
    6600 3525 6600 4150
Wire Wire Line
    6600 4150 5975 4150
Wire Wire Line
    6600 3225 6600 3075
Wire Wire Line
    6600 2625 6600 2425
Wire Wire Line
    6600 2425 5225 2425
Connection ~ 5225 2425
$Comp
L Device:C C18
U 1 1 5EA7B49D
P 6925 3500
F 0 "C18" H 6975 3600 50  0000 L CNN
F 1 "100nF" H 6950 3400 50  0000 L CNN
F 2 "AllModules:C0402_1b" H 6963 3350 50  0001 C CNN
F 3 "~" H 6925 3500 50  0001 C CNN
    1    6925 3500
    1    0    0    -1
$EndComp
$Comp
L power:GND #PWR045
U 1 1 5EA7F7B1
P 6925 3750
F 0 "#PWR045" H 6925 3500 50  0001 C CNN
F 1 "GND" H 6925 3600 50  0000 C CNN
F 2 "" H 6925 3750 50  0001 C CNN
F 3 "" H 6925 3750 50  0001 C CNN
    1    6925 3750
    1    0    0    -1
$EndComp
Wire Wire Line
    7550 3075 6925 3075
Connection ~ 6600 3075
Wire Wire Line
    6600 3075 6600 2925
Wire Wire Line
    6925 3350 6925 3075
Connection ~ 6925 3075
Wire Wire Line
    6925 3075 6600 3075
Wire Wire Line
    6925 3650 6925 3750
$Comp
L power:GND #PWR043
U 1 1 5EA89EC9
P 7850 3525
F 0 "#PWR043" H 7850 3275 50  0001 C CNN
F 1 "GND" H 7950 3400 50  0000 C CNN
F 2 "" H 7850 3525 50  0001 C CNN
F 3 "" H 7850 3525 50  0001 C CNN
    1    7850 3525
    1    0    0    -1
$EndComp
Wire Wire Line
    7850 3525 7850 3475
Wire Wire Line
    7750 3850 7750 3900
Wire Wire Line
    7750 3900 7275 3900
Wire Wire Line
    7275 3900 7275 3275
Wire Wire Line
    7275 3275 7550 3275
$Comp
L Device:C C19
U 1 1 5EA920AC
P 8050 2725
F 0 "C19" V 7875 2650 50  0000 L CNN
F 1 "100nF" V 8150 2800 50  0000 L CNN
F 2 "AllModules:C0402_1b" H 8088 2575 50  0001 C CNN
F 3 "~" H 8050 2725 50  0001 C CNN
    1    8050 2725
    0    1    1    0
$EndComp
$Comp
L power:GND #PWR037
U 1 1 5EA92EED
P 8400 2825
F 0 "#PWR037" H 8400 2575 50  0001 C CNN
F 1 "GND" H 8400 2675 50  0000 C CNN
F 2 "" H 8400 2825 50  0001 C CNN
F 3 "" H 8400 2825 50  0001 C CNN
    1    8400 2825
    1    0    0    -1
$EndComp
Wire Wire Line
    8200 2725 8400 2725
Wire Wire Line
    8400 2725 8400 2825
Connection ~ 6600 2425
Wire Wire Line
    5050 2200 5225 2200
Wire Wire Line
    5225 2200 5225 2425
Wire Wire Line
    8150 3175 8375 3175
Wire Wire Line
    8375 3175 8375 3300
Wire Wire Line
    7750 3900 8375 3900
Wire Wire Line
    8375 3900 8375 3600
Connection ~ 7750 3900
Wire Wire Line
    8950 2425 8725 2425
Wire Wire Line
    8725 2525 8725 2425
Connection ~ 8725 2425
Wire Wire Line
    9150 2725 9150 2925
Wire Wire Line
    9150 2925 8725 2925
Wire Wire Line
    8725 2925 8725 2825
Wire Wire Line
    9150 3175 9150 2925
Connection ~ 9150 2925
Wire Wire Line
    8375 3175 9150 3175
Connection ~ 8375 3175
Wire Wire Line
    9975 2425 9725 2425
Wire Wire Line
    9725 2550 9725 2425
Connection ~ 9725 2425
Wire Wire Line
    9725 2425 9450 2425
Wire Wire Line
    9725 2850 9725 2925
Wire Wire Line
    9725 2925 10175 2925
Wire Wire Line
    10175 2925 10175 2725
Wire Wire Line
    9725 2275 9725 2425
Wire Wire Line
    3400 6450 3125 6450
Wire Wire Line
    3125 6450 3125 6550
Wire Wire Line
    3600 7000 3125 7000
Wire Wire Line
    3125 7000 3125 6850
Wire Wire Line
    3125 6450 2800 6450
Connection ~ 3125 6450
Wire Wire Line
    4300 6450 3800 6450
$Comp
L power:GND #PWR071
U 1 1 5E962FC1
P 4500 8300
F 0 "#PWR071" H 4500 8050 50  0001 C CNN
F 1 "GND" H 4500 8150 50  0000 C CNN
F 2 "" H 4500 8300 50  0001 C CNN
F 3 "" H 4500 8300 50  0001 C CNN
    1    4500 8300
    1    0    0    -1
$EndComp
$Comp
L power:+5V #PWR068
U 1 1 5E99F3AE
P 6100 7500
F 0 "#PWR068" H 6100 7350 50  0001 C CNN
F 1 "+5V" H 6115 7673 50  0000 C CNN
F 2 "" H 6100 7500 50  0001 C CNN
F 3 "" H 6100 7500 50  0001 C CNN
    1    6100 7500
    1    0    0    -1
$EndComp
$Comp
L Diode:BAT54S D9
U 1 1 5E9B9C29
P 8300 5750
F 0 "D9" H 8175 5625 50  0000 C CNN
F 1 "BAT54S" H 8300 5875 50  0000 C CNN
F 2 "AllModules:SOT23-1G_1" H 8375 5875 50  0001 L CNN
F 3 "https://www.diodes.com/assets/Datasheets/ds11005.pdf" H 8180 5750 50  0001 C CNN
    1    8300 5750
    -1   0    0    1
$EndComp
$Comp
L Device:R R48
U 1 1 5E9BACF2
P 8050 5375
F 0 "R48" V 7950 5375 50  0000 C CNN
F 1 "NC" V 8050 5375 50  0000 C CNN
F 2 "AllModules:R0402_1" V 7980 5375 50  0001 C CNN
F 3 "~" H 8050 5375 50  0001 C CNN
    1    8050 5375
    0    1    1    0
$EndComp
$Comp
L Device:R R60
U 1 1 5E9BBB0B
P 7800 4650
F 0 "R60" H 7650 4650 50  0000 C CNN
F 1 "NC" V 7800 4650 50  0000 C CNN
F 2 "AllModules:R0402_1" V 7730 4650 50  0001 C CNN
F 3 "~" H 7800 4650 50  0001 C CNN
    1    7800 4650
    1    0    0    -1
$EndComp
$Comp
L Device:C C20
U 1 1 5E9BC806
P 8050 4950
F 0 "C20" V 7875 4875 50  0000 L CNN
F 1 "330nF" V 8200 4875 50  0000 L CNN
F 2 "AllModules:C0603_1b" H 8088 4800 50  0001 C CNN
F 3 "~" H 8050 4950 50  0001 C CNN
    1    8050 4950
    0    1    1    0
$EndComp
$Comp
L power:GND #PWR061
U 1 1 5E9BF600
P 8850 5850
F 0 "#PWR061" H 8850 5600 50  0001 C CNN
F 1 "GND" H 8850 5700 50  0000 C CNN
F 2 "" H 8850 5850 50  0001 C CNN
F 3 "" H 8850 5850 50  0001 C CNN
    1    8850 5850
    1    0    0    -1
$EndComp
$Comp
L Device:Jumper JP1
U 1 1 5E9C0175
P 9250 5325
F 0 "JP1" V 9400 5275 50  0000 R CNN
F 1 "Jumper" V 9250 5350 50  0000 R CNN
F 2 "AllModules:TB-CMS-AIROX_1" H 9250 5325 50  0001 C CNN
F 3 "~" H 9250 5325 50  0001 C CNN
    1    9250 5325
    0    -1   -1   0
$EndComp
$Comp
L Device:C C35
U 1 1 5E9C4E7A
P 9675 5350
F 0 "C35" H 9725 5450 50  0000 L CNN
F 1 "4.7nF" H 9725 5250 50  0000 L CNN
F 2 "AllModules:C0402_1b" H 9713 5200 50  0001 C CNN
F 3 "~" H 9675 5350 50  0001 C CNN
    1    9675 5350
    1    0    0    -1
$EndComp
$Comp
L Device:C C34
U 1 1 5EA224D5
P 12275 8350
F 0 "C34" H 12325 8450 50  0000 L CNN
F 1 "NC" H 12300 8250 50  0000 L CNN
F 2 "AllModules:C0402_1b" H 12313 8200 50  0001 C CNN
F 3 "~" H 12275 8350 50  0001 C CNN
    1    12275 8350
    1    0    0    -1
$EndComp
$Comp
L power:GND #PWR072
U 1 1 5EA25B59
P 11900 8625
F 0 "#PWR072" H 11900 8375 50  0001 C CNN
F 1 "GND" H 11900 8475 50  0000 C CNN
F 2 "" H 11900 8625 50  0001 C CNN
F 3 "" H 11900 8625 50  0001 C CNN
    1    11900 8625
    1    0    0    -1
$EndComp
Wire Wire Line
    14325 7450 14500 7450
Connection ~ 14500 7450
Wire Wire Line
    14500 7450 15000 7450
$Comp
L power:GND #PWR070
U 1 1 5EA49016
P 14500 8200
F 0 "#PWR070" H 14500 7950 50  0001 C CNN
F 1 "GND" H 14500 8050 50  0000 C CNN
F 2 "" H 14500 8200 50  0001 C CNN
F 3 "" H 14500 8200 50  0001 C CNN
    1    14500 8200
    1    0    0    -1
$EndComp
Wire Wire Line
    14500 8200 14500 8050
Wire Wire Line
    14200 7850 13900 7850
Wire Wire Line
    13900 7850 13900 7450
Wire Wire Line
    13900 7450 14025 7450
Wire Wire Line
    14325 8700 14500 8700
Wire Wire Line
    14500 8900 14500 8700
$Comp
L power:GND #PWR075
U 1 1 5EA71DB5
P 14500 9425
F 0 "#PWR075" H 14500 9175 50  0001 C CNN
F 1 "GND" H 14500 9275 50  0000 C CNN
F 2 "" H 14500 9425 50  0001 C CNN
F 3 "" H 14500 9425 50  0001 C CNN
    1    14500 9425
    1    0    0    -1
$EndComp
Wire Wire Line
    14500 9425 14500 9300
Wire Wire Line
    14025 8700 13900 8700
Wire Wire Line
    13900 8700 13900 9100
Wire Wire Line
    13900 9100 14200 9100
Wire Wire Line
    13900 7850 13900 8200
Wire Wire Line
    13900 8200 13550 8200
Connection ~ 13900 7850
Wire Wire Line
    13900 8200 13900 8700
Connection ~ 13900 8200
Connection ~ 13900 8700
$Comp
L Device:C C33
U 1 1 5EAC1081
P 13475 7700
F 0 "C33" V 13650 7625 50  0000 L CNN
F 1 "100nF" V 13300 7600 50  0000 L CNN
F 2 "AllModules:C0402_1b" H 13513 7550 50  0001 C CNN
F 3 "~" H 13475 7700 50  0001 C CNN
    1    13475 7700
    0    -1   -1   0
$EndComp
$Comp
L power:GND #PWR069
U 1 1 5EAD1AF4
P 13700 7850
F 0 "#PWR069" H 13700 7600 50  0001 C CNN
F 1 "GND" H 13700 7700 50  0000 C CNN
F 2 "" H 13700 7850 50  0001 C CNN
F 3 "" H 13700 7850 50  0001 C CNN
    1    13700 7850
    1    0    0    -1
$EndComp
Wire Wire Line
    13625 7700 13700 7700
Wire Wire Line
    13700 7700 13700 7850
Wire Wire Line
    13325 7700 13150 7700
Wire Wire Line
    13150 7700 13150 7900
$Comp
L power:GND #PWR074
U 1 1 5EAE4018
P 13250 8625
F 0 "#PWR074" H 13250 8375 50  0001 C CNN
F 1 "GND" H 13250 8475 50  0000 C CNN
F 2 "" H 13250 8625 50  0001 C CNN
F 3 "" H 13250 8625 50  0001 C CNN
    1    13250 8625
    1    0    0    -1
$EndComp
Wire Wire Line
    13150 8600 12650 8600
Wire Wire Line
    12650 8600 12650 8300
Wire Wire Line
    12650 8300 12950 8300
$Comp
L power:GND #PWR073
U 1 1 5EAFF44E
P 12275 8625
F 0 "#PWR073" H 12275 8375 50  0001 C CNN
F 1 "GND" H 12275 8475 50  0000 C CNN
F 2 "" H 12275 8625 50  0001 C CNN
F 3 "" H 12275 8625 50  0001 C CNN
    1    12275 8625
    1    0    0    -1
$EndComp
Wire Wire Line
    12275 8500 12275 8625
Wire Wire Line
    12950 8100 12275 8100
Wire Wire Line
    12275 8100 12275 8200
Wire Wire Line
    11700 8100 11900 8100
Connection ~ 12275 8100
Wire Wire Line
    11900 8200 11900 8100
Connection ~ 11900 8100
Wire Wire Line
    11900 8100 12275 8100
Wire Wire Line
    11900 8625 11900 8500
Wire Wire Line
    13150 7700 11275 7700
Wire Wire Line
    11275 7700 11275 8100
Wire Wire Line
    11275 8100 11400 8100
Connection ~ 13150 7700
Wire Wire Line
    7900 5375 7800 5375
Wire Wire Line
    7800 4800 7800 4950
Connection ~ 7800 4950
Wire Wire Line
    7800 4950 7600 4950
Wire Wire Line
    7800 5375 7800 4950
Wire Wire Line
    8000 5750 7800 5750
Wire Wire Line
    8300 5550 8300 5375
Wire Wire Line
    8200 5375 8300 5375
Connection ~ 8300 5375
Wire Wire Line
    8300 5375 8300 4950
Wire Wire Line
    7900 4950 7800 4950
Wire Wire Line
    8200 4950 8300 4950
Connection ~ 8300 4950
Wire Wire Line
    9250 4950 9250 5025
Wire Wire Line
    8300 4950 8850 4950
Wire Wire Line
    8850 5150 8850 4950
Connection ~ 8850 4950
Wire Wire Line
    8850 4950 9250 4950
Wire Wire Line
    8850 5450 8850 5750
Wire Wire Line
    8850 5750 8600 5750
Wire Wire Line
    8850 5850 8850 5750
Connection ~ 8850 5750
Wire Wire Line
    8850 5750 9250 5750
Wire Wire Line
    9250 5750 9250 5625
Wire Wire Line
    9675 4950 9675 5200
Wire Wire Line
    9250 4950 9675 4950
Connection ~ 9250 4950
Wire Wire Line
    9675 5500 9675 5750
Wire Wire Line
    9675 5750 9250 5750
Connection ~ 9250 5750
Wire Wire Line
    9875 4950 9675 4950
Connection ~ 9675 4950
Wire Wire Line
    10175 5150 10175 5750
Wire Wire Line
    10175 5750 9675 5750
Connection ~ 9675 5750
Wire Wire Line
    10675 2425 10375 2425
$Comp
L power:+5V #PWR050
U 1 1 5ECFC16F
P 7800 4450
F 0 "#PWR050" H 7800 4300 50  0001 C CNN
F 1 "+5V" H 7815 4623 50  0000 C CNN
F 2 "" H 7800 4450 50  0001 C CNN
F 3 "" H 7800 4450 50  0001 C CNN
    1    7800 4450
    1    0    0    -1
$EndComp
Wire Wire Line
    7800 4450 7800 4500
Connection ~ 10175 2925
Wire Wire Line
    10175 2925 10175 4750
Wire Wire Line
    10675 2425 10675 2550
Connection ~ 10675 2425
Wire Wire Line
    10675 2850 10675 4575
Wire Wire Line
    10675 4575 8850 4575
Wire Wire Line
    8850 4575 8850 4950
$Comp
L power:GND #PWR051
U 1 1 5EE001F8
P 12825 4875
F 0 "#PWR051" H 12825 4625 50  0001 C CNN
F 1 "GND" H 12825 4725 50  0000 C CNN
F 2 "" H 12825 4875 50  0001 C CNN
F 3 "" H 12825 4875 50  0001 C CNN
    1    12825 4875
    1    0    0    -1
$EndComp
Wire Wire Line
    12825 4875 12825 4775
Wire Wire Line
    13225 3375 13225 3875
$Comp
L power:GND #PWR040
U 1 1 5EE5841C
P 12600 3100
F 0 "#PWR040" H 12600 2850 50  0001 C CNN
F 1 "GND" H 12600 2950 50  0000 C CNN
F 2 "" H 12600 3100 50  0001 C CNN
F 3 "" H 12600 3100 50  0001 C CNN
    1    12600 3100
    1    0    0    -1
$EndComp
Wire Wire Line
    14650 4050 14650 4175
Wire Wire Line
    14900 4175 14650 4175
Connection ~ 14650 4175
Wire Wire Line
    14900 3850 14900 4175
$Comp
L Device:D_Schottky D13
U 1 1 5EEB540E
P 13650 3375
F 0 "D13" H 13650 3275 50  0000 C CNN
F 1 "MBRM120" H 13650 3500 50  0000 C CNN
F 2 "AllModules:DO216AA_1" H 13650 3375 50  0001 C CNN
F 3 "~" H 13650 3375 50  0001 C CNN
    1    13650 3375
    -1   0    0    1
$EndComp
Wire Wire Line
    13500 3375 13225 3375
Wire Wire Line
    13800 3375 14650 3375
Wire Wire Line
    14650 3375 14650 3750
Wire Wire Line
    14650 3375 14900 3375
Wire Wire Line
    14900 3375 14900 3550
Connection ~ 14650 3375
$Comp
L power:GND #PWR052
U 1 1 5EF0055A
P 14650 4950
F 0 "#PWR052" H 14650 4700 50  0001 C CNN
F 1 "GND" H 14650 4800 50  0000 C CNN
F 2 "" H 14650 4950 50  0001 C CNN
F 3 "" H 14650 4950 50  0001 C CNN
    1    14650 4950
    1    0    0    -1
$EndComp
Wire Wire Line
    14650 4500 14650 4175
Wire Wire Line
    14650 4950 14650 4875
$Comp
L Device:C C29
U 1 1 5EF41CB7
P 15200 4500
F 0 "C29" H 15250 4625 50  0000 L CNN
F 1 "10μF" H 15250 4400 50  0000 L CNN
F 2 "AllModules:RC1206_1" H 15238 4350 50  0001 C CNN
F 3 "~" H 15200 4500 50  0001 C CNN
    1    15200 4500
    1    0    0    -1
$EndComp
Wire Wire Line
    14900 3375 15200 3375
Wire Wire Line
    15200 3375 15200 4350
Connection ~ 14900 3375
Wire Wire Line
    15200 4650 15200 4875
Wire Wire Line
    15200 4875 14650 4875
Connection ~ 14650 4875
Wire Wire Line
    14650 4875 14650 4800
Wire Wire Line
    15200 3375 15475 3375
Wire Wire Line
    15475 3375 15475 3550
Connection ~ 15200 3375
Wire Wire Line
    15475 3850 15475 4025
Wire Wire Line
    15475 3200 15475 3375
Connection ~ 15475 3375
$Comp
L Device:C C23
U 1 1 5EFCD4D1
P 11825 4850
F 0 "C23" H 11575 4950 50  0000 L CNN
F 1 "47μF" H 11600 4750 50  0000 L CNN
F 2 "AllModules:C1210_1" H 11863 4700 50  0001 C CNN
F 3 "~" H 11825 4850 50  0001 C CNN
    1    11825 4850
    1    0    0    -1
$EndComp
$Comp
L power:GND #PWR058
U 1 1 5EFCFE35
P 11825 5250
F 0 "#PWR058" H 11825 5000 50  0001 C CNN
F 1 "GND" H 11825 5100 50  0000 C CNN
F 2 "" H 11825 5250 50  0001 C CNN
F 3 "" H 11825 5250 50  0001 C CNN
    1    11825 5250
    1    0    0    -1
$EndComp
Wire Wire Line
    11825 4475 11825 4700
$Comp
L Device:D_Schottky D12
U 1 1 5E928BE8
P 13875 6250
F 0 "D12" V 13875 6100 50  0000 C CNN
F 1 "MBRM120" H 13875 6375 50  0000 C CNN
F 2 "AllModules:DO216AA_1" H 13875 6250 50  0001 C CNN
F 3 "~" H 13875 6250 50  0001 C CNN
    1    13875 6250
    0    -1   -1   0
$EndComp
$Comp
L Device:C C24
U 1 1 5E93D7C9
P 13475 6000
F 0 "C24" V 13650 5925 50  0000 L CNN
F 1 "1uF" V 13300 5900 50  0000 L CNN
F 2 "AllModules:C0805_1b" H 13513 5850 50  0001 C CNN
F 3 "~" H 13475 6000 50  0001 C CNN
    1    13475 6000
    0    -1   -1   0
$EndComp
$Comp
L power:GND #PWR064
U 1 1 5E942887
P 13875 6525
F 0 "#PWR064" H 13875 6275 50  0001 C CNN
F 1 "GND" H 13875 6375 50  0000 C CNN
F 2 "" H 13875 6525 50  0001 C CNN
F 3 "" H 13875 6525 50  0001 C CNN
    1    13875 6525
    1    0    0    -1
$EndComp
$Comp
L Device:C C26
U 1 1 5E946687
P 14575 6300
F 0 "C26" H 14650 6425 50  0000 L CNN
F 1 "10μF" H 14650 6200 50  0000 L CNN
F 2 "AllModules:RC1206_1" H 14613 6150 50  0001 C CNN
F 3 "~" H 14575 6300 50  0001 C CNN
    1    14575 6300
    1    0    0    -1
$EndComp
$Comp
L Device:C C32
U 1 1 5E9480AB
P 15025 6300
F 0 "C32" H 15100 6425 50  0000 L CNN
F 1 "100nF" H 15100 6200 50  0000 L CNN
F 2 "AllModules:C0402_1b" H 15063 6150 50  0001 C CNN
F 3 "~" H 15025 6300 50  0001 C CNN
    1    15025 6300
    1    0    0    -1
$EndComp
$Comp
L power:GND #PWR065
U 1 1 5E948A57
P 14575 6525
F 0 "#PWR065" H 14575 6275 50  0001 C CNN
F 1 "GND" H 14575 6375 50  0000 C CNN
F 2 "" H 14575 6525 50  0001 C CNN
F 3 "" H 14575 6525 50  0001 C CNN
    1    14575 6525
    1    0    0    -1
$EndComp
$Comp
L power:GND #PWR066
U 1 1 5E948DCB
P 15025 6525
F 0 "#PWR066" H 15025 6275 50  0001 C CNN
F 1 "GND" H 15025 6375 50  0000 C CNN
F 2 "" H 15025 6525 50  0001 C CNN
F 3 "" H 15025 6525 50  0001 C CNN
    1    15025 6525
    1    0    0    -1
$EndComp
Wire Wire Line
    12225 4375 12175 4375
Wire Wire Line
    12225 4475 11900 4475
Wire Wire Line
    12175 4375 12175 5200
Connection ~ 11825 4475
Wire Wire Line
    12600 2750 12600 2675
Wire Wire Line
    12600 2675 12825 2675
Wire Wire Line
    12825 2675 12825 3375
Wire Wire Line
    12600 3100 12600 3050
Wire Wire Line
    13075 6000 13200 6000
Wire Wire Line
    13625 6000 13875 6000
Wire Wire Line
    13875 6525 13875 6400
Wire Wire Line
    13875 6100 13875 6000
Connection ~ 13875 6000
Wire Wire Line
    13875 6000 14100 6000
Wire Wire Line
    14400 6000 14575 6000
Wire Wire Line
    14575 6000 14575 6150
Wire Wire Line
    14575 6000 15025 6000
Wire Wire Line
    15025 6000 15025 6150
Connection ~ 14575 6000
Wire Wire Line
    14575 6525 14575 6450
Wire Wire Line
    15025 6525 15025 6450
Wire Wire Line
    15025 6000 15475 6000
Wire Wire Line
    15475 6000 15475 5900
Connection ~ 15025 6000
Wire Wire Line
    11450 4475 11350 4475
Wire Wire Line
    11350 4475 11350 6000
Wire Wire Line
    11350 6000 12775 6000
Wire Wire Line
    11825 4475 11750 4475
$Comp
L Device:C C21
U 1 1 5EBD18AF
P 14075 4825
F 0 "C21" H 14125 4925 50  0000 L CNN
F 1 "47μF" H 14100 4725 50  0000 L CNN
F 2 "AllModules:C1210_1" H 14113 4675 50  0001 C CNN
F 3 "~" H 14075 4825 50  0001 C CNN
    1    14075 4825
    1    0    0    -1
$EndComp
$Comp
L power:GND #PWR060
U 1 1 5EC8139C
P 14075 5275
F 0 "#PWR060" H 14075 5025 50  0001 C CNN
F 1 "GND" H 14075 5125 50  0000 C CNN
F 2 "" H 14075 5275 50  0001 C CNN
F 3 "" H 14075 5275 50  0001 C CNN
    1    14075 5275
    1    0    0    -1
$EndComp
Wire Wire Line
    14075 4975 14075 5275
$Comp
L Device:C C27
U 1 1 5ED70130
P 11900 3925
F 0 "C27" H 11950 4025 50  0000 L CNN
F 1 "100pF" H 11925 3825 50  0000 L CNN
F 2 "AllModules:C0402_1b" H 11938 3775 50  0001 C CNN
F 3 "~" H 11900 3925 50  0001 C CNN
    1    11900 3925
    1    0    0    -1
$EndComp
Wire Wire Line
    12225 4275 12100 4275
Wire Wire Line
    12100 4275 12100 4175
Wire Wire Line
    12100 4175 11900 4175
Wire Wire Line
    11675 4175 11675 4075
Wire Wire Line
    11900 4075 11900 4175
Connection ~ 11900 4175
Wire Wire Line
    11900 4175 11675 4175
Wire Wire Line
    11675 3775 11675 3650
Wire Wire Line
    11675 3650 11900 3650
Wire Wire Line
    11900 3650 11900 3775
Wire Wire Line
    14575 5975 14575 5650
Wire Wire Line
    14575 5650 11200 5650
Wire Wire Line
    11200 5650 11200 3650
Wire Wire Line
    11200 3650 11675 3650
Connection ~ 11675 3650
Wire Wire Line
    13875 4175 14650 4175
Wire Wire Line
    13875 4375 13875 4175
Wire Wire Line
    13750 4275 13750 4575
Connection ~ 13750 4575
Connection ~ 13750 5200
Wire Wire Line
    13750 5100 13750 5200
Wire Wire Line
    13750 4575 13750 4800
Wire Wire Line
    12175 5200 13750 5200
Wire Wire Line
    13750 5275 13750 5200
$Comp
L power:GND #PWR059
U 1 1 5EDF07FA
P 13750 5275
F 0 "#PWR059" H 13750 5025 50  0001 C CNN
F 1 "GND" H 13750 5125 50  0000 C CNN
F 2 "" H 13750 5275 50  0001 C CNN
F 3 "" H 13750 5275 50  0001 C CNN
    1    13750 5275
    1    0    0    -1
$EndComp
$Comp
L Device:C C25
U 1 1 5E96DA27
P 13750 4950
F 0 "C25" H 13775 5050 50  0000 L CNN
F 1 "100nF" H 13775 4850 50  0000 L CNN
F 2 "AllModules:C0402_1b" H 13788 4800 50  0001 C CNN
F 3 "~" H 13750 4950 50  0001 C CNN
    1    13750 4950
    1    0    0    -1
$EndComp
Connection ~ 14075 4475
Wire Wire Line
    14075 4475 14075 4675
Wire Wire Line
    14125 4475 14075 4475
Wire Wire Line
    13425 4275 13750 4275
Wire Wire Line
    13425 4375 13875 4375
Wire Wire Line
    13425 4475 14000 4475
Wire Wire Line
    13425 4575 13550 4575
Wire Wire Line
    13550 4800 13550 4575
Connection ~ 13550 4575
Wire Wire Line
    13550 4575 13750 4575
Wire Wire Line
    13550 5100 13550 5425
Wire Wire Line
    13550 5425 12100 5425
Wire Wire Line
    12100 4275 12100 5425
Connection ~ 12100 4275
Wire Wire Line
    11825 5000 11825 5250
Wire Wire Line
    11350 4475 11350 3375
Connection ~ 11350 4475
Wire Wire Line
    12425 3875 12425 3525
Wire Wire Line
    12425 3525 11075 3525
Wire Wire Line
    11075 3525 11075 6425
Wire Wire Line
    11075 6425 13200 6425
Wire Wire Line
    13200 6425 13200 6000
Connection ~ 13200 6000
Wire Wire Line
    13200 6000 13325 6000
$Comp
L Device:D_Schottky D11
U 1 1 5F2092C5
P 11275 2425
F 0 "D11" H 11300 2300 50  0000 C CNN
F 1 "MBRM120" H 11350 2525 50  0000 C CNN
F 2 "AllModules:DO216AA_1" H 11275 2425 50  0001 C CNN
F 3 "~" H 11275 2425 50  0001 C CNN
    1    11275 2425
    -1   0    0    1
$EndComp
$Comp
L Device:D_Schottky D14
U 1 1 5F20A847
P 11275 2700
F 0 "D14" H 11125 2625 50  0000 C CNN
F 1 "MBRM120" H 11225 2825 50  0000 C CNN
F 2 "AllModules:DO216AA_1" H 11275 2700 50  0001 C CNN
F 3 "~" H 11275 2700 50  0001 C CNN
    1    11275 2700
    -1   0    0    1
$EndComp
Wire Wire Line
    1900 4900 1900 4400
$Comp
L power:GND #PWR039
U 1 1 5F3FEC1F
P 10900 3100
F 0 "#PWR039" H 10900 2850 50  0001 C CNN
F 1 "GND" H 10900 2950 50  0000 C CNN
F 2 "" H 10900 3100 50  0001 C CNN
F 3 "" H 10900 3100 50  0001 C CNN
    1    10900 3100
    1    0    0    -1
$EndComp
Wire Wire Line
    10675 2425 10900 2425
Wire Wire Line
    10900 2425 10900 2700
Wire Wire Line
    11125 2700 10900 2700
Wire Wire Line
    11125 2425 10900 2425
Connection ~ 10900 2425
Wire Wire Line
    11425 2425 11675 2425
$Comp
L Device:D_Schottky D10
U 1 1 5F4E475C
P 11150 1300
F 0 "D10" H 11150 1200 50  0000 C CNN
F 1 "MBRM120" H 11150 1425 50  0000 C CNN
F 2 "AllModules:DO216AA_1" H 11150 1300 50  0001 C CNN
F 3 "~" H 11150 1300 50  0001 C CNN
    1    11150 1300
    -1   0    0    1
$EndComp
$Comp
L Device:R R50
U 1 1 5F4E8BA1
P 10075 1300
F 0 "R50" V 9975 1300 50  0000 C CNN
F 1 "NC" V 10075 1300 50  0000 C CNN
F 2 "AllModules:R0402_1" V 10005 1300 50  0001 C CNN
F 3 "~" H 10075 1300 50  0001 C CNN
    1    10075 1300
    0    1    1    0
$EndComp
$Comp
L power:+5V #PWR033
U 1 1 5F560D4C
P 10675 1175
F 0 "#PWR033" H 10675 1025 50  0001 C CNN
F 1 "+5V" H 10690 1348 50  0000 C CNN
F 2 "" H 10675 1175 50  0001 C CNN
F 3 "" H 10675 1175 50  0001 C CNN
    1    10675 1175
    1    0    0    -1
$EndComp
Wire Wire Line
    11300 1300 11675 1300
Wire Wire Line
    11675 1300 11675 2425
Connection ~ 11675 2425
Wire Wire Line
    10225 1300 10675 1300
Wire Wire Line
    9450 2425 9450 1300
Wire Wire Line
    9450 1300 9925 1300
Connection ~ 9450 2425
Wire Wire Line
    9450 2425 9350 2425
Wire Wire Line
    10675 1175 10675 1300
Connection ~ 10675 1300
Wire Wire Line
    10675 1300 11000 1300
Wire Wire Line
    11675 2425 12825 2425
Wire Wire Line
    12825 2425 12825 2675
Connection ~ 12825 2675
Wire Wire Line
    10925 7700 10925 3375
Wire Wire Line
    10925 3375 11175 3375
Wire Wire Line
    11175 3375 11175 3100
Wire Wire Line
    11175 3100 11675 3100
Wire Wire Line
    11675 2425 11675 2700
Wire Wire Line
    10900 2750 10900 2700
Connection ~ 10900 2700
Wire Wire Line
    10900 3100 10900 3050
Wire Wire Line
    11425 2700 11675 2700
Connection ~ 11675 2700
Wire Wire Line
    11675 2700 11675 3100
Wire Wire Line
    4700 6450 4925 6450
$Comp
L power:+BATT #PWR063
U 1 1 5F852DA9
P 2800 6275
F 0 "#PWR063" H 2800 6125 50  0001 C CNN
F 1 "+BATT" H 2815 6448 50  0000 C CNN
F 2 "" H 2800 6275 50  0001 C CNN
F 3 "" H 2800 6275 50  0001 C CNN
    1    2800 6275
    1    0    0    -1
$EndComp
Wire Wire Line
    2800 6275 2800 6450
NoConn ~ 6175 4050
Wire Wire Line
    14425 4475 14500 4475
Wire Wire Line
    14500 4475 14500 3650
Wire Wire Line
    14500 3650 12825 3650
Connection ~ 12825 3650
Wire Wire Line
    12825 3650 12825 3875
Wire Wire Line
    14500 7450 14500 7650
Text Notes 2650 5875 0    50   ~ 0
BATTERY SWITCH CIRCUIT
Text HLabel 500  4300 0    50   Input ~ 0
BUZ-ACT
Text HLabel 10675 2300 1    50   Output ~ 0
SUPPLY-BUZ
Text HLabel 7600 4950 0    50   Input ~ 0
STOP-INV
Text HLabel 7600 5750 0    50   Input ~ 0
INHIB-STOP-INV
Wire Wire Line
    7800 5750 7600 5750
Connection ~ 7800 5750
Wire Wire Line
    10675 2300 10675 2425
Text HLabel 5050 2200 0    50   Output ~ 0
VCHARG
Text HLabel 4925 6450 2    50   Input ~ 0
VCHARG
Text HLabel 9725 2275 1    50   Output ~ 0
VBAT
Text HLabel 500  4500 0    50   Input ~ 0
SUPPLY-BUZ
Wire Wire Line
    600  4500 500  4500
$Comp
L Regulator_Linear:LM317L_SO8 IC5
U 1 1 5E89DE00
P 2950 2425
F 0 "IC5" H 2950 2667 50  0000 C CNN
F 1 "LM317L_SO8" H 2950 2576 50  0000 C CNN
F 2 "AllModules:MX.A8_COMPOSANT_1" H 2950 2625 50  0001 C CIN
F 3 "http://www.ti.com/lit/ds/snvs775k/snvs775k.pdf" H 2950 2225 50  0001 C CNN
    1    2950 2425
    1    0    0    -1
$EndComp
$Comp
L power:-12V #PWR062
U 1 1 5E965CE1
P 15475 5900
F 0 "#PWR062" H 15475 6000 50  0001 C CNN
F 1 "-12V" H 15490 6073 50  0000 C CNN
F 2 "" H 15475 5900 50  0001 C CNN
F 3 "" H 15475 5900 50  0001 C CNN
    1    15475 5900
    1    0    0    -1
$EndComp
$Comp
L Device:L L4
U 1 1 5E96440E
P 14250 6000
F 0 "L4" V 14350 5975 50  0000 C CNN
F 1 "15μH" V 14175 6000 50  0000 C CNN
F 2 "AllModules:WETPC-S_1" H 14250 6000 50  0001 C CNN
F 3 "~" H 14250 6000 50  0001 C CNN
    1    14250 6000
    0    -1   -1   0
$EndComp
Wire Wire Line
    13175 3375 13225 3375
Connection ~ 13225 3375
Wire Wire Line
    12875 3375 12825 3375
Connection ~ 12825 3375
Wire Wire Line
    12825 3375 12825 3650
Wire Wire Line
    11350 3375 12825 3375
$Comp
L GR106768_Buzzer:Si2315BDS T6
U 1 1 5EB4B38F
P 9150 2525
F 0 "T6" V 9492 2525 50  0000 C CNN
F 1 "Si2315BDS" V 9401 2525 50  0000 C CNN
F 2 "AllModules:SOT23-GSD_1" H 9350 2625 50  0001 C CNN
F 3 "https://www.vishay.com/docs/72014/72014.pdf" H 9150 2525 50  0001 C CNN
    1    9150 2525
    0    1    -1   0
$EndComp
$Comp
L GR106768_Buzzer:Si2315BDS T8
U 1 1 5EB4CC82
P 10175 2525
F 0 "T8" V 10517 2525 50  0000 C CNN
F 1 "Si2315BDS" V 10426 2525 50  0000 C CNN
F 2 "AllModules:SOT23-GSD_1" H 10375 2625 50  0001 C CNN
F 3 "https://www.vishay.com/docs/72014/72014.pdf" H 10175 2525 50  0001 C CNN
    1    10175 2525
    0    1    -1   0
$EndComp
$Comp
L GR106768_Buzzer:Si2312BDS T9
U 1 1 5EB4DE23
P 14400 9100
F 0 "T9" H 14600 9150 50  0000 L CNN
F 1 "Si2312BDS" H 14600 9050 50  0000 L CNN
F 2 "AllModules:SOT23-GSD_1" H 14600 9200 50  0001 C CNN
F 3 "https://www.vishay.com/docs/73235/si2312bds.pdf" H 14400 9100 50  0001 C CNN
    1    14400 9100
    1    0    0    -1
$EndComp
$Comp
L GR106768_Buzzer:Si2312BDS T10
U 1 1 5EBA07D3
P 14400 7850
F 0 "T10" H 14600 7900 50  0000 L CNN
F 1 "Si2312BDS" H 14600 7800 50  0000 L CNN
F 2 "AllModules:SOT23-GSD_1" H 14600 7950 50  0001 C CNN
F 3 "https://www.vishay.com/docs/73235/si2312bds.pdf" H 14400 7850 50  0001 C CNN
    1    14400 7850
    1    0    0    -1
$EndComp
$Comp
L GR106768_Buzzer:Si2312BDS T7
U 1 1 5EBA11BD
P 10075 4950
F 0 "T7" H 10275 5000 50  0000 L CNN
F 1 "Si2312BDS" H 10275 4900 50  0000 L CNN
F 2 "AllModules:SOT23-GSD_1" H 10275 5050 50  0001 C CNN
F 3 "https://www.vishay.com/docs/73235/si2312bds.pdf" H 10075 4950 50  0001 C CNN
    1    10075 4950
    1    0    0    -1
$EndComp
$Comp
L GR106768_Buzzer:Si2312BDS T13
U 1 1 5EBA2D5F
P 4600 7700
F 0 "T13" H 4800 7750 50  0000 L CNN
F 1 "Si2312BDS" H 4800 7650 50  0000 L CNN
F 2 "AllModules:SOT23-GSD_1" H 4800 7800 50  0001 C CNN
F 3 "https://www.vishay.com/docs/73235/si2312bds.pdf" H 4600 7700 50  0001 C CNN
    1    4600 7700
    -1   0    0    -1
$EndComp
$Comp
L GR106768_Buzzer:Si2315BDS T11
U 1 1 5EBAB0F6
P 3600 6550
F 0 "T11" V 3942 6550 50  0000 C CNN
F 1 "Si2315BDS" V 3851 6550 50  0000 C CNN
F 2 "AllModules:SOT23-GSD_1" H 3800 6650 50  0001 C CNN
F 3 "https://www.vishay.com/docs/72014/72014.pdf" H 3600 6550 50  0001 C CNN
    1    3600 6550
    0    1    -1   0
$EndComp
$Comp
L GR106768_Buzzer:Si2315BDS T12
U 1 1 5EBB039C
P 4500 6550
F 0 "T12" V 4842 6550 50  0000 C CNN
F 1 "Si2315BDS" V 4751 6550 50  0000 C CNN
F 2 "AllModules:SOT23-GSD_1" H 4700 6650 50  0001 C CNN
F 3 "https://www.vishay.com/docs/72014/72014.pdf" H 4500 6550 50  0001 C CNN
    1    4500 6550
    0    -1   -1   0
$EndComp
$Comp
L GR106768_Buzzer:bq2002_SN IC6
U 1 1 5EBD254E
P 3450 4450
F 0 "IC6" H 3450 4750 50  0000 C CNN
F 1 "BQ2002C" H 3450 4150 50  0000 C CNN
F 2 "AllModules:MX.A8_COMPOSANT_1" H 3650 4400 50  0001 C CNN
F 3 "https://www.ti.com/lit/ds/symlink/bq2002c.pdf" H 3650 4400 50  0001 C CNN
    1    3450 4450
    -1   0    0    -1
$EndComp
Connection ~ 2300 4500
Wire Wire Line
    2300 4500 2125 4500
Wire Wire Line
    2800 4700 3000 4700
Connection ~ 3000 4700
Wire Wire Line
    3000 4700 3000 4900
$Comp
L power:GND #PWR?
U 1 1 5EF7CFCF
P 1900 5300
F 0 "#PWR?" H 1900 5050 50  0001 C CNN
F 1 "GND" H 1900 5150 50  0000 C CNN
F 2 "" H 1900 5300 50  0001 C CNN
F 3 "" H 1900 5300 50  0001 C CNN
    1    1900 5300
    1    0    0    -1
$EndComp
Wire Wire Line
    1900 5300 1900 5200
$Comp
L GR106768_Buzzer:BAT54C D6
U 1 1 5EFB9F08
P 1400 4400
AR Path="/5EFB9F08" Ref="D6"  Part="1"
AR Path="/5E89C6B8/5EFB9F08" Ref="D6"  Part="1"
F 0 "D6" H 1300 4700 50  0000 L CNN
F 1 "BAT54C" H 1150 4625 50  0000 L CNN
F 2 "AllModules:SOT23-1G_1" H 1125 3925 50  0001 L CNN
F 3 "https://media.digikey.com/pdf/Data%20Sheets/ON%20Semiconductor%20PDFs/BAT54(A,C,S).pdf" H 1320 4500 50  0001 C CNN
F 4 "DIODE ARRAY SCHOTTKY 30V SOT23-3" H 1725 4225 60  0001 C CNN "Description"
F 5 "ON Semiconductor" H 1725 4225 60  0001 C CNN "Mfgr"
F 6 "BAT54C" H 1725 4225 60  0001 C CNN "Mfgr_PN"
F 7 "Digi-Key" H 1575 4225 60  0001 C CNN "Source"
F 8 "10022653" H 1400 4400 50  0001 C CNN "Item Number"
F 9 "BAT54CFSCT-ND" H 1550 4225 60  0001 C CNN "Source_PN"
    1    1400 4400
    1    0    0    -1
$EndComp
Wire Wire Line
    900  4300 1100 4300
Wire Wire Line
    900  4500 1100 4500
Connection ~ 1900 4400
Wire Wire Line
    1900 4400 1800 4400
Wire Wire Line
    1900 4400 3100 4400
Wire Wire Line
    1800 3925 1800 4400
Wire Wire Line
    1800 3925 2350 3925
Connection ~ 1800 4400
Wire Wire Line
    1800 4400 1600 4400
$Comp
L GR106768_Buzzer:Si2312BDS T5
U 1 1 5F15BC4B
P 2550 3925
F 0 "T5" H 2750 3975 50  0000 L CNN
F 1 "Si2312BDS" H 2200 4100 50  0000 L CNN
F 2 "AllModules:SOT23-GSD_1" H 2750 4025 50  0001 C CNN
F 3 "https://www.vishay.com/docs/73235/si2312bds.pdf" H 2550 3925 50  0001 C CNN
    1    2550 3925
    1    0    0    -1
$EndComp
$Comp
L GR106768_Buzzer:BAT54C D?
U 1 1 5EA7338A
P 5700 7700
AR Path="/5EA7338A" Ref="D?"  Part="1"
AR Path="/5E89C6B8/5EA7338A" Ref="D16"  Part="1"
F 0 "D16" H 5600 8000 50  0000 L CNN
F 1 "BAT54C" H 5450 7925 50  0000 L CNN
F 2 "AllModules:SOT23-1G_1" H 5425 7225 50  0001 L CNN
F 3 "https://media.digikey.com/pdf/Data%20Sheets/ON%20Semiconductor%20PDFs/BAT54(A,C,S).pdf" H 5620 7800 50  0001 C CNN
F 4 "DIODE ARRAY SCHOTTKY 30V SOT23-3" H 6025 7525 60  0001 C CNN "Description"
F 5 "ON Semiconductor" H 6025 7525 60  0001 C CNN "Mfgr"
F 6 "BAT54C" H 6025 7525 60  0001 C CNN "Mfgr_PN"
F 7 "Digi-Key" H 5875 7525 60  0001 C CNN "Source"
F 8 "10022653" H 5700 7700 50  0001 C CNN "Item Number"
F 9 "BAT54CFSCT-ND" H 5850 7525 60  0001 C CNN "Source_PN"
    1    5700 7700
    -1   0    0    -1
$EndComp
Wire Wire Line
    6000 7800 7800 7800
Wire Wire Line
    7800 7800 7800 5750
Wire Wire Line
    6000 7600 6100 7600
Wire Wire Line
    6100 7600 6100 7500
Wire Wire Line
    4800 7700 5100 7700
Connection ~ 5100 7700
Wire Wire Line
    5100 7700 5500 7700
Wire Wire Line
    5100 8100 5100 8200
Wire Wire Line
    5100 8200 4500 8200
Wire Wire Line
    4500 8200 4500 7900
Wire Wire Line
    4500 8300 4500 8200
Connection ~ 4500 8200
Wire Wire Line
    4500 6750 4500 7000
Wire Wire Line
    4500 7300 4500 7500
Wire Wire Line
    3600 6750 3600 7000
$Comp
L GR106768_Buzzer:BAT54C D?
U 1 1 5ED7AFF0
P 1900 6450
AR Path="/5ED7AFF0" Ref="D?"  Part="1"
AR Path="/5E89C6B8/5ED7AFF0" Ref="D17"  Part="1"
F 0 "D17" H 1800 6750 50  0000 L CNN
F 1 "BAT54C" H 1650 6675 50  0000 L CNN
F 2 "AllModules:SOT23-1G_1" H 1625 5975 50  0001 L CNN
F 3 "https://media.digikey.com/pdf/Data%20Sheets/ON%20Semiconductor%20PDFs/BAT54(A,C,S).pdf" H 1820 6550 50  0001 C CNN
F 4 "DIODE ARRAY SCHOTTKY 30V SOT23-3" H 2225 6275 60  0001 C CNN "Description"
F 5 "ON Semiconductor" H 2225 6275 60  0001 C CNN "Mfgr"
F 6 "BAT54C" H 2225 6275 60  0001 C CNN "Mfgr_PN"
F 7 "Digi-Key" H 2075 6275 60  0001 C CNN "Source"
F 8 "10022653" H 1900 6450 50  0001 C CNN "Item Number"
F 9 "BAT54CFSCT-ND" H 2050 6275 60  0001 C CNN "Source_PN"
    1    1900 6450
    1    0    0    1
$EndComp
$Comp
L power:+5V #PWR?
U 1 1 5ED7E0FA
P 1400 6250
F 0 "#PWR?" H 1400 6100 50  0001 C CNN
F 1 "+5V" H 1415 6423 50  0000 C CNN
F 2 "" H 1400 6250 50  0001 C CNN
F 3 "" H 1400 6250 50  0001 C CNN
    1    1400 6250
    1    0    0    -1
$EndComp
Wire Wire Line
    1400 6250 1400 6350
Wire Wire Line
    1400 6550 1600 6550
Wire Wire Line
    1600 6350 1400 6350
Connection ~ 1400 6350
Wire Wire Line
    1400 6350 1400 6550
Wire Wire Line
    2100 6450 2300 6450
Wire Wire Line
    2600 6450 2800 6450
Connection ~ 2800 6450
$Comp
L GR106768_Buzzer:TLV3011AIDBV IC9
U 1 1 5EA33A5F
P 13150 8200
F 0 "IC9" H 13300 8400 50  0000 C CNN
F 1 "TLV3011" H 13500 8075 50  0000 C CNN
F 2 "AllModules:SOT23-6_1" H 13350 8200 50  0001 C CNN
F 3 "http://www.ti.com/lit/ds/symlink/tlv3012.pdf" H 13150 8200 50  0001 C CNN
F 4 "IC, COMPARATOR, SOT23-6" H 13150 8200 50  0001 C CNN "Description"
F 5 "10022739" H 13150 8200 50  0001 C CNN "Item Number"
F 6 "TEXAS INSTRUMENTS" H 13150 8200 50  0001 C CNN "Manufacturer"
F 7 "TLV3012AIDBVR" H 13150 8200 50  0001 C CNN "Manufacturer_No"
    1    13150 8200
    1    0    0    -1
$EndComp
Wire Wire Line
    13250 8500 13250 8625
Wire Wire Line
    13150 8500 13150 8600
$Comp
L GR106768_Buzzer:TLV3011AIDBV IC7
U 1 1 5EB4E57D
P 7750 3175
F 0 "IC7" H 7900 3375 50  0000 C CNN
F 1 "TLV3011" H 8100 3050 50  0000 C CNN
F 2 "AllModules:SOT23-6_1" H 7950 3175 50  0001 C CNN
F 3 "http://www.ti.com/lit/ds/symlink/tlv3012.pdf" H 7750 3175 50  0001 C CNN
F 4 "IC, COMPARATOR, SOT23-6" H 7750 3175 50  0001 C CNN "Description"
F 5 "10022739" H 7750 3175 50  0001 C CNN "Item Number"
F 6 "TEXAS INSTRUMENTS" H 7750 3175 50  0001 C CNN "Manufacturer"
F 7 "TLV3012AIDBVR" H 7750 3175 50  0001 C CNN "Manufacturer_No"
    1    7750 3175
    1    0    0    -1
$EndComp
Wire Wire Line
    6600 2425 7750 2425
Wire Wire Line
    7750 2875 7750 2725
Connection ~ 7750 2425
Wire Wire Line
    7750 2425 8725 2425
Wire Wire Line
    7900 2725 7750 2725
Connection ~ 7750 2725
Wire Wire Line
    7750 2725 7750 2425
Wire Wire Line
    7750 3475 7750 3550
$Comp
L GR106768_Buzzer:R0805_33Ohm_1% R36
U 1 1 5EA94404
P 3475 2425
F 0 "R36" H 3475 2525 50  0000 C CNN
F 1 "33" H 3475 2425 50  0000 C CNN
F 2 "AllModules:R0805_1b" H 3475 2625 50  0001 C CNN
F 3 "~" H 3475 2425 50  0001 C CNN
F 4 "RESISTOR 33 OHM +/- 1% 0,125W,0805" H 3475 2625 50  0001 C CNN "Description"
F 5 "10025604" H 3475 2625 50  0000 C CNN "Item Number"
    1    3475 2425
    1    0    0    -1
$EndComp
$Comp
L GR106768_Buzzer:R0805_470Ohm_1% R71
U 1 1 5EA99BE9
P 2450 6450
F 0 "R71" H 2450 6550 50  0000 C CNN
F 1 "470" H 2450 6450 50  0000 C CNN
F 2 "AllModules:R0805_1b" H 2450 6650 50  0001 C CNN
F 3 "~" H 2450 6450 50  0001 C CNN
F 4 "RESISTOR,470 OHM, 0.125W,+/-1%, 0805" H 2450 6650 50  0001 C CNN "Description"
F 5 "10022697" H 2450 6650 50  0000 C CNN "Item Number"
    1    2450 6450
    1    0    0    -1
$EndComp
$Comp
L GR106768_Buzzer:R0402_59k_1% R45
U 1 1 5EE70D4C
P 7750 3700
F 0 "R45" H 7750 3800 50  0000 C CNN
F 1 "59k" H 7750 3700 50  0000 C CNN
F 2 "AllModules:R0402_1" H 7750 3900 50  0001 C CNN
F 3 "~" H 7750 3700 50  0001 C CNN
F 4 "RESISTOR, 59k, +/-1%, 0.063W, 0402" H 7750 3900 50  0001 C CNN "Description"
F 5 "10022151" H 7750 3900 50  0000 C CNN "Item Number"
    1    7750 3700
    0    1    1    0
$EndComp
Wire Wire Line
    10925 7700 11275 7700
Connection ~ 11275 7700
Wire Wire Line
    14500 8700 15000 8700
Connection ~ 14500 8700
Text Label 15000 8700 2    50   ~ 0
SHDN2
Text Label 15000 7450 2    50   ~ 0
SHDN1
Text Label 14300 4325 2    50   ~ 0
SHDN1
Wire Wire Line
    14000 4325 14300 4325
Wire Wire Line
    14000 4325 14000 4475
Connection ~ 14000 4475
Wire Wire Line
    14000 4475 14075 4475
Wire Wire Line
    11900 4325 11550 4325
Text Label 11550 4325 0    50   ~ 0
SHDN2
Wire Wire Line
    11900 4325 11900 4475
Connection ~ 11900 4475
Wire Wire Line
    11900 4475 11825 4475
$Comp
L GR106768_Buzzer:R0402_1k_1% R33
U 1 1 5F797D1C
P 1700 2750
F 0 "R33" H 1700 2850 50  0000 C CNN
F 1 "1k" H 1700 2750 50  0000 C CNN
F 2 "AllModules:R0402_1" H 1700 2950 50  0001 C CNN
F 3 "~" H 1700 2750 50  0001 C CNN
F 4 "RESISTOR, 1k, +/-1%, 0.063W, 0402" H 1700 2950 50  0001 C CNN "Description"
F 5 "10022153" H 1700 2950 50  0000 C CNN "Item Number"
    1    1700 2750
    0    1    1    0
$EndComp
$Comp
L GR106768_Buzzer:R0402_10k_1% R66
U 1 1 5F79A593
P 2975 1975
F 0 "R66" H 2975 2075 50  0000 C CNN
F 1 "10k" H 2975 1975 50  0000 C CNN
F 2 "AllModules:R0402_1" H 2975 2175 50  0001 C CNN
F 3 "~" H 2975 1975 50  0001 C CNN
F 4 "RESISTOR, 10k, +/-1%, 0.063W, 0402" H 2975 2175 50  0001 C CNN "Description"
F 5 "10022150" H 2975 2175 50  0000 C CNN "Item Number"
    1    2975 1975
    1    0    0    -1
$EndComp
$Comp
L GR106768_Buzzer:R0402_100k_1% R38
U 1 1 5F79AE7D
P 4125 3375
F 0 "R38" H 4125 3475 50  0000 C CNN
F 1 "100k" H 4125 3375 50  0000 C CNN
F 2 "AllModules:R0402_1" H 4125 3575 50  0001 C CNN
F 3 "~" H 4125 3375 50  0001 C CNN
F 4 "RESISTOR, 100k, +/-1%, 0.063W, 0402" H 4125 3575 50  0001 C CNN "Description"
F 5 "10022149" H 4125 3575 50  0000 C CNN "Item Number"
    1    4125 3375
    0    1    1    0
$EndComp
$Comp
L GR106768_Buzzer:R0402_100k_1% R39
U 1 1 5F79C30E
P 4125 3775
F 0 "R39" H 4125 3875 50  0000 C CNN
F 1 "100k" H 4125 3775 50  0000 C CNN
F 2 "AllModules:R0402_1" H 4125 3975 50  0001 C CNN
F 3 "~" H 4125 3775 50  0001 C CNN
F 4 "RESISTOR, 100k, +/-1%, 0.063W, 0402" H 4125 3975 50  0001 C CNN "Description"
F 5 "10022149" H 4125 3975 50  0000 C CNN "Item Number"
    1    4125 3775
    0    1    1    0
$EndComp
$Comp
L GR106768_Buzzer:R0402_220Ohm_1% R37
U 1 1 5F79CD23
P 3475 2800
F 0 "R37" H 3475 2900 50  0000 C CNN
F 1 "220" H 3475 2800 50  0000 C CNN
F 2 "AllModules:R0402_1" H 3475 3000 50  0001 C CNN
F 3 "~" H 3475 2800 50  0001 C CNN
F 4 "RESISTOR, 220Ohm, +/-1%, 0.063W, 0402" H 3475 3000 50  0001 C CNN "Description"
F 5 "10021387" H 3475 3000 50  0000 C CNN "Item Number"
    1    3475 2800
    1    0    0    -1
$EndComp
$Comp
L GR106768_Buzzer:R0402_100k_1% R42
U 1 1 5F7A03FF
P 5225 4900
F 0 "R42" H 5225 5000 50  0000 C CNN
F 1 "100k" H 5225 4900 50  0000 C CNN
F 2 "AllModules:R0402_1" H 5225 5100 50  0001 C CNN
F 3 "~" H 5225 4900 50  0001 C CNN
F 4 "RESISTOR, 100k, +/-1%, 0.063W, 0402" H 5225 5100 50  0001 C CNN "Description"
F 5 "10022149" H 5225 5100 50  0000 C CNN "Item Number"
    1    5225 4900
    0    1    1    0
$EndComp
$Comp
L GR106768_Buzzer:R0402_180k_1% R41
U 1 1 5F7A2080
P 5225 4250
F 0 "R41" H 5225 4350 50  0000 C CNN
F 1 "180k" H 5225 4250 50  0000 C CNN
F 2 "AllModules:R0402_1" H 5225 4450 50  0001 C CNN
F 3 "~" H 5225 4250 50  0001 C CNN
F 4 "RESISTOR, 180k, +/-1%, 0.063W, 0402" H 5225 4450 50  0001 C CNN "Description"
F 5 "10021388" H 5225 4450 50  0000 C CNN "Item Number"
    1    5225 4250
    0    1    1    0
$EndComp
$Comp
L GR106768_Buzzer:R0402_4.7k_1% R40
U 1 1 5F7A36E0
P 4475 3650
F 0 "R40" H 4475 3750 50  0000 C CNN
F 1 "4.7k" H 4475 3650 50  0000 C CNN
F 2 "AllModules:R0402_1" H 4475 3850 50  0001 C CNN
F 3 "~" H 4475 3650 50  0001 C CNN
F 4 "RESISTOR, 4.7k, +/-1%, 0.063W, 0402" H 4475 3850 50  0001 C CNN "Description"
F 5 "10021385" H 4475 3850 50  0000 C CNN "Item Number"
    1    4475 3650
    0    1    1    0
$EndComp
$Comp
L GR106768_Buzzer:R0402_10k_1% R68
U 1 1 5F7AA4CB
P 4500 7150
F 0 "R68" H 4500 7250 50  0000 C CNN
F 1 "10k" H 4500 7150 50  0000 C CNN
F 2 "AllModules:R0402_1" H 4500 7350 50  0001 C CNN
F 3 "~" H 4500 7150 50  0001 C CNN
F 4 "RESISTOR, 10k, +/-1%, 0.063W, 0402" H 4500 7350 50  0001 C CNN "Description"
F 5 "10022150" H 4500 7350 50  0000 C CNN "Item Number"
    1    4500 7150
    0    1    1    0
$EndComp
Wire Wire Line
    5100 7800 5100 7700
$Comp
L GR106768_Buzzer:R0402_10k_1% R70
U 1 1 5F7A4F68
P 5100 7950
F 0 "R70" H 5100 8050 50  0000 C CNN
F 1 "10k" H 5100 7950 50  0000 C CNN
F 2 "AllModules:R0402_1" H 5100 8150 50  0001 C CNN
F 3 "~" H 5100 7950 50  0001 C CNN
F 4 "RESISTOR, 10k, +/-1%, 0.063W, 0402" H 5100 8150 50  0001 C CNN "Description"
F 5 "10022150" H 5100 8150 50  0000 C CNN "Item Number"
    1    5100 7950
    0    1    1    0
$EndComp
$Comp
L GR106768_Buzzer:R0402_10k_1% R32
U 1 1 5F7AD158
P 1900 5050
F 0 "R32" H 1900 5150 50  0000 C CNN
F 1 "10k" H 1900 5050 50  0000 C CNN
F 2 "AllModules:R0402_1" H 1900 5250 50  0001 C CNN
F 3 "~" H 1900 5050 50  0001 C CNN
F 4 "RESISTOR, 10k, +/-1%, 0.063W, 0402" H 1900 5250 50  0001 C CNN "Description"
F 5 "10022150" H 1900 5250 50  0000 C CNN "Item Number"
    1    1900 5050
    0    1    1    0
$EndComp
$Comp
L GR106768_Buzzer:R0402_0Ohm R31
U 1 1 5F7D0109
P 750 4500
F 0 "R31" H 750 4600 50  0000 C CNN
F 1 "R0402_0Ohm" H 750 4500 50  0000 C CNN
F 2 "AllModules:R0402_1" H 750 4700 50  0001 C CNN
F 3 "~" H 750 4500 50  0001 C CNN
F 4 "RESISTOR, 000, 0.063W, 0402" H 750 4700 50  0001 C CNN "Description"
F 5 "10021557" H 750 4700 50  0000 C CNN "Item Number"
    1    750  4500
    1    0    0    -1
$EndComp
$Comp
L GR106768_Buzzer:R0402_0Ohm R30
U 1 1 5F7D13B9
P 750 4300
F 0 "R30" H 750 4400 50  0000 C CNN
F 1 "R0402_0Ohm" H 750 4300 50  0000 C CNN
F 2 "AllModules:R0402_1" H 750 4500 50  0001 C CNN
F 3 "~" H 750 4300 50  0001 C CNN
F 4 "RESISTOR, 000, 0.063W, 0402" H 750 4500 50  0001 C CNN "Description"
F 5 "10021557" H 750 4500 50  0000 C CNN "Item Number"
    1    750  4300
    1    0    0    -1
$EndComp
$Comp
L GR106768_Buzzer:R0402_10k_1% R34
U 1 1 5F7D1FCC
P 2650 4700
F 0 "R34" H 2650 4800 50  0000 C CNN
F 1 "10k" H 2650 4700 50  0000 C CNN
F 2 "AllModules:R0402_1" H 2650 4900 50  0001 C CNN
F 3 "~" H 2650 4700 50  0001 C CNN
F 4 "RESISTOR, 10k, +/-1%, 0.063W, 0402" H 2650 4900 50  0001 C CNN "Description"
F 5 "10022150" H 2650 4900 50  0000 C CNN "Item Number"
    1    2650 4700
    -1   0    0    1
$EndComp
$Comp
L GR106768_Buzzer:R0402_33k_1% R35
U 1 1 5F7D3642
P 3000 5050
F 0 "R35" H 3000 5150 50  0000 C CNN
F 1 "33k" H 3000 5050 50  0000 C CNN
F 2 "AllModules:R0402_1" H 3000 5250 50  0001 C CNN
F 3 "~" H 3000 5050 50  0001 C CNN
F 4 "RESISTOR, 33k, +/-1%, 0.063W, 0402" H 3000 5250 50  0001 C CNN "Description"
F 5 "10021558" H 3000 5250 50  0000 C CNN "Item Number"
    1    3000 5050
    0    1    1    0
$EndComp
$Comp
L GR106768_Buzzer:R0402_100k_1% R67
U 1 1 5F7D65CC
P 3125 6700
F 0 "R67" H 3125 6800 50  0000 C CNN
F 1 "100k" H 3125 6700 50  0000 C CNN
F 2 "AllModules:R0402_1" H 3125 6900 50  0001 C CNN
F 3 "~" H 3125 6700 50  0001 C CNN
F 4 "RESISTOR, 100k, +/-1%, 0.063W, 0402" H 3125 6900 50  0001 C CNN "Description"
F 5 "10022149" H 3125 6900 50  0000 C CNN "Item Number"
    1    3125 6700
    0    1    1    0
$EndComp
$Comp
L GR106768_Buzzer:R0402_10k_1% R49
U 1 1 5F7D92D0
P 8850 5300
F 0 "R49" H 8850 5400 50  0000 C CNN
F 1 "10k" H 8850 5300 50  0000 C CNN
F 2 "AllModules:R0402_1" H 8850 5500 50  0001 C CNN
F 3 "~" H 8850 5300 50  0001 C CNN
F 4 "RESISTOR, 10k, +/-1%, 0.063W, 0402" H 8850 5500 50  0001 C CNN "Description"
F 5 "10022150" H 8850 5500 50  0000 C CNN "Item Number"
    1    8850 5300
    0    1    1    0
$EndComp
$Comp
L GR106768_Buzzer:R0402_10k_1% R62
U 1 1 5F7DCC49
P 11900 8350
F 0 "R62" H 11900 8450 50  0000 C CNN
F 1 "10k" H 11900 8350 50  0000 C CNN
F 2 "AllModules:R0402_1" H 11900 8550 50  0001 C CNN
F 3 "~" H 11900 8350 50  0001 C CNN
F 4 "RESISTOR, 10k, +/-1%, 0.063W, 0402" H 11900 8550 50  0001 C CNN "Description"
F 5 "10022150" H 11900 8550 50  0000 C CNN "Item Number"
    1    11900 8350
    0    1    1    0
$EndComp
$Comp
L GR106768_Buzzer:R0402_10k_1% R61
U 1 1 5F7DF763
P 11550 8100
F 0 "R61" H 11550 8200 50  0000 C CNN
F 1 "10k" H 11550 8100 50  0000 C CNN
F 2 "AllModules:R0402_1" H 11550 8300 50  0001 C CNN
F 3 "~" H 11550 8100 50  0001 C CNN
F 4 "RESISTOR, 10k, +/-1%, 0.063W, 0402" H 11550 8300 50  0001 C CNN "Description"
F 5 "10022150" H 11550 8300 50  0000 C CNN "Item Number"
    1    11550 8100
    1    0    0    -1
$EndComp
$Comp
L GR106768_Buzzer:R0402_100k_1% R63
U 1 1 5F7E1CDC
P 14175 7450
F 0 "R63" H 14175 7550 50  0000 C CNN
F 1 "100k" H 14175 7450 50  0000 C CNN
F 2 "AllModules:R0402_1" H 14175 7650 50  0001 C CNN
F 3 "~" H 14175 7450 50  0001 C CNN
F 4 "RESISTOR, 100k, +/-1%, 0.063W, 0402" H 14175 7650 50  0001 C CNN "Description"
F 5 "10022149" H 14175 7650 50  0000 C CNN "Item Number"
    1    14175 7450
    1    0    0    -1
$EndComp
$Comp
L GR106768_Buzzer:R0402_100k_1% R64
U 1 1 5F7E4EAE
P 14175 8700
F 0 "R64" H 14175 8800 50  0000 C CNN
F 1 "100k" H 14175 8700 50  0000 C CNN
F 2 "AllModules:R0402_1" H 14175 8900 50  0001 C CNN
F 3 "~" H 14175 8700 50  0001 C CNN
F 4 "RESISTOR, 100k, +/-1%, 0.063W, 0402" H 14175 8900 50  0001 C CNN "Description"
F 5 "10022149" H 14175 8900 50  0000 C CNN "Item Number"
    1    14175 8700
    1    0    0    -1
$EndComp
$Comp
L GR106768_Buzzer:R0402_15k_1% R55
U 1 1 5F7E7532
P 13550 4950
F 0 "R55" H 13550 5050 50  0000 C CNN
F 1 "15k" H 13550 4950 50  0000 C CNN
F 2 "AllModules:R0402_1" H 13550 5150 50  0001 C CNN
F 3 "~" H 13550 4950 50  0001 C CNN
F 4 "RESISTOR, 15k, +/-1%, 0.063W, 0402" H 13550 5150 50  0001 C CNN "Description"
F 5 "10024439" H 13550 5150 50  0000 C CNN "Item Number"
    1    13550 4950
    0    1    1    0
$EndComp
$Comp
L GR106768_Buzzer:R0402_4.99k_1% R58
U 1 1 5F7E993E
P 14650 4650
F 0 "R58" H 14650 4750 50  0000 C CNN
F 1 "4.99k" H 14650 4650 43  0000 C CNN
F 2 "AllModules:R0402_1" H 14650 4850 50  0001 C CNN
F 3 "~" H 14650 4650 50  0001 C CNN
F 4 "RESISTOR, 4.99k, +/-1%, 0.063W, 0402" H 14650 4850 50  0001 C CNN "Description"
F 5 "10024442" H 14650 4850 50  0000 C CNN "Item Number"
    1    14650 4650
    0    1    1    0
$EndComp
$Comp
L GR106768_Buzzer:R0402_54.9k_1% R57
U 1 1 5F7EBE0F
P 14650 3900
F 0 "R57" H 14650 4000 50  0000 C CNN
F 1 "54.9k" H 14650 3900 43  0000 C CNN
F 2 "AllModules:R0402_1" H 14650 4100 50  0001 C CNN
F 3 "~" H 14650 3900 50  0001 C CNN
F 4 "RESISTOR, 54.9k, +/-1%, 0.063W, 0402" H 14650 4100 50  0001 C CNN "Description"
F 5 "10024441" H 14650 4100 50  0000 C CNN "Item Number"
    1    14650 3900
    0    1    1    0
$EndComp
$Comp
L GR106768_Buzzer:R0402_47k_1% R54
U 1 1 5F7ED945
P 14275 4475
F 0 "R54" H 14275 4575 50  0000 C CNN
F 1 "47k" H 14275 4475 50  0000 C CNN
F 2 "AllModules:R0402_1" H 14275 4675 50  0001 C CNN
F 3 "~" H 14275 4475 50  0001 C CNN
F 4 "RESISTOR, 47k, +/-1% 0, 063W, 0402" H 14275 4675 50  0001 C CNN "Description"
F 5 "10025554" H 14275 4675 50  0000 C CNN "Item Number"
    1    14275 4475
    -1   0    0    1
$EndComp
$Comp
L GR106768_Buzzer:R0402_47k_1% R53
U 1 1 5F7F0C36
P 11600 4475
F 0 "R53" H 11600 4575 50  0000 C CNN
F 1 "47k" H 11600 4475 50  0000 C CNN
F 2 "AllModules:R0402_1" H 11600 4675 50  0001 C CNN
F 3 "~" H 11600 4475 50  0001 C CNN
F 4 "RESISTOR, 47k, +/-1% 0, 063W, 0402" H 11600 4675 50  0001 C CNN "Description"
F 5 "10025554" H 11600 4675 50  0000 C CNN "Item Number"
    1    11600 4475
    -1   0    0    1
$EndComp
$Comp
L GR106768_Buzzer:R0402_182k_1% R56
U 1 1 5F7F2636
P 11675 3925
F 0 "R56" H 11675 4025 50  0000 C CNN
F 1 "182k" H 11675 3925 50  0000 C CNN
F 2 "AllModules:R0402_1" H 11675 4125 50  0001 C CNN
F 3 "~" H 11675 3925 50  0001 C CNN
F 4 "RESISTOR, 182k, +/-1%, 0.063W, 0402" H 11675 4125 50  0001 C CNN "Description"
F 5 "10024440" H 11675 4125 50  0000 C CNN "Item Number"
    1    11675 3925
    0    1    1    0
$EndComp
$Comp
L GR106768_Buzzer:R0402_10k_1% R51
U 1 1 5F7F446A
P 9725 2700
F 0 "R51" H 9725 2800 50  0000 C CNN
F 1 "10k" H 9725 2700 50  0000 C CNN
F 2 "AllModules:R0402_1" H 9725 2900 50  0001 C CNN
F 3 "~" H 9725 2700 50  0001 C CNN
F 4 "RESISTOR, 10k, +/-1%, 0.063W, 0402" H 9725 2900 50  0001 C CNN "Description"
F 5 "10022150" H 9725 2900 50  0000 C CNN "Item Number"
    1    9725 2700
    0    1    1    0
$EndComp
$Comp
L GR106768_Buzzer:R0402_10k_1% R52
U 1 1 5F7FA2B9
P 10675 2700
F 0 "R52" H 10675 2800 50  0000 C CNN
F 1 "10k" H 10675 2700 50  0000 C CNN
F 2 "AllModules:R0402_1" H 10675 2900 50  0001 C CNN
F 3 "~" H 10675 2700 50  0001 C CNN
F 4 "RESISTOR, 10k, +/-1%, 0.063W, 0402" H 10675 2900 50  0001 C CNN "Description"
F 5 "10022150" H 10675 2900 50  0000 C CNN "Item Number"
    1    10675 2700
    0    1    1    0
$EndComp
$Comp
L GR106768_Buzzer:R0402_2.2k_1% R65
U 1 1 5F7FBFEE
P 10900 2900
F 0 "R65" H 10900 3000 50  0000 C CNN
F 1 "2.2k" H 10900 2900 50  0000 C CNN
F 2 "AllModules:R0402_1" H 10900 3100 50  0001 C CNN
F 3 "~" H 10900 2900 50  0001 C CNN
F 4 "RESISTOR, 2.2k, +/-1%, 0.063W, 0402" H 10900 3100 50  0001 C CNN "Description"
F 5 "10022957" H 10900 3100 50  0000 C CNN "Item Number"
    1    10900 2900
    0    1    1    0
$EndComp
$Comp
L GR106768_Buzzer:R0402_100k_1% R47
U 1 1 5F7FDDA7
P 8725 2675
F 0 "R47" H 8725 2775 50  0000 C CNN
F 1 "100k" H 8725 2675 50  0000 C CNN
F 2 "AllModules:R0402_1" H 8725 2875 50  0001 C CNN
F 3 "~" H 8725 2675 50  0001 C CNN
F 4 "RESISTOR, 100k, +/-1%, 0.063W, 0402" H 8725 2875 50  0001 C CNN "Description"
F 5 "10022149" H 8725 2875 50  0000 C CNN "Item Number"
    1    8725 2675
    0    1    1    0
$EndComp
$Comp
L GR106768_Buzzer:R0402_1M_1% R46
U 1 1 5F804D9A
P 8375 3450
F 0 "R46" H 8375 3550 50  0000 C CNN
F 1 "1M" H 8375 3450 50  0000 C CNN
F 2 "AllModules:R0402_1" H 8375 3650 50  0001 C CNN
F 3 "~" H 8375 3450 50  0001 C CNN
F 4 "RESISTOR, 1M, +/-1%, 0.063W, 0402" H 8375 3650 50  0001 C CNN "Description"
F 5 "10021462" H 8375 3650 50  0000 C CNN "Item Number"
    1    8375 3450
    0    1    1    0
$EndComp
$Comp
L GR106768_Buzzer:R0402_1.5M_1% R43
U 1 1 5F806711
P 6600 2775
F 0 "R43" H 6600 2875 50  0000 C CNN
F 1 "1.5M" H 6600 2775 50  0000 C CNN
F 2 "AllModules:R0402_1" H 6600 2975 50  0001 C CNN
F 3 "~" H 6600 2775 50  0001 C CNN
F 4 "RESISTOR, 1.5M, +/-1%, 0.063W, 0402" H 6600 2975 50  0001 C CNN "Description"
F 5 "10021389" H 6600 2975 50  0000 C CNN "Item Number"
    1    6600 2775
    0    1    1    0
$EndComp
$Comp
L GR106768_Buzzer:R0402_680k_1% R44
U 1 1 5F807891
P 6600 3375
F 0 "R44" H 6600 3475 50  0000 C CNN
F 1 "680k" H 6600 3375 50  0000 C CNN
F 2 "AllModules:R0402_1" H 6600 3575 50  0001 C CNN
F 3 "~" H 6600 3375 50  0001 C CNN
F 4 "RESISTOR, 680k, +/-1%, 0.063W, 0402" H 6600 3575 50  0001 C CNN "Description"
F 5 "10021391" H 6600 3575 50  0000 C CNN "Item Number"
    1    6600 3375
    0    1    1    0
$EndComp
$EndSCHEMATC
