(module FILM18_HORIZONTAL_1 (layer F.Cu) (tedit 0)
  (attr smd)
  (fp_text reference REF** (at 2.032 -1.016 unlocked) (layer F.SilkS) hide
    (effects (font (size 1.332992 1.40208) (thickness 0.254)))
  )
  (fp_text value FILM18_HORIZONTAL (at 8.636 -1.016 unlocked) (layer F.SilkS) hide
    (effects (font (size 1.332992 1.40208) (thickness 0.254)))
  )
  (fp_arc (start -94.9706 75.0062) (end -95.118467 75.701859) (angle -188) (layer Dwgs.User) (width 0.2032))
  (fp_arc (start -95.25 76.8096) (end -95.384939 77.559557) (angle -184.3) (layer Dwgs.User) (width 0.2032))
  (fp_arc (start -94.5134 73.5076) (end -91.243535 73.96715) (angle -90) (layer Dwgs.User) (width 0.1))
  (fp_arc (start -95.1484 75.8952) (end -95.12719 75.744283) (angle -180) (layer Dwgs.User) (width 0.2032))
  (fp_arc (start -93.9292 75.7428) (end -94.7096 79.446065) (angle -90) (layer Dwgs.User) (width 0.1))
  (fp_arc (start -95.4786 78.613) (end -95.622822 79.309423) (angle -187.4) (layer Dwgs.User) (width 0.2032))
  (fp_arc (start -95.4024 77.724) (end -95.38119 77.573083) (angle -180) (layer Dwgs.User) (width 0.2032))
  (fp_arc (start -96.9518 75.6412) (end -96.974589 75.791886) (angle -181.2) (layer Dwgs.User) (width 0.2032))
  (fp_arc (start -95.377 72.39) (end -94.819071 72.421193) (angle -80.3) (layer Dwgs.User) (width 0.1))
  (fp_arc (start -95.0214 75.0316) (end -94.331554 76.005905) (angle -122.1) (layer Dwgs.User) (width 0.1))
  (fp_arc (start -97.2058 77.4954) (end -97.228589 77.646086) (angle -181.2) (layer Dwgs.User) (width 0.2032))
  (fp_arc (start -97.5106 70.2564) (end -98.743685 70.087488) (angle -89.5) (layer Dwgs.User) (width 0.1))
  (fp_arc (start -95.1738 76.835) (end -94.602006 77.853926) (angle -105.4) (layer Dwgs.User) (width 0.1))
  (fp_arc (start -99.6696 74.3458) (end -99.615037 73.636696) (angle -172.8) (layer Dwgs.User) (width 0.2032))
  (fp_arc (start -98.1456 70.2564) (end -98.15943 69.646957) (angle -71.4) (layer Dwgs.User) (width 0.1))
  (fp_arc (start -95.25 78.613) (end -94.727998 79.454904) (angle -107.8) (layer Dwgs.User) (width 0.1))
  (fp_arc (start -99.9744 76.1492) (end -99.857825 75.39617) (angle -181.7) (layer Dwgs.User) (width 0.2032))
  (fp_arc (start -99.6696 78.0288) (end -99.557118 77.326551) (angle -182.2) (layer Dwgs.User) (width 0.2032))
  (fp_arc (start -99.822 74.4474) (end -100.629891 74.536592) (angle -51.8) (layer Dwgs.User) (width 0.1))
  (fp_arc (start -98.0186 79.375) (end -98.044841 80.314434) (angle -89.8) (layer Dwgs.User) (width 0.1))
  (fp_arc (start -99.9236 76.1238) (end -101.032141 76.265807) (angle -71.8) (layer Dwgs.User) (width 0.1))
  (fp_arc (start -101.981 72.136) (end -101.868518 71.433751) (angle -182.2) (layer Dwgs.User) (width 0.1))
  (fp_arc (start -100.2284 75.9206) (end -100.249676 75.158897) (angle -90.7) (layer Dwgs.User) (width 0.1))
  (fp_arc (start -99.8474 78.1558) (end -100.684125 78.205511) (angle -79) (layer Dwgs.User) (width 0.1))
  (fp_arc (start -101.2952 75.184) (end -101.192534 74.480249) (angle -180.5) (layer Dwgs.User) (width 0.1))
  (fp_arc (start -99.8474 77.978) (end -100.137261 77.245894) (angle -63.1) (layer Dwgs.User) (width 0.1))
  (fp_arc (start -101.6254 76.962) (end -101.512769 76.20837) (angle -181) (layer Dwgs.User) (width 0.1))
  (fp_arc (start -101.3968 78.9686) (end -101.401322 78.105012) (angle -163.4) (layer Dwgs.User) (width 0.1))
  (fp_arc (start 106.7054 -76.1492) (end 106.657175 -77.774085) (angle -86.5) (layer Dwgs.User) (width 0.1))
  (fp_arc (start 106.6292 -76.2254) (end 106.677425 -74.600515) (angle -86.5) (layer Dwgs.User) (width 0.1))
  (fp_circle (center 106.68 -76.2) (end 108.2548 -76.2) (layer Dwgs.User) (width 0.1016))
  (fp_circle (center 106.68 76.2) (end 108.2548 76.2) (layer Dwgs.User) (width 0.1016))
  (fp_arc (start 106.6292 76.1492) (end 106.677425 77.774085) (angle -86.5) (layer Dwgs.User) (width 0.1))
  (fp_arc (start 106.7054 76.2254) (end 106.657175 74.600515) (angle -86.5) (layer Dwgs.User) (width 0.1))
  (fp_arc (start -106.6292 -76.1492) (end -106.677425 -77.774085) (angle -86.5) (layer Dwgs.User) (width 0.1))
  (fp_arc (start -106.7054 -76.2254) (end -106.657175 -74.600515) (angle -86.5) (layer Dwgs.User) (width 0.1))
  (fp_circle (center -106.68 -76.2) (end -105.1052 -76.2) (layer Dwgs.User) (width 0.1016))
  (fp_arc (start -100.965 74.3458) (end -100.821993 75.042474) (angle -172.9) (layer Dwgs.User) (width 0.2032))
  (fp_arc (start -98.6536 72.136) (end -98.568159 72.842049) (angle -182.1) (layer Dwgs.User) (width 0.1))
  (fp_arc (start -100.6602 76.1492) (end -100.564696 76.905191) (angle -181.7) (layer Dwgs.User) (width 0.2032))
  (fp_arc (start -100.965 78.0288) (end -100.879559 78.734849) (angle -182.2) (layer Dwgs.User) (width 0.2032))
  (fp_arc (start -99.3394 75.184) (end -99.244109 75.888787) (angle -180.5) (layer Dwgs.User) (width 0.1))
  (fp_arc (start -99.0092 76.962) (end -98.909739 77.717481) (angle -181) (layer Dwgs.User) (width 0.1))
  (fp_arc (start -100.8126 74.4474) (end -100.383085 75.137444) (angle -51.8) (layer Dwgs.User) (width 0.1))
  (fp_arc (start -100.4062 75.9206) (end -99.644814 75.95118) (angle -90.7) (layer Dwgs.User) (width 0.1))
  (fp_arc (start -103.124 70.2564) (end -102.946484 71.488275) (angle -89.5) (layer Dwgs.User) (width 0.1))
  (fp_arc (start -99.2378 78.9686) (end -98.995416 79.797488) (angle -163.4) (layer Dwgs.User) (width 0.1))
  (fp_arc (start -103.6828 75.6412) (end -103.705589 75.490514) (angle -178.8) (layer Dwgs.User) (width 0.2032))
  (fp_arc (start -100.711 76.1238) (end -100.499667 77.221237) (angle -71.8) (layer Dwgs.User) (width 0.1))
  (fp_arc (start -102.489 70.2564) (end -101.906978 70.07512) (angle -71.4) (layer Dwgs.User) (width 0.1))
  (fp_arc (start -103.4288 77.47) (end -103.451589 77.319314) (angle -178.8) (layer Dwgs.User) (width 0.2032))
  (fp_arc (start -100.7872 78.1558) (end -100.676343 78.986637) (angle -79) (layer Dwgs.User) (width 0.1))
  (fp_arc (start -105.4862 75.8952) (end -105.46499 76.046117) (angle -180) (layer Dwgs.User) (width 0.2032))
  (fp_arc (start -105.664 75.0062) (end -105.713611 74.296732) (angle -188) (layer Dwgs.User) (width 0.2032))
  (fp_arc (start -105.2322 77.724) (end -105.21099 77.874917) (angle -180) (layer Dwgs.User) (width 0.2032))
  (fp_arc (start -105.3846 76.8096) (end -105.461605 76.051501) (angle -184.3) (layer Dwgs.User) (width 0.2032))
  (fp_arc (start -100.7872 77.978) (end -100.003166 77.905267) (angle -63.1) (layer Dwgs.User) (width 0.1))
  (fp_arc (start -105.156 78.613) (end -105.209325 77.903802) (angle -187.4) (layer Dwgs.User) (width 0.2032))
  (fp_arc (start -105.2576 72.39) (end -105.381401 71.845087) (angle -80.3) (layer Dwgs.User) (width 0.1))
  (fp_arc (start -102.616 79.375) (end -103.555386 79.40288) (angle -89.8) (layer Dwgs.User) (width 0.1))
  (fp_arc (start -106.1212 73.5076) (end -106.58075 70.237735) (angle -90) (layer Dwgs.User) (width 0.1))
  (fp_arc (start -105.6132 75.0316) (end -106.071972 73.929472) (angle -122.1) (layer Dwgs.User) (width 0.1))
  (fp_arc (start -106.7054 75.7428) (end -110.408665 76.5232) (angle -90) (layer Dwgs.User) (width 0.1))
  (fp_arc (start -105.4608 76.835) (end -106.291298 76.013154) (angle -105.4) (layer Dwgs.User) (width 0.1))
  (fp_arc (start -105.3846 78.613) (end -106.026628 77.85862) (angle -107.8) (layer Dwgs.User) (width 0.1))
  (fp_arc (start 106.7054 -76.1492) (end 106.657175 -77.774085) (angle -86.5) (layer Dwgs.User) (width 0.1))
  (fp_arc (start 106.6292 -76.2254) (end 106.677425 -74.600515) (angle -86.5) (layer Dwgs.User) (width 0.1))
  (fp_circle (center 106.68 -76.2) (end 108.2548 -76.2) (layer Dwgs.User) (width 0.1016))
  (fp_circle (center 106.68 76.2) (end 108.2548 76.2) (layer Dwgs.User) (width 0.1016))
  (fp_arc (start 106.6292 76.1492) (end 106.677425 77.774085) (angle -86.5) (layer Dwgs.User) (width 0.1))
  (fp_arc (start 106.7054 76.2254) (end 106.657175 74.600515) (angle -86.5) (layer Dwgs.User) (width 0.1))
  (fp_arc (start -106.6292 -76.1492) (end -106.677425 -77.774085) (angle -86.5) (layer Dwgs.User) (width 0.1))
  (fp_arc (start -106.7054 -76.2254) (end -106.657175 -74.600515) (angle -86.5) (layer Dwgs.User) (width 0.1))
  (fp_circle (center -106.68 -76.2) (end -105.1052 -76.2) (layer Dwgs.User) (width 0.1016))
  (fp_line (start 106.68 -76.2) (end 106.68 -77.7748) (layer Dwgs.User) (width 0.1))
  (fp_line (start 105.0798 -76.2) (end 106.68 -76.2) (layer Dwgs.User) (width 0.1))
  (fp_line (start 106.68 -74.5998) (end 106.68 -76.2) (layer Dwgs.User) (width 0.1))
  (fp_line (start 19.4818 84.9884) (end 19.9898 84.9884) (layer Dwgs.User) (width 0.1778))
  (fp_line (start -97.6884 71.4756) (end -95.25 71.8312) (layer Dwgs.User) (width 0.1))
  (fp_line (start 63.9826 84.9884) (end 63.9826 74.9808) (layer Dwgs.User) (width 0.1778))
  (fp_line (start -91.2114 73.9648) (end -89.8652 74.168) (layer Dwgs.User) (width 0.1))
  (fp_line (start -101.4222 78.105) (end -100.6856 78.2066) (layer Dwgs.User) (width 0.1))
  (fp_line (start 114.9858 84.9884) (end 114.9858 -84.9884) (layer Dwgs.User) (width 0.254))
  (fp_line (start -101.6508 79.8068) (end -98.044 80.3148) (layer Dwgs.User) (width 0.1))
  (fp_line (start -101.727 77.7494) (end -100.6348 77.9018) (layer Dwgs.User) (width 0.1))
  (fp_line (start -114.9858 -84.9884) (end 114.9858 -84.9884) (layer Dwgs.User) (width 0.254))
  (fp_line (start -101.5238 76.2) (end -101.0412 76.2508) (layer Dwgs.User) (width 0.1))
  (fp_line (start -90.1954 76.5302) (end -89.8652 74.168) (layer Dwgs.User) (width 0.1))
  (fp_line (start -101.3968 75.8952) (end -100.9904 75.946) (layer Dwgs.User) (width 0.1))
  (fp_line (start -99.949 78.994) (end -97.0788 79.4004) (layer Dwgs.User) (width 0.1))
  (fp_line (start -100.076 82.296) (end -94.361 82.296) (layer Dwgs.User) (width 0.254))
  (fp_line (start -98.171 69.6214) (end -94.0308 70.2056) (layer Dwgs.User) (width 0.1))
  (fp_line (start -101.1936 74.4474) (end -100.6348 74.5236) (layer Dwgs.User) (width 0.1))
  (fp_line (start -99.7458 78.7654) (end -95.631 79.3242) (layer Dwgs.User) (width 0.2032))
  (fp_line (start -99.5426 77.3176) (end -97.2312 77.6478) (layer Dwgs.User) (width 0.2032))
  (fp_line (start -100.076 76.9112) (end -97.2058 77.3176) (layer Dwgs.User) (width 0.2032))
  (fp_line (start -99.8728 75.3872) (end -96.9772 75.7936) (layer Dwgs.User) (width 0.2032))
  (fp_line (start -99.822 75.0824) (end -96.9264 75.4634) (layer Dwgs.User) (width 0.2032))
  (fp_line (start -114.9858 84.9884) (end 114.9858 84.9884) (layer Dwgs.User) (width 0.254))
  (fp_line (start -48.9966 79.9846) (end -48.9966 74.9808) (layer Dwgs.User) (width 0.1778))
  (fp_line (start -5.4864 84.9884) (end -5.4864 79.9846) (layer Dwgs.User) (width 0.1778))
  (fp_line (start -63.9826 84.9884) (end 63.9826 84.9884) (layer Dwgs.User) (width 0.1778))
  (fp_line (start -102.0826 72.8726) (end -94.5642 73.914) (layer Dwgs.User) (width 0.1))
  (fp_line (start -114.9858 84.9884) (end -114.9858 -84.9884) (layer Dwgs.User) (width 0.254))
  (fp_line (start -99.6188 73.6346) (end -94.9198 74.295) (layer Dwgs.User) (width 0.2032))
  (fp_line (start -63.9826 79.9846) (end 63.9826 79.9846) (layer Dwgs.User) (width 0.1778))
  (fp_line (start 106.68 76.2) (end 106.68 74.5998) (layer Dwgs.User) (width 0.1))
  (fp_line (start -106.68 -74.5998) (end -106.68 -76.2) (layer Dwgs.User) (width 0.1))
  (fp_line (start -108.2548 -76.2) (end -106.68 -76.2) (layer Dwgs.User) (width 0.1))
  (fp_line (start 105.0798 76.2) (end 106.68 76.2) (layer Dwgs.User) (width 0.1))
  (fp_line (start 106.68 77.7748) (end 106.68 76.2) (layer Dwgs.User) (width 0.1))
  (fp_line (start -106.68 -76.2) (end -106.68 -77.7748) (layer Dwgs.User) (width 0.1))
  (fp_line (start -31.9786 84.9884) (end -31.9786 74.9808) (layer Dwgs.User) (width 0.1778))
  (fp_line (start 19.9898 84.9884) (end 19.9898 74.9808) (layer Dwgs.User) (width 0.1778))
  (fp_line (start -63.9826 84.9884) (end -63.9826 74.9808) (layer Dwgs.User) (width 0.1778))
  (fp_line (start -63.9826 74.9808) (end 63.9826 74.9808) (layer Dwgs.User) (width 0.1778))
  (fp_line (start -101.8794 71.4248) (end -94.8182 72.4154) (layer Dwgs.User) (width 0.1))
  (fp_line (start 106.68 -76.2) (end 106.68 -77.7748) (layer Dwgs.User) (width 0.1))
  (fp_line (start -110.7694 74.168) (end -109.4232 73.9648) (layer Dwgs.User) (width 0.1))
  (fp_line (start -106.299 82.296) (end -100.711 82.296) (layer Dwgs.User) (width 0.254))
  (fp_line (start 105.0798 -76.2) (end 106.68 -76.2) (layer Dwgs.User) (width 0.1))
  (fp_line (start 106.68 -74.5998) (end 106.68 -76.2) (layer Dwgs.User) (width 0.1))
  (fp_line (start -103.5558 79.4004) (end -100.6856 78.994) (layer Dwgs.User) (width 0.1))
  (fp_line (start -105.0036 79.3242) (end -100.8888 78.7654) (layer Dwgs.User) (width 0.2032))
  (fp_line (start -19.9898 84.9884) (end -19.9898 74.9808) (layer Dwgs.User) (width 0.1778))
  (fp_line (start 63.9826 84.9884) (end 63.9826 74.9808) (layer Dwgs.User) (width 0.1778))
  (fp_line (start -102.5906 80.3148) (end -98.9838 79.8068) (layer Dwgs.User) (width 0.1))
  (fp_line (start 114.9858 84.9884) (end 114.9858 -84.9884) (layer Dwgs.User) (width 0.254))
  (fp_line (start -114.9858 -84.9884) (end 114.9858 -84.9884) (layer Dwgs.User) (width 0.254))
  (fp_line (start -103.4034 77.6478) (end -101.092 77.3176) (layer Dwgs.User) (width 0.2032))
  (fp_line (start -99.949 78.2066) (end -99.2124 78.105) (layer Dwgs.User) (width 0.1))
  (fp_line (start -103.4288 77.3176) (end -100.5586 76.9112) (layer Dwgs.User) (width 0.2032))
  (fp_line (start -99.9998 77.9018) (end -98.9076 77.7494) (layer Dwgs.User) (width 0.1))
  (fp_line (start -103.6574 75.7936) (end -100.7618 75.3872) (layer Dwgs.User) (width 0.2032))
  (fp_line (start -103.7082 75.4634) (end -100.8126 75.0824) (layer Dwgs.User) (width 0.2032))
  (fp_line (start -99.5934 76.2508) (end -99.1362 76.2) (layer Dwgs.User) (width 0.1))
  (fp_line (start -99.6442 75.946) (end -99.2378 75.8952) (layer Dwgs.User) (width 0.1))
  (fp_line (start -105.3846 71.8312) (end -102.9462 71.4756) (layer Dwgs.User) (width 0.1))
  (fp_line (start -105.7148 74.295) (end -101.0158 73.6346) (layer Dwgs.User) (width 0.2032))
  (fp_line (start -99.9998 74.5236) (end -99.441 74.4474) (layer Dwgs.User) (width 0.1))
  (fp_line (start 5.4864 84.9884) (end 5.4864 79.9846) (layer Dwgs.User) (width 0.1778))
  (fp_line (start -106.6038 70.2056) (end -102.4636 69.6214) (layer Dwgs.User) (width 0.1))
  (fp_line (start -106.0704 73.914) (end -98.552 72.8726) (layer Dwgs.User) (width 0.1))
  (fp_line (start -105.8164 72.4154) (end -98.7552 71.4248) (layer Dwgs.User) (width 0.1))
  (fp_line (start -114.9858 84.9884) (end 114.9858 84.9884) (layer Dwgs.User) (width 0.254))
  (fp_line (start 31.9786 84.9884) (end 31.9786 74.9808) (layer Dwgs.User) (width 0.1778))
  (fp_line (start -63.9826 84.9884) (end 63.9826 84.9884) (layer Dwgs.User) (width 0.1778))
  (fp_line (start -114.9858 84.9884) (end -114.9858 -84.9884) (layer Dwgs.User) (width 0.254))
  (fp_line (start -63.9826 79.9846) (end 63.9826 79.9846) (layer Dwgs.User) (width 0.1778))
  (fp_line (start 106.68 76.2) (end 108.2548 76.2) (layer Dwgs.User) (width 0.1))
  (fp_line (start -106.68 -74.5998) (end -106.68 -76.2) (layer Dwgs.User) (width 0.1))
  (fp_line (start 48.9966 79.9846) (end 48.9966 74.9808) (layer Dwgs.User) (width 0.1778))
  (fp_line (start -108.2548 -76.2) (end -106.68 -76.2) (layer Dwgs.User) (width 0.1))
  (fp_line (start 105.0798 76.2) (end 106.68 76.2) (layer Dwgs.User) (width 0.1))
  (fp_line (start 106.68 77.7748) (end 106.68 76.2) (layer Dwgs.User) (width 0.1))
  (fp_line (start -106.68 -76.2) (end -106.68 -77.7748) (layer Dwgs.User) (width 0.1))
  (fp_line (start -63.9826 84.9884) (end -63.9826 74.9808) (layer Dwgs.User) (width 0.1778))
  (fp_line (start -63.9826 74.9808) (end 63.9826 74.9808) (layer Dwgs.User) (width 0.1778))
  (fp_line (start -19.9898 84.9884) (end -19.4818 84.9884) (layer Dwgs.User) (width 0.1778))
  (fp_line (start -110.7694 74.168) (end -110.4392 76.5302) (layer Dwgs.User) (width 0.1))
)
