(module MOL43650-02D_1 (layer F.Cu) (tedit 5E95D701)
  (attr smd)
  (fp_text reference J9 (at 0.5622 -0.812 -90 unlocked) (layer F.SilkS)
    (effects (font (size 1.0496 1.104) (thickness 0.18)))
  )
  (fp_text value F-COCMS-MOL43650-0224 (at 0.8 8.4 -90 unlocked) (layer F.SilkS) hide
    (effects (font (size 1.0496 1.104) (thickness 0.18)))
  )
  (fp_line (start -4.85 2.08) (end 4.85 2.08) (layer F.Fab) (width 0.1))
  (fp_line (start 2 0.98) (end 2.5 0.48) (layer F.Fab) (width 0.1))
  (fp_line (start -1 -2.02) (end -1 -3.22) (layer F.Fab) (width 0.1))
  (fp_line (start -1.85 -2.02) (end -1.85 -4.32) (layer F.Fab) (width 0.1))
  (fp_line (start -2.5 0.48) (end -2 0.98) (layer F.Fab) (width 0.1))
  (fp_line (start -4.85 2.08) (end -4.85 -2.02) (layer F.Fab) (width 0.1))
  (fp_line (start -1 -2.02) (end 1 -2.02) (layer F.Fab) (width 0.1))
  (fp_line (start -1.15 -2.02) (end -1.15 -4.32) (layer F.Fab) (width 0.1))
  (fp_line (start -1.85 -4.32) (end -1.15 -4.32) (layer F.Fab) (width 0.1))
  (fp_line (start 0.5 -1.02) (end 2.5 -1.02) (layer F.Fab) (width 0.1))
  (fp_line (start 2.5 0.48) (end 2.5 -1.02) (layer F.Fab) (width 0.1))
  (fp_line (start -4.85 0.68) (end -4.85 -0.72) (layer F.Fab) (width 0.1))
  (fp_line (start -6.85 -0.72) (end -4.85 -0.72) (layer F.Fab) (width 0.1))
  (fp_line (start 1.15 -2.02) (end 1.85 -2.02) (layer F.Fab) (width 0.1))
  (fp_line (start -1 -3.22) (end 1 -3.22) (layer F.Fab) (width 0.1))
  (fp_line (start 1 -2.02) (end 1 -3.22) (layer F.Fab) (width 0.1))
  (fp_line (start -6.85 0.68) (end -4.85 0.68) (layer F.Fab) (width 0.1))
  (fp_line (start 1.15 -2.02) (end 1.15 -4.32) (layer F.Fab) (width 0.1))
  (fp_line (start 4.85 0.68) (end 4.85 -0.72) (layer F.Fab) (width 0.1))
  (fp_line (start -6.85 0.68) (end -6.85 -0.72) (layer F.Fab) (width 0.1))
  (fp_line (start -0.5 0.98) (end -0.5 -1.02) (layer F.Fab) (width 0.1))
  (fp_line (start 4.85 0.68) (end 6.85 0.68) (layer F.Fab) (width 0.1))
  (fp_line (start -4.85 -2.02) (end 4.85 -2.02) (layer F.Fab) (width 0.1))
  (fp_line (start 1.85 -2.02) (end 1.85 -4.32) (layer F.Fab) (width 0.1))
  (fp_line (start 4 -2.02) (end 4.85 -1.17) (layer F.Fab) (width 0.1))
  (fp_line (start 1.15 -4.32) (end 1.85 -4.32) (layer F.Fab) (width 0.1))
  (fp_line (start 4.85 2.08) (end 4.85 -2.02) (layer F.Fab) (width 0.1))
  (fp_line (start -2.5 -1.02) (end -0.5 -1.02) (layer F.Fab) (width 0.1))
  (fp_line (start 4.85 -0.72) (end 6.85 -0.72) (layer F.Fab) (width 0.1))
  (fp_line (start 6.85 0.68) (end 6.85 -0.72) (layer F.Fab) (width 0.1))
  (fp_line (start 0.5 0.98) (end 2 0.98) (layer F.Fab) (width 0.1))
  (fp_line (start -1.85 -2.02) (end -1.15 -2.02) (layer F.Fab) (width 0.1))
  (fp_line (start -2.5 0.48) (end -2.5 -1.02) (layer F.Fab) (width 0.1))
  (fp_line (start -2 0.98) (end -0.5 0.98) (layer F.Fab) (width 0.1))
  (fp_line (start 0.5 0.98) (end 0.5 -1.02) (layer F.Fab) (width 0.1))
  (fp_line (start -4.85 -1.14) (end -4.85 -2.02) (layer F.SilkS) (width 0.18))
  (fp_line (start -4.85 2.08) (end 4.85 2.08) (layer F.SilkS) (width 0.18))
  (fp_line (start 4.85 2.08) (end 4.85 1.14) (layer F.SilkS) (width 0.18))
  (fp_line (start -4.85 2.08) (end -4.85 1.14) (layer F.SilkS) (width 0.18))
  (fp_line (start 4 -2.02) (end 4.85 -1.17) (layer F.SilkS) (width 0.18))
  (fp_line (start 2.425 -2.02) (end 4.85 -2.02) (layer F.SilkS) (width 0.18))
  (fp_line (start 4.85 -1.14) (end 4.85 -2.02) (layer F.SilkS) (width 0.18))
  (fp_line (start -4.85 -2.02) (end -2.425 -2.02) (layer F.SilkS) (width 0.18))
  (pad 1 smd rect (at 1.5 -2.94) (size 1.27 3.5) (layers F.Cu F.Paste F.Mask))
  (pad 2 smd rect (at -1.5 -2.94) (size 1.27 3.5) (layers F.Cu F.Paste F.Mask))
  (pad 3 smd rect (at -4.95 0 90) (size 1.7 4.3) (layers F.Cu F.Paste F.Mask))
  (pad 4 smd rect (at 4.95 0 90) (size 1.7 4.3) (layers F.Cu F.Paste F.Mask))
  (model "${KIPRJMOD}/3D Models/436500224.stp"
    (offset (xyz 0 0 5))
    (scale (xyz 1 1 1))
    (rotate (xyz 0 0 0))
  )
)
