(module FEE_COMP_2 (layer F.Cu) (tedit 0)
  (attr smd)
  (fp_text reference CAM14 (at -2.54 1.016 unlocked) (layer F.SilkS) hide
    (effects (font (size 1.332992 1.40208) (thickness 0.254)))
  )
  (fp_text value FEE_COMP (at -4.064 1.016 unlocked) (layer F.SilkS) hide
    (effects (font (size 1.332992 1.40208) (thickness 0.254)))
  )
)
