(module B6BZR-SM3TF_1 (layer F.Cu) (tedit 5E977638)
  (attr smd)
  (fp_text reference J2 (at 0.5526 1.4546 -90 unlocked) (layer F.SilkS)
    (effects (font (size 1.0496 1.104) (thickness 0.18)))
  )
  (fp_text value F-COCMS-B6BZR-SM4TF (at 0.8 7.6 -90 unlocked) (layer F.SilkS) hide
    (effects (font (size 1.0496 1.104) (thickness 0.18)))
  )
  (fp_line (start 3.75 3.35) (end 3.75 1.85) (layer F.Fab) (width 0.1))
  (fp_line (start -0.75 3.35) (end -0.75 1.85) (layer F.Fab) (width 0.1))
  (fp_line (start -6 -0.8) (end -4.95 -1.85) (layer F.Fab) (width 0.1))
  (fp_line (start -6 1.85) (end 6 1.85) (layer F.Fab) (width 0.1))
  (fp_line (start -2.25 3.35) (end -2.25 1.85) (layer F.Fab) (width 0.1))
  (fp_line (start -6 1.85) (end -6 -1.85) (layer F.Fab) (width 0.1))
  (fp_line (start 2.25 3.35) (end 2.25 1.85) (layer F.Fab) (width 0.1))
  (fp_line (start -6 0) (end 6 0) (layer F.Fab) (width 0.1))
  (fp_line (start -3.75 3.35) (end -3.75 1.85) (layer F.Fab) (width 0.1))
  (fp_line (start -6 -1.85) (end 6 -1.85) (layer F.Fab) (width 0.1))
  (fp_line (start 6 1.85) (end 6 -1.85) (layer F.Fab) (width 0.1))
  (fp_line (start 0.75 3.35) (end 0.75 1.85) (layer F.Fab) (width 0.1))
  (fp_line (start -6 -1.55) (end -6 -1.85) (layer F.SilkS) (width 0.18))
  (fp_line (start 4.4 1.85) (end 6 1.85) (layer F.SilkS) (width 0.18))
  (fp_line (start 6 1.85) (end 6 1.35) (layer F.SilkS) (width 0.18))
  (fp_line (start -4.84645 1.85) (end -4.4 1.85) (layer F.SilkS) (width 0.18))
  (fp_line (start -6 1.66197) (end -6 1.35) (layer F.SilkS) (width 0.18))
  (fp_line (start -6 -1.85) (end 6 -1.85) (layer F.SilkS) (width 0.18))
  (fp_line (start -3.46 -1.69) (end -3.3 -1.85) (layer F.SilkS) (width 0.18))
  (fp_line (start 6 -1.55) (end 6 -1.85) (layer F.SilkS) (width 0.18))
  (fp_line (start -4.2 -1.85) (end -4.04 -1.69) (layer F.SilkS) (width 0.18))
  (pad 1 smd rect (at -3.75 1.15) (size 0.7 5.1) (layers F.Cu F.Paste F.Mask))
  (pad 2 smd rect (at -2.25 1.15) (size 0.7 5.1) (layers F.Cu F.Paste F.Mask))
  (pad 3 smd rect (at -0.75 1.15) (size 0.7 5.1) (layers F.Cu F.Paste F.Mask))
  (pad 4 smd rect (at 0.75 1.15) (size 0.7 5.1) (layers F.Cu F.Paste F.Mask))
  (pad 5 smd rect (at 2.25 1.15) (size 0.7 5.1) (layers F.Cu F.Paste F.Mask))
  (pad 6 smd rect (at 3.75 1.15) (size 0.7 5.1) (layers F.Cu F.Paste F.Mask))
  (pad 7 smd rect (at 5.8 -0.1) (size 1.7 2.2) (layers F.Cu F.Paste F.Mask))
  (pad 8 smd rect (at -5.8 -0.1) (size 1.7 2.2) (layers F.Cu F.Paste F.Mask))
  (model "${KIPRJMOD}/3D Models/B6B-ZR-SM4-TF.STEP"
    (offset (xyz 0 1.75 0))
    (scale (xyz 1 1 1))
    (rotate (xyz -90 0 180))
  )
)
