(module C0603_1 (layer F.Cu) (tedit 0)
  (attr smd)
  (fp_text reference FI3 (at -0.21608 -0.1044 unlocked) (layer F.SilkS)
    (effects (font (size 1.312 1.38) (thickness 0.15)))
  )
  (fp_text value SF-BC-S0603 (at 5.5 -1 unlocked) (layer F.SilkS) hide
    (effects (font (size 1.312 1.38) (thickness 0.15)))
  )
  (fp_line (start -1.42875 -0.56441) (end -1.42875 -0.635) (layer F.SilkS) (width 0.18))
  (fp_line (start 0.9 0.4) (end 0.9 -0.4) (layer F.SilkS) (width 0.1))
  (fp_line (start -0.9 -0.4) (end 0.9 -0.4) (layer F.SilkS) (width 0.1))
  (fp_line (start -1.42875 0.635) (end -1.3837 0.635) (layer F.SilkS) (width 0.18))
  (fp_line (start 1.42875 0.635) (end 1.42875 0.56441) (layer F.SilkS) (width 0.18))
  (fp_line (start -1.42875 0.635) (end -1.42875 0.56441) (layer F.SilkS) (width 0.18))
  (fp_line (start -1.42875 -0.635) (end -1.3837 -0.635) (layer F.SilkS) (width 0.18))
  (fp_line (start 1.3837 0.635) (end 1.42875 0.635) (layer F.SilkS) (width 0.18))
  (fp_line (start -0.1163 -0.635) (end 0.1163 -0.635) (layer F.SilkS) (width 0.18))
  (fp_line (start -0.9 0.4) (end 0.9 0.4) (layer F.SilkS) (width 0.1))
  (fp_line (start -0.1163 0.635) (end 0.1163 0.635) (layer F.SilkS) (width 0.18))
  (fp_line (start 1.3837 -0.635) (end 1.42875 -0.635) (layer F.SilkS) (width 0.18))
  (fp_line (start 1.42875 -0.56441) (end 1.42875 -0.635) (layer F.SilkS) (width 0.18))
  (fp_line (start -0.9 0.4) (end -0.9 -0.4) (layer F.SilkS) (width 0.1))
  (pad 2 smd rect (at 0.75 0) (size 0.8 0.8) (layers F.Cu F.Paste F.Mask))
  (pad 1 smd rect (at -0.75 0) (size 0.8 0.8) (layers F.Cu F.Paste F.Mask))
)
