EESchema Schematic File Version 4
EELAYER 30 0
EELAYER END
$Descr User 17335 11946
encoding utf-8
Sheet 6 8
Title "RB0505 CPU Board"
Date "2020-04-15"
Rev ""
Comp ""
Comment1 ""
Comment2 ""
Comment3 ""
Comment4 ""
$EndDescr
Wire Wire Line
	2175 6850 2212 6850
Wire Wire Line
	2212 6850 2212 7100
Wire Wire Line
	2400 6988 2400 7100
Wire Wire Line
	2400 7100 2400 7200
Wire Wire Line
	2212 7100 2400 7100
Connection ~ 2400 7100
Wire Wire Line
	2300 4150 2300 4188
Wire Wire Line
	11900 3075 11900 3213
Wire Wire Line
	11900 3213 11700 3213
Wire Wire Line
	11700 3213 11600 3213
Wire Wire Line
	11700 3075 11700 3213
Wire Wire Line
	11600 3213 11500 3213
Wire Wire Line
	11500 3213 11500 3075
Wire Wire Line
	11500 3213 11300 3213
Wire Wire Line
	11300 3213 11300 3075
Connection ~ 11700 3213
Connection ~ 11600 3213
Connection ~ 11500 3213
Wire Wire Line
	3400 5250 3400 5325
Wire Wire Line
	7575 2450 6650 2450
Connection ~ 7575 2450
Wire Wire Line
	5350 2450 5100 2450
Wire Wire Line
	5100 2450 5100 2500
Wire Wire Line
	5350 3050 5250 3050
Wire Wire Line
	5350 3150 5250 3150
Wire Wire Line
	5350 3250 5250 3250
Wire Wire Line
	5250 3250 5100 3250
Wire Wire Line
	5100 3250 5100 3300
Wire Wire Line
	5250 3150 5250 3250
Wire Wire Line
	5250 3050 5250 3150
Connection ~ 5250 3250
Connection ~ 5250 3150
Text HLabel 10850 7125 2    56   Output ~ 0
DEF-TURB
Text HLabel 10850 6725 2    56   Input ~ 0
CONS-VIT
Text HLabel 10850 6525 2    56   Output ~ 0
SPEED_MEASURE
Text HLabel 10850 6925 2    56   Input ~ 0
BRAKE
Wire Wire Line
	12100 2300 11500 2300
Wire Wire Line
	11500 2300 11250 2300
Wire Wire Line
	11500 2775 11500 2300
Connection ~ 11500 2300
Wire Wire Line
	12100 2500 11700 2500
Wire Wire Line
	11700 2500 11250 2500
Wire Wire Line
	11700 2775 11700 2500
Connection ~ 11700 2500
Wire Wire Line
	12100 2700 11900 2700
Wire Wire Line
	11900 2700 11250 2700
Wire Wire Line
	11900 2775 11900 2700
Connection ~ 11900 2700
Wire Wire Line
	10225 2400 10225 2700
Wire Wire Line
	10225 2700 10950 2700
Wire Wire Line
	10725 2600 10725 2500
Wire Wire Line
	10725 2500 10950 2500
Text HLabel 14525 1925 2    70   Input ~ 0
CON-FIO2-MEAS
Wire Wire Line
	2175 6650 2400 6650
Wire Wire Line
	2400 6650 2400 6788
Wire Wire Line
	2400 6650 2550 6650
Connection ~ 2400 6650
Wire Wire Line
	2175 6250 3600 6250
Wire Wire Line
	3600 6250 3600 6350
Wire Wire Line
	3600 6350 3600 7175
Wire Wire Line
	4375 6350 3600 6350
Connection ~ 3600 6350
Wire Wire Line
	2175 6050 3800 6050
Wire Wire Line
	3800 6050 3800 6250
Wire Wire Line
	3800 6250 3800 7175
Wire Wire Line
	4375 6250 3800 6250
Connection ~ 3800 6250
Wire Wire Line
	2175 5850 4000 5850
Wire Wire Line
	4000 5850 4000 6150
Wire Wire Line
	4000 6150 4000 7175
Wire Wire Line
	4375 6150 4000 6150
Connection ~ 4000 6150
Wire Wire Line
	2175 5650 3400 5650
Wire Wire Line
	3400 5650 3400 5525
Wire Wire Line
	3400 5650 4175 5650
Connection ~ 3400 5650
Wire Wire Line
	2175 6450 3400 6450
Wire Wire Line
	3400 6450 3400 7175
Wire Wire Line
	4375 6450 3400 6450
Connection ~ 3400 6450
Wire Wire Line
	4675 6450 4987 6450
Text HLabel 4987 6450 2    56   Input ~ 0
PWM-BUZ
Wire Wire Line
	4675 6350 4987 6350
Text HLabel 4987 6350 2    56   Input ~ 0
INV-STOP
Wire Wire Line
	4675 6150 4987 6150
Text Label 4987 6150 0    56   ~ 0
SUPPLY-BUZ
Text Label 9700 3325 2    56   ~ 0
SUPPLY-BUZ
Text HLabel 4975 5825 2    56   Input ~ 0
INHIB-STOP-INV
Wire Wire Line
	10725 2300 10950 2300
Wire Wire Line
	2425 3575 2300 3575
Wire Wire Line
	2300 3400 2300 3575
Wire Wire Line
	2300 3575 2075 3575
Connection ~ 2300 3575
Wire Wire Line
	2425 3775 2300 3775
Wire Wire Line
	2300 3950 2300 3775
Wire Wire Line
	2300 3775 2075 3775
Connection ~ 2300 3775
Wire Wire Line
	3050 3575 2725 3575
Text HLabel 3050 3575 2    56   Input ~ 0
EXHALATION-VALVE
Text HLabel 14600 3650 2    70   Input ~ 0
O2-VALVE
Text HLabel 14500 5800 2    56   Output ~ 0
Q-O2-MEAS
Wire Wire Line
	6350 6250 6200 6250
Wire Wire Line
	6350 6500 6350 6250
Connection ~ 6350 6250
Text HLabel 6650 6250 2    70   Output ~ 0
TESTBUZ
Wire Wire Line
	4675 6250 5800 6250
Text HLabel 9825 1700 0    56   Input ~ 0
TX-AL-RP
Wire Wire Line
	5350 2950 5200 2950
Text HLabel 5200 2950 0    66   Input ~ 0
TX-AL-RP
Wire Wire Line
	6800 2950 6650 2950
Text HLabel 6800 2950 2    56   Input ~ 0
RX-AL-RP
Wire Wire Line
	11250 1700 11300 1700
Wire Wire Line
	11300 1700 12100 1700
Connection ~ 11300 1700
Wire Wire Line
	10275 6525 8850 6525
Connection ~ 10275 6525
Wire Wire Line
	9275 5725 8850 5725
Wire Wire Line
	9275 5650 9275 5725
Connection ~ 9275 5725
Text HLabel 9700 5725 2    56   Output ~ 0
TURBINE-TEMP
Text HLabel 10850 7325 2    56   Output ~ 0
ENABLE-TURB
Wire Wire Line
	9275 5250 9275 5125
Wire Wire Line
	11250 1900 11300 1900
Wire Wire Line
	11300 1900 12100 1900
Wire Wire Line
	11300 2775 11300 1900
Connection ~ 11300 1900
Text HLabel 10050 3100 0    56   Output ~ 0
TEST-RAP-ALARM
Text HLabel 8875 4275 0    56   Input ~ 0
RAP-ALAR
Wire Wire Line
	5350 2050 5250 2050
Wire Wire Line
	5350 2150 5050 2150
Wire Wire Line
	5350 2250 4850 2250
Wire Wire Line
	6650 2850 6700 2850
Wire Wire Line
	6650 3250 6700 3250
Wire Wire Line
	6700 3250 7575 3250
Wire Wire Line
	7575 2900 7575 3250
Wire Wire Line
	6700 2850 6700 3250
Connection ~ 7575 3250
Connection ~ 6700 3250
Wire Wire Line
	8350 3550 8350 3750
Wire Wire Line
	8350 3750 8600 3750
Wire Wire Line
	8600 3750 8600 3700
Wire Wire Line
	8350 3750 7900 3750
Connection ~ 8350 3750
Text HLabel 7900 3750 0    56   Input ~ 0
RF
Text HLabel 10050 1500 0    56   Input ~ 0
SUPPLY-AL-RP
$Comp
L cpu-board:GND #U$043
U 1 1 8B1A1718
P 9025 8150
F 0 "#U$043" H 9025 8150 50  0001 C CNN
F 1 "GND" H 8937 8063 59  0000 L BNN
F 2 "" H 9025 8150 50  0001 C CNN
F 3 "" H 9025 8150 50  0001 C CNN
	1    9025 8150
	-1   0    0    -1  
$EndComp
$Comp
L cpu-board:0VANA #U$0180
U 1 1 3541E6BB
P 14825 2125
F 0 "#U$0180" H 14825 2125 50  0001 C CNN
F 1 "0VANA" H 14712 1950 59  0000 L BNN
F 2 "" H 14825 2125 50  0001 C CNN
F 3 "" H 14825 2125 50  0001 C CNN
	1    14825 2125
	0    -1   -1   0   
$EndComp
$Comp
L cpu-board:B3B_ZR J11
U 1 1 54BD1E4C
P 13625 1925
F 0 "J11" H 13525 1462 85  0000 L BNN
F 1 "B3B_ZR" H 13525 1387 59  0001 L BNN
F 2 "AllModules:B3BZR-SM3TF_1" H 13625 1925 50  0001 C CNN
F 3 "" H 13625 1925 50  0001 C CNN
F 4 "CONNECTOR,FIO2, 3 CONTACTS" H 13625 1925 50  0001 C CNN "Description"
F 5 "10097262" H 13625 1925 50  0001 C CNN "Item Number"
F 6 "J.S.T. CORPORATION" H 13625 1925 50  0001 C CNN "Manufacturer"
F 7 "B3B-ZR-SM4-TF (LF)(SN)" H 13625 1925 50  0001 C CNN "Manufacturer_No"
F 8 "ZH CONNECTOR" H 13625 1925 50  0001 C CNN "Manufacturer_Desc"
	1    13625 1925
	1    0    0    -1  
$EndComp
$Comp
L cpu-board:GND #U$0226
U 1 1 71043D71
P 2400 7300
F 0 "#U$0226" H 2400 7300 50  0001 C CNN
F 1 "GND" H 2312 7212 59  0000 L BNN
F 2 "" H 2400 7300 50  0001 C CNN
F 3 "" H 2400 7300 50  0001 C CNN
	1    2400 7300
	1    0    0    -1  
$EndComp
$Comp
L cpu-board:B7B_ZR_SM3_TF J18
U 1 1 CDC055CB
P 1875 6950
F 0 "J18" H 1875 6800 85  0000 L BNN
F 1 "B7B_ZR_SM3_TF" H 1875 6712 59  0001 L BNN
F 2 "AllModules:B7BZR-SM3TF_1" H 1875 6950 50  0001 C CNN
F 3 "" H 1875 6950 50  0001 C CNN
F 4 "CONNECTOR, BUZZER CARD, 7 CONTACTS" H 1875 6950 50  0001 C CNN "Description"
F 5 "10097265" H 1875 6950 50  0001 C CNN "Item Number"
F 6 "J.S.T. CORPORATION" H 1875 6950 50  0001 C CNN "Manufacturer"
F 7 "B7B-ZR-SM4-TF (LF)(SN)" H 1875 6950 50  0001 C CNN "Manufacturer_No"
F 8 "ZH CONNECTOR" H 1875 6950 50  0001 C CNN "Manufacturer_Desc"
	1    1875 6950
	1    0    0    -1  
$EndComp
$Comp
L cpu-board:RESEAU_4C C56
U 1 1 A4E15BB6
P 9525 7775
F 0 "C56" H 9913 7800 64  0000 L BNN
F 1 "47pF" H 9925 7712 42  0000 L BNN
F 2 "AllModules:C0612-4_1" H 9525 7775 50  0001 C CNN
F 3 "" H 9525 7775 50  0001 C CNN
F 4 "CAPACITOR ARRAY, 47PF, 50V, +/-10%,NPO,0612" H 9525 7775 50  0001 C CNN "Description"
F 5 "10095973" H 9525 7775 50  0001 C CNN "Item Number"
F 6 "YAGEO_RMS1" H 9525 7775 50  0001 C CNN "Manufacturer"
F 7 "225514611532" H 9525 7775 50  0001 C CNN "Manufacturer_No"
F 8 "ISOLATED C NETWORK, 50V, C0G, 0.000047UF, SURFACE MOUNT, CHIP-8" H 9525 7775 50  0001 C CNN "Manufacturer_Desc"
	1    9525 7775
	1    0    0    -1  
$EndComp
$Comp
L cpu-board:74279263 L?
U 1 1 0A232DEA
P 11100 2300
AR Path="/0A232DEA" Ref="L?"  Part="1" 
AR Path="/5E9258C0/0A232DEA" Ref="L11"  Part="1" 
F 0 "L11" H 11025 2362 42  0000 L BNN
F 1 " " H 11000 2350 34  0000 L BNN
F 2 "AllModules:RC1206_1" H 11100 2300 50  0001 C CNN
F 3 "" H 11100 2300 50  0001 C CNN
F 4 "SMD FERRITE, 1A,1206" H 11100 2300 50  0001 C CNN "Description"
F 5 "10022911" H 11100 2300 50  0001 C CNN "Item Number"
F 6 "WURTH ELEKTRONIK GMBH" H 11100 2300 50  0001 C CNN "Manufacturer"
F 7 "74279218" H 11100 2300 50  0001 C CNN "Manufacturer_No"
F 8 "MULTILAYER-SMD-FERRITE" H 11100 2300 50  0001 C CNN "Manufacturer_Desc"
	1    11100 2300
	-1   0    0    -1  
$EndComp
$Comp
L cpu-board:74279263 L?
U 1 1 1E5F25AC
P 11100 2500
AR Path="/1E5F25AC" Ref="L?"  Part="1" 
AR Path="/5E9258C0/1E5F25AC" Ref="L19"  Part="1" 
F 0 "L19" H 11012 2562 42  0000 L BNN
F 1 " " H 11000 2550 34  0000 L BNN
F 2 "AllModules:RC1206_1" H 11100 2500 50  0001 C CNN
F 3 "" H 11100 2500 50  0001 C CNN
F 4 "SMD FERRITE, 1A,1206" H 11100 2500 50  0001 C CNN "Description"
F 5 "10022911" H 11100 2500 50  0001 C CNN "Item Number"
F 6 "WURTH ELEKTRONIK GMBH" H 11100 2500 50  0001 C CNN "Manufacturer"
F 7 "74279218" H 11100 2500 50  0001 C CNN "Manufacturer_No"
F 8 "MULTILAYER-SMD-FERRITE" H 11100 2500 50  0001 C CNN "Manufacturer_Desc"
	1    11100 2500
	-1   0    0    -1  
$EndComp
$Comp
L cpu-board:74279263 L?
U 1 1 19F4C54D
P 11100 2700
AR Path="/19F4C54D" Ref="L?"  Part="1" 
AR Path="/5E9258C0/19F4C54D" Ref="L20"  Part="1" 
F 0 "L20" H 11012 2750 42  0000 L BNN
F 1 " " H 11000 2750 34  0000 L BNN
F 2 "AllModules:RC1206_1" H 11100 2700 50  0001 C CNN
F 3 "" H 11100 2700 50  0001 C CNN
F 4 "SMD FERRITE, 1A,1206" H 11100 2700 50  0001 C CNN "Description"
F 5 "10022911" H 11100 2700 50  0001 C CNN "Item Number"
F 6 "WURTH ELEKTRONIK GMBH" H 11100 2700 50  0001 C CNN "Manufacturer"
F 7 "74279218" H 11100 2700 50  0001 C CNN "Manufacturer_No"
F 8 "MULTILAYER-SMD-FERRITE" H 11100 2700 50  0001 C CNN "Manufacturer_Desc"
	1    11100 2700
	-1   0    0    -1  
$EndComp
$Comp
L cpu-board:GND #U$0247
U 1 1 B682350D
P 11600 3350
F 0 "#U$0247" H 11600 3350 50  0001 C CNN
F 1 "GND" H 11513 3262 59  0000 L BNN
F 2 "" H 11600 3350 50  0001 C CNN
F 3 "" H 11600 3350 50  0001 C CNN
	1    11600 3350
	-1   0    0    -1  
$EndComp
$Comp
L cpu-board:74279263 L?
U 1 1 4DF659C7
P 14275 1925
AR Path="/4DF659C7" Ref="L?"  Part="1" 
AR Path="/5E9258C0/4DF659C7" Ref="L21"  Part="1" 
F 0 "L21" H 14225 1987 42  0000 L BNN
F 1 "74279263" H 14175 1975 34  0001 L BNN
F 2 "AllModules:C0603_1" H 14275 1925 50  0001 C CNN
F 3 "" H 14275 1925 50  0001 C CNN
F 4 "SMD FERRITE 200MA" H 14275 1925 50  0001 C CNN "Description"
F 5 "10022907" H 14275 1925 50  0001 C CNN "Item Number"
F 6 "WURTH ELEKTRONIK GMBH" H 14275 1925 50  0001 C CNN "Manufacturer"
F 7 "74279266" H 14275 1925 50  0001 C CNN "Manufacturer_No"
F 8 "MULTILAYER-SMD-FERRITE" H 14275 1925 50  0001 C CNN "Manufacturer_Desc"
	1    14275 1925
	1    0    0    -1  
$EndComp
$Comp
L cpu-board:C0603 C99
U 1 1 155BCB57
P 14025 1575
F 0 "C99" H 14143 1613 64  0000 L BNN
F 1 "150pF" H 14137 1531 42  0000 L BNN
F 2 "AllModules:C0402_1" H 14025 1575 50  0001 C CNN
F 3 "" H 14025 1575 50  0001 C CNN
F 4 "CAPACITOR CERAMIC, 150PF,50V,+/-5,NPO, 0402" H 14025 1575 50  0001 C CNN "Description"
F 5 "10022975" H 14025 1575 50  0001 C CNN "Item Number"
F 6 "YAGEO_RMS1" H 14025 1575 50  0001 C CNN "Manufacturer"
F 7 "CC0402JRNPO9BN151" H 14025 1575 50  0001 C CNN "Manufacturer_No"
F 8 "CAP CER 150PF 50V C0G/NPO 0402" H 14025 1575 50  0001 C CNN "Manufacturer_Desc"
F 9 "KEMET_RMS1" H 14025 1575 50  0001 C CNN "Manufacturer2"
F 10 "C0402C151J5GACTU" H 14025 1575 50  0001 C CNN "Manufacturer_No2"
F 11 "CERAMIC CHIP CAPACITOR" H 14025 1575 50  0001 C CNN "Manufacturer_Desc2"
F 12 "YAGEO_RMS1" H 14025 1575 50  0001 C CNN "Manufacturer3"
F 13 "223886915151" H 14025 1575 50  0001 C CNN "Manufacturer_No3"
F 14 "CAPACITOR, CERAMIC, MULTILAYER, 50 V, C0G, 0.00015 UF, SURFACE MOUNT, 0402" H 14025 1575 50  0001 C CNN "Manufacturer_Desc3"
	1    14025 1575
	1    0    0    -1  
$EndComp
$Comp
L cpu-board:0VANA #U$0248
U 1 1 27C1F247
P 14025 1350
F 0 "#U$0248" H 14025 1350 50  0001 C CNN
F 1 "0VANA" H 13938 1163 59  0000 L BNN
F 2 "" H 14025 1350 50  0001 C CNN
F 3 "" H 14025 1350 50  0001 C CNN
	1    14025 1350
	-1   0    0    1   
$EndComp
$Comp
L cpu-board:RESEAU_4C C100
U 1 1 809CF3B7
P 3750 7325
F 0 "C100" H 4150 7325 64  0000 L BNN
F 1 "47pF" H 4150 7237 42  0000 L BNN
F 2 "AllModules:C0612-4_1" H 3750 7325 50  0001 C CNN
F 3 "" H 3750 7325 50  0001 C CNN
F 4 "CAPACITOR ARRAY, 47PF, 50V, +/-10%,NPO,0612" H 3750 7325 50  0001 C CNN "Description"
F 5 "10095973" H 3750 7325 50  0001 C CNN "Item Number"
F 6 "YAGEO_RMS1" H 3750 7325 50  0001 C CNN "Manufacturer"
F 7 "225514611532" H 3750 7325 50  0001 C CNN "Manufacturer_No"
F 8 "ISOLATED C NETWORK, 50V, C0G, 0.000047UF, SURFACE MOUNT, CHIP-8" H 3750 7325 50  0001 C CNN "Manufacturer_Desc"
	1    3750 7325
	1    0    0    -1  
$EndComp
$Comp
L cpu-board:74279263 L?
U 1 1 60EE4B83
P 2700 6650
AR Path="/60EE4B83" Ref="L?"  Part="1" 
AR Path="/5E9258C0/60EE4B83" Ref="L22"  Part="1" 
F 0 "L22" H 2638 6712 42  0000 L BNN
F 1 "74279263" H 2600 6700 34  0001 L BNN
F 2 "AllModules:RC1206_1" H 2700 6650 50  0001 C CNN
F 3 "" H 2700 6650 50  0001 C CNN
F 4 "SMD FERRITE, 1A,1206" H 2700 6650 50  0001 C CNN "Description"
F 5 "10022911" H 2700 6650 50  0001 C CNN "Item Number"
F 6 "WURTH ELEKTRONIK GMBH" H 2700 6650 50  0001 C CNN "Manufacturer"
F 7 "74279218" H 2700 6650 50  0001 C CNN "Manufacturer_No"
F 8 "MULTILAYER-SMD-FERRITE" H 2700 6650 50  0001 C CNN "Manufacturer_Desc"
	1    2700 6650
	1    0    0    -1  
$EndComp
$Comp
L cpu-board:GND #U$0252
U 1 1 9A2BCF0A
P 3400 5150
F 0 "#U$0252" H 3400 5150 50  0001 C CNN
F 1 "GND" H 3313 5063 59  0000 L BNN
F 2 "" H 3400 5150 50  0001 C CNN
F 3 "" H 3400 5150 50  0001 C CNN
	1    3400 5150
	-1   0    0    1   
$EndComp
$Comp
L cpu-board:C0603 C115
U 1 1 D42B91C8
P 2400 6888
F 0 "C115" H 2493 6913 64  0000 L BNN
F 1 "150pF" H 2500 6832 42  0000 L BNN
F 2 "AllModules:C0402_1" H 2400 6888 50  0001 C CNN
F 3 "" H 2400 6888 50  0001 C CNN
F 4 "CAPACITOR CERAMIC, 150PF,50V,+/-5,NPO, 0402" H 2400 6888 50  0001 C CNN "Description"
F 5 "10022975" H 2400 6888 50  0001 C CNN "Item Number"
F 6 "YAGEO_RMS1" H 2400 6888 50  0001 C CNN "Manufacturer"
F 7 "CC0402JRNPO9BN151" H 2400 6888 50  0001 C CNN "Manufacturer_No"
F 8 "CAP CER 150PF 50V C0G/NPO 0402" H 2400 6888 50  0001 C CNN "Manufacturer_Desc"
F 9 "KEMET_RMS1" H 2400 6888 50  0001 C CNN "Manufacturer2"
F 10 "C0402C151J5GACTU" H 2400 6888 50  0001 C CNN "Manufacturer_No2"
F 11 "CERAMIC CHIP CAPACITOR" H 2400 6888 50  0001 C CNN "Manufacturer_Desc2"
F 12 "YAGEO_RMS1" H 2400 6888 50  0001 C CNN "Manufacturer3"
F 13 "223886915151" H 2400 6888 50  0001 C CNN "Manufacturer_No3"
F 14 "CAPACITOR, CERAMIC, MULTILAYER, 50 V, C0G, 0.00015 UF, SURFACE MOUNT, 0402" H 2400 6888 50  0001 C CNN "Manufacturer_Desc3"
	1    2400 6888
	1    0    0    -1  
$EndComp
$Comp
L cpu-board:B2B_ZR J19
U 1 1 69705732
P 1875 3675
F 0 "J19" H 1775 3325 85  0000 L BNN
F 1 "B2B_ZR" H 1775 3237 59  0001 L BNN
F 2 "AllModules:B2BZR-SM3TF_1" H 1875 3675 50  0001 C CNN
F 3 "" H 1875 3675 50  0001 C CNN
F 4 "CONNECTOR, TEMPERATURE MEASURE, 2 CONTACTS" H 1875 3675 50  0001 C CNN "Description"
F 5 "10097260" H 1875 3675 50  0001 C CNN "Item Number"
F 6 "J.S.T. CORPORATION" H 1875 3675 50  0001 C CNN "Manufacturer"
F 7 "B2B-ZR-SM4-TF (LF)(SN)" H 1875 3675 50  0001 C CNN "Manufacturer_No"
F 8 "CONNECTOR" H 1875 3675 50  0001 C CNN "Manufacturer_Desc"
	1    1875 3675
	1    0    0    -1  
$EndComp
$Comp
L cpu-board:+24V #U$0253
U 1 1 4F666574
P 2875 3775
F 0 "#U$0253" H 2875 3775 50  0001 C CNN
F 1 "+24V" V 2850 3700 59  0000 R TNN
F 2 "" H 2875 3775 50  0001 C CNN
F 3 "" H 2875 3775 50  0001 C CNN
	1    2875 3775
	0    -1   -1   0   
$EndComp
$Comp
L cpu-board:GND #U$0254
U 1 1 169273E9
P 2300 4288
F 0 "#U$0254" H 2300 4288 50  0001 C CNN
F 1 "GND" H 2212 4201 59  0000 L BNN
F 2 "" H 2300 4288 50  0001 C CNN
F 3 "" H 2300 4288 50  0001 C CNN
	1    2300 4288
	1    0    0    -1  
$EndComp
$Comp
L cpu-board:74279263 L?
U 1 1 2891A197
P 2575 3575
AR Path="/2891A197" Ref="L?"  Part="1" 
AR Path="/5E9258C0/2891A197" Ref="L23"  Part="1" 
F 0 "L23" H 2500 3637 42  0000 L BNN
F 1 " " H 2475 3625 34  0000 L BNN
F 2 "AllModules:C0603_1" H 2575 3575 50  0001 C CNN
F 3 "" H 2575 3575 50  0001 C CNN
F 4 "SMD FERRITE 200MA" H 2575 3575 50  0001 C CNN "Description"
F 5 "10022907" H 2575 3575 50  0001 C CNN "Item Number"
F 6 "WURTH ELEKTRONIK GMBH" H 2575 3575 50  0001 C CNN "Manufacturer"
F 7 "74279266" H 2575 3575 50  0001 C CNN "Manufacturer_No"
F 8 "MULTILAYER-SMD-FERRITE" H 2575 3575 50  0001 C CNN "Manufacturer_Desc"
	1    2575 3575
	1    0    0    -1  
$EndComp
$Comp
L cpu-board:C0603 C121
U 1 1 84C1574D
P 2300 3300
F 0 "C121" H 2393 3337 64  0000 L BNN
F 1 "150pF" H 2400 3256 42  0000 L BNN
F 2 "AllModules:C0402_1" H 2300 3300 50  0001 C CNN
F 3 "" H 2300 3300 50  0001 C CNN
F 4 "CAPACITOR CERAMIC, 150PF,50V,+/-5,NPO, 0402" H 2300 3300 50  0001 C CNN "Description"
F 5 "10022975" H 2300 3300 50  0001 C CNN "Item Number"
F 6 "YAGEO_RMS1" H 2300 3300 50  0001 C CNN "Manufacturer"
F 7 "CC0402JRNPO9BN151" H 2300 3300 50  0001 C CNN "Manufacturer_No"
F 8 "CAP CER 150PF 50V C0G/NPO 0402" H 2300 3300 50  0001 C CNN "Manufacturer_Desc"
F 9 "KEMET_RMS1" H 2300 3300 50  0001 C CNN "Manufacturer2"
F 10 "C0402C151J5GACTU" H 2300 3300 50  0001 C CNN "Manufacturer_No2"
F 11 "CERAMIC CHIP CAPACITOR" H 2300 3300 50  0001 C CNN "Manufacturer_Desc2"
F 12 "YAGEO_RMS1" H 2300 3300 50  0001 C CNN "Manufacturer3"
F 13 "223886915151" H 2300 3300 50  0001 C CNN "Manufacturer_No3"
F 14 "CAPACITOR, CERAMIC, MULTILAYER, 50 V, C0G, 0.00015 UF, SURFACE MOUNT, 0402" H 2300 3300 50  0001 C CNN "Manufacturer_Desc3"
	1    2300 3300
	1    0    0    -1  
$EndComp
$Comp
L cpu-board:74279263 L?
U 1 1 AE3312F6
P 2575 3775
AR Path="/AE3312F6" Ref="L?"  Part="1" 
AR Path="/5E9258C0/AE3312F6" Ref="L24"  Part="1" 
F 0 "L24" H 2488 3825 42  0000 L BNN
F 1 " " H 2475 3825 34  0000 L BNN
F 2 "AllModules:C0603_1" H 2575 3775 50  0001 C CNN
F 3 "" H 2575 3775 50  0001 C CNN
F 4 "SMD FERRITE 200MA" H 2575 3775 50  0001 C CNN "Description"
F 5 "10022907" H 2575 3775 50  0001 C CNN "Item Number"
F 6 "WURTH ELEKTRONIK GMBH" H 2575 3775 50  0001 C CNN "Manufacturer"
F 7 "74279266" H 2575 3775 50  0001 C CNN "Manufacturer_No"
F 8 "MULTILAYER-SMD-FERRITE" H 2575 3775 50  0001 C CNN "Manufacturer_Desc"
	1    2575 3775
	1    0    0    -1  
$EndComp
$Comp
L cpu-board:C0603 C122
U 1 1 AE0F7B61
P 2300 4050
F 0 "C122" H 2406 4062 64  0000 L BNN
F 1 "150pF" H 2412 3981 42  0000 L BNN
F 2 "AllModules:C0402_1" H 2300 4050 50  0001 C CNN
F 3 "" H 2300 4050 50  0001 C CNN
F 4 "CAPACITOR CERAMIC, 150PF,50V,+/-5,NPO, 0402" H 2300 4050 50  0001 C CNN "Description"
F 5 "10022975" H 2300 4050 50  0001 C CNN "Item Number"
F 6 "YAGEO_RMS1" H 2300 4050 50  0001 C CNN "Manufacturer"
F 7 "CC0402JRNPO9BN151" H 2300 4050 50  0001 C CNN "Manufacturer_No"
F 8 "CAP CER 150PF 50V C0G/NPO 0402" H 2300 4050 50  0001 C CNN "Manufacturer_Desc"
F 9 "KEMET_RMS1" H 2300 4050 50  0001 C CNN "Manufacturer2"
F 10 "C0402C151J5GACTU" H 2300 4050 50  0001 C CNN "Manufacturer_No2"
F 11 "CERAMIC CHIP CAPACITOR" H 2300 4050 50  0001 C CNN "Manufacturer_Desc2"
F 12 "YAGEO_RMS1" H 2300 4050 50  0001 C CNN "Manufacturer3"
F 13 "223886915151" H 2300 4050 50  0001 C CNN "Manufacturer_No3"
F 14 "CAPACITOR, CERAMIC, MULTILAYER, 50 V, C0G, 0.00015 UF, SURFACE MOUNT, 0402" H 2300 4050 50  0001 C CNN "Manufacturer_Desc3"
	1    2300 4050
	1    0    0    -1  
$EndComp
$Comp
L cpu-board:+24V #U$0258
U 1 1 D53A7098
P 14700 3850
F 0 "#U$0258" H 14700 3850 50  0001 C CNN
F 1 "+24V" V 14675 3775 59  0000 R TNN
F 2 "" H 14700 3850 50  0001 C CNN
F 3 "" H 14700 3850 50  0001 C CNN
	1    14700 3850
	0    -1   -1   0   
$EndComp
$Comp
L cpu-board:GND #U$0259
U 1 1 2CF06972
P 14125 4375
F 0 "#U$0259" H 14125 4375 50  0001 C CNN
F 1 "GND" H 14050 4300 59  0000 L BNN
F 2 "" H 14125 4375 50  0001 C CNN
F 3 "" H 14125 4375 50  0001 C CNN
	1    14125 4375
	1    0    0    -1  
$EndComp
$Comp
L cpu-board:74279263 L?
U 1 1 6491CA69
P 14400 3650
AR Path="/6491CA69" Ref="L?"  Part="1" 
AR Path="/5E9258C0/6491CA69" Ref="L25"  Part="1" 
F 0 "L25" H 14325 3700 42  0000 L BNN
F 1 " " H 14300 3700 34  0000 L BNN
F 2 "AllModules:C0603_1" H 14400 3650 50  0001 C CNN
F 3 "" H 14400 3650 50  0001 C CNN
F 4 "SMD FERRITE 200MA" H 14400 3650 50  0001 C CNN "Description"
F 5 "10022907" H 14400 3650 50  0001 C CNN "Item Number"
F 6 "WURTH ELEKTRONIK GMBH" H 14400 3650 50  0001 C CNN "Manufacturer"
F 7 "74279266" H 14400 3650 50  0001 C CNN "Manufacturer_No"
F 8 "MULTILAYER-SMD-FERRITE" H 14400 3650 50  0001 C CNN "Manufacturer_Desc"
	1    14400 3650
	1    0    0    -1  
$EndComp
$Comp
L cpu-board:C0603 C123
U 1 1 E72891DF
P 14125 3375
F 0 "C123" H 14219 3400 64  0000 L BNN
F 1 "150pF" H 14225 3319 42  0000 L BNN
F 2 "AllModules:C0402_1" H 14125 3375 50  0001 C CNN
F 3 "" H 14125 3375 50  0001 C CNN
F 4 "CAPACITOR CERAMIC, 150PF,50V,+/-5,NPO, 0402" H 14125 3375 50  0001 C CNN "Description"
F 5 "10022975" H 14125 3375 50  0001 C CNN "Item Number"
F 6 "YAGEO_RMS1" H 14125 3375 50  0001 C CNN "Manufacturer"
F 7 "CC0402JRNPO9BN151" H 14125 3375 50  0001 C CNN "Manufacturer_No"
F 8 "CAP CER 150PF 50V C0G/NPO 0402" H 14125 3375 50  0001 C CNN "Manufacturer_Desc"
F 9 "KEMET_RMS1" H 14125 3375 50  0001 C CNN "Manufacturer2"
F 10 "C0402C151J5GACTU" H 14125 3375 50  0001 C CNN "Manufacturer_No2"
F 11 "CERAMIC CHIP CAPACITOR" H 14125 3375 50  0001 C CNN "Manufacturer_Desc2"
F 12 "YAGEO_RMS1" H 14125 3375 50  0001 C CNN "Manufacturer3"
F 13 "223886915151" H 14125 3375 50  0001 C CNN "Manufacturer_No3"
F 14 "CAPACITOR, CERAMIC, MULTILAYER, 50 V, C0G, 0.00015 UF, SURFACE MOUNT, 0402" H 14125 3375 50  0001 C CNN "Manufacturer_Desc3"
	1    14125 3375
	1    0    0    -1  
$EndComp
$Comp
L cpu-board:74279263 L?
U 1 1 5FB96120
P 14400 3850
AR Path="/5FB96120" Ref="L?"  Part="1" 
AR Path="/5E9258C0/5FB96120" Ref="L26"  Part="1" 
F 0 "L26" H 14312 3912 42  0000 L BNN
F 1 " " H 14300 3900 34  0000 L BNN
F 2 "AllModules:C0603_1" H 14400 3850 50  0001 C CNN
F 3 "" H 14400 3850 50  0001 C CNN
F 4 "SMD FERRITE 200MA" H 14400 3850 50  0001 C CNN "Description"
F 5 "10022907" H 14400 3850 50  0001 C CNN "Item Number"
F 6 "WURTH ELEKTRONIK GMBH" H 14400 3850 50  0001 C CNN "Manufacturer"
F 7 "74279266" H 14400 3850 50  0001 C CNN "Manufacturer_No"
F 8 "MULTILAYER-SMD-FERRITE" H 14400 3850 50  0001 C CNN "Manufacturer_Desc"
	1    14400 3850
	1    0    0    -1  
$EndComp
$Comp
L cpu-board:GND #U$0262
U 1 1 52ADF2D3
P 14125 3125
F 0 "#U$0262" H 14125 3125 50  0001 C CNN
F 1 "GND" H 14025 3050 59  0000 L BNN
F 2 "" H 14125 3125 50  0001 C CNN
F 3 "" H 14125 3125 50  0001 C CNN
	1    14125 3125
	-1   0    0    1   
$EndComp
$Comp
L cpu-board:C0603 C124
U 1 1 F26774BC
P 14125 4100
F 0 "C124" H 14219 4113 64  0000 L BNN
F 1 "150pF" H 14225 4044 42  0000 L BNN
F 2 "AllModules:C0402_1" H 14125 4100 50  0001 C CNN
F 3 "" H 14125 4100 50  0001 C CNN
F 4 "CAPACITOR CERAMIC, 150PF,50V,+/-5,NPO, 0402" H 14125 4100 50  0001 C CNN "Description"
F 5 "10022975" H 14125 4100 50  0001 C CNN "Item Number"
F 6 "YAGEO_RMS1" H 14125 4100 50  0001 C CNN "Manufacturer"
F 7 "CC0402JRNPO9BN151" H 14125 4100 50  0001 C CNN "Manufacturer_No"
F 8 "CAP CER 150PF 50V C0G/NPO 0402" H 14125 4100 50  0001 C CNN "Manufacturer_Desc"
F 9 "KEMET_RMS1" H 14125 4100 50  0001 C CNN "Manufacturer2"
F 10 "C0402C151J5GACTU" H 14125 4100 50  0001 C CNN "Manufacturer_No2"
F 11 "CERAMIC CHIP CAPACITOR" H 14125 4100 50  0001 C CNN "Manufacturer_Desc2"
F 12 "YAGEO_RMS1" H 14125 4100 50  0001 C CNN "Manufacturer3"
F 13 "223886915151" H 14125 4100 50  0001 C CNN "Manufacturer_No3"
F 14 "CAPACITOR, CERAMIC, MULTILAYER, 50 V, C0G, 0.00015 UF, SURFACE MOUNT, 0402" H 14125 4100 50  0001 C CNN "Manufacturer_Desc3"
	1    14125 4100
	1    0    0    -1  
$EndComp
$Comp
L cpu-board:74279263 L?
U 1 1 B91119A5
P 13525 5600
AR Path="/B91119A5" Ref="L?"  Part="1" 
AR Path="/5E9258C0/B91119A5" Ref="L27"  Part="1" 
F 0 "L27" H 13475 5663 42  0000 L BNN
F 1 "74279263" H 13425 5650 34  0001 L BNN
F 2 "AllModules:C0603_1" H 13525 5600 50  0001 C CNN
F 3 "" H 13525 5600 50  0001 C CNN
	1    13525 5600
	1    0    0    -1  
$EndComp
$Comp
L cpu-board:C0603 C126
U 1 1 D8DBD313
P 13150 6000
F 0 "C126" H 13256 6013 64  0000 L BNN
F 1 "150pF" H 13263 5931 42  0000 L BNN
F 2 "AllModules:C0402_1" H 13150 6000 50  0001 C CNN
F 3 "" H 13150 6000 50  0001 C CNN
	1    13150 6000
	1    0    0    -1  
$EndComp
$Comp
L cpu-board:C0603 C127
U 1 1 6407AC1D
P 13175 5325
F 0 "C127" H 13281 5350 64  0000 L BNN
F 1 "150pF" H 13288 5268 42  0000 L BNN
F 2 "AllModules:C0402_1" H 13175 5325 50  0001 C CNN
F 3 "" H 13175 5325 50  0001 C CNN
	1    13175 5325
	1    0    0    -1  
$EndComp
$Comp
L cpu-board:+10VREF #U$?
U 1 1 5F7ACB82
P 13900 5350
AR Path="/5F7ACB82" Ref="#U$?"  Part="1" 
AR Path="/5E9258C0/5F7ACB82" Ref="#U$0264"  Part="1" 
F 0 "#U$0264" H 13900 5350 50  0001 C CNN
F 1 "+10VREF" H 13750 5150 59  0000 L BNN
F 2 "" H 13900 5350 50  0001 C CNN
F 3 "" H 13900 5350 50  0001 C CNN
	1    13900 5350
	-1   0    0    1   
$EndComp
$Comp
L cpu-board:0VANA #U$0265
U 1 1 3BAA26EC
P 13175 5175
F 0 "#U$0265" H 13175 5175 50  0001 C CNN
F 1 "0VANA" H 13087 4988 59  0000 L BNN
F 2 "" H 13175 5175 50  0001 C CNN
F 3 "" H 13175 5175 50  0001 C CNN
	1    13175 5175
	-1   0    0    1   
$EndComp
$Comp
L cpu-board:2BR254C J21
U 1 1 46F3F097
P 13575 3950
F 0 "J21" H 13588 3837 85  0000 L BNN
F 1 "2BR254C" H 13575 3950 50  0001 C CNN
F 2 "AllModules:MOL7395-2_1" H 13575 3950 50  0001 C CNN
F 3 "" H 13575 3950 50  0001 C CNN
F 4 "CONNECTOR, O2 VALVE, 2 CONTACTS" H 13575 3950 50  0001 C CNN "Description"
F 5 "10022542" H 13575 3950 50  0001 C CNN "Item Number"
F 6 "MOLEX_RMS1" H 13575 3950 50  0001 C CNN "Manufacturer"
F 7 "22057028" H 13575 3950 50  0001 C CNN "Manufacturer_No"
F 8 "" H 13575 3950 50  0001 C CNN "Manufacturer_Desc"
	1    13575 3950
	1    0    0    -1  
$EndComp
$Comp
L cpu-board:R0805 R49
U 1 1 8EE7C6AB
P 13900 5800
F 0 "R49" H 14000 5950 64  0000 R TNN
F 1 "4.7k" H 13975 6025 42  0000 R TNN
F 2 "AllModules:R0603_1" H 13900 5800 50  0001 C CNN
F 3 "" H 13900 5800 50  0001 C CNN
	1    13900 5800
	1    0    0    1   
$EndComp
$Comp
L cpu-board:C0805 C130
U 1 1 A2A653D3
P 14125 6100
F 0 "C130" H 14250 6150 64  0000 L CNN
F 1 "100nF" H 14250 6050 42  0000 L CNN
F 2 "AllModules:C0402_1" H 14125 6100 50  0001 C CNN
F 3 "" H 14125 6100 50  0001 C CNN
	1    14125 6100
	1    0    0    -1  
$EndComp
$Comp
L cpu-board:0VANA #U$0272
U 1 1 573EEE1A
P 14125 6300
F 0 "#U$0272" H 14125 6300 50  0001 C CNN
F 1 "0VANA" H 14025 6113 59  0000 L BNN
F 2 "" H 14125 6300 50  0001 C CNN
F 3 "" H 14125 6300 50  0001 C CNN
	1    14125 6300
	1    0    0    -1  
$EndComp
$Comp
L cpu-board:R0805 R69
U 1 1 E29E9980
P 6000 6250
F 0 "R69" H 6000 6500 64  0000 C CNN
F 1 "0" H 6000 6400 42  0000 C CNN
F 2 "AllModules:R0603_1" H 6000 6250 50  0001 C CNN
F 3 "" H 6000 6250 50  0001 C CNN
F 4 "RESISTANCE, 0 OHM,0603" H 6000 6250 50  0001 C CNN "Description"
F 5 "10023185" H 6000 6250 50  0001 C CNN "Item Number"
F 6 "YAGEO_RMS1" H 6000 6250 50  0001 C CNN "Manufacturer"
F 7 "RC0603JR-070RL" H 6000 6250 50  0001 C CNN "Manufacturer_No"
F 8 "RES 0.0 OHM 1/10W 0603 SMD" H 6000 6250 50  0001 C CNN "Manufacturer_Desc"
F 9 "YAGEO_RMS1" H 6000 6250 50  0001 C CNN "Manufacturer2"
F 10 "232270296001" H 6000 6250 50  0001 C CNN "Manufacturer_No2"
F 11 "JUMPER, METAL GLAZE/THICK FILM, 0.1 W, 0 OHM, SURFACE MOUNT, 0603" H 6000 6250 50  0001 C CNN "Manufacturer_Desc2"
F 12 "YAGEO_RMS1" H 6000 6250 50  0001 C CNN "Manufacturer3"
F 13 "232270296001L" H 6000 6250 50  0001 C CNN "Manufacturer_No3"
F 14 "JUMPER, METAL GLAZE/THICK FILM, 0.1 W, 0 OHM, SURFACE MOUNT, 0603" H 6000 6250 50  0001 C CNN "Manufacturer_Desc3"
F 15 "ASJ" H 6000 6250 50  0001 C CNN "Manufacturer4"
F 16 "CR16000ZL" H 6000 6250 50  0001 C CNN "Manufacturer_No4"
F 17 "THICK FILM CHIP RESISTOR" H 6000 6250 50  0001 C CNN "Manufacturer_Desc4"
F 18 "KAMAYA                          (049580)" H 6000 6250 50  0001 C CNN "Manufacturer5"
F 19 "RMC1/16JPTP" H 6000 6250 50  0001 C CNN "Manufacturer_No5"
F 20 "JUMPER" H 6000 6250 50  0001 C CNN "Manufacturer_Desc5"
	1    6000 6250
	1    0    0    -1  
$EndComp
$Comp
L cpu-board:C0805 C93
U 1 1 F2D14F41
P 6525 6700
F 0 "C93" H 6650 6750 64  0000 L CNN
F 1 "100nF" H 6650 6650 42  0000 L CNN
F 2 "AllModules:C0402_1" H 6525 6700 50  0001 C CNN
F 3 "" H 6525 6700 50  0001 C CNN
	1    6525 6700
	1    0    0    -1  
$EndComp
$Comp
L cpu-board:0VANA #U$065
U 1 1 92CBB1CF
P 6350 7125
F 0 "#U$065" H 6350 7125 50  0001 C CNN
F 1 "0VANA" H 6212 6925 59  0000 L BNN
F 2 "" H 6350 7125 50  0001 C CNN
F 3 "" H 6350 7125 50  0001 C CNN
	1    6350 7125
	1    0    0    -1  
$EndComp
$Comp
L cpu-board:74279263 L?
U 1 1 769AA1BD
P 11100 1500
AR Path="/769AA1BD" Ref="L?"  Part="1" 
AR Path="/5E9258C0/769AA1BD" Ref="L7"  Part="1" 
F 0 "L7" H 11062 1562 42  0000 L BNN
F 1 " " H 11000 1550 34  0000 L BNN
F 2 "AllModules:RC1206_1" H 11100 1500 50  0001 C CNN
F 3 "" H 11100 1500 50  0001 C CNN
F 4 "SMD FERRITE, 1A,1206" H 11100 1500 50  0001 C CNN "Description"
F 5 "10022911" H 11100 1500 50  0001 C CNN "Item Number"
F 6 "WURTH ELEKTRONIK GMBH" H 11100 1500 50  0001 C CNN "Manufacturer"
F 7 "74279218" H 11100 1500 50  0001 C CNN "Manufacturer_No"
F 8 "MULTILAYER-SMD-FERRITE" H 11100 1500 50  0001 C CNN "Manufacturer_Desc"
	1    11100 1500
	-1   0    0    -1  
$EndComp
$Comp
L cpu-board:74279263 L?
U 1 1 FB4D7CA5
P 11100 1700
AR Path="/FB4D7CA5" Ref="L?"  Part="1" 
AR Path="/5E9258C0/FB4D7CA5" Ref="L9"  Part="1" 
F 0 "L9" H 11062 1762 42  0000 L BNN
F 1 " " H 11000 1750 34  0000 L BNN
F 2 "AllModules:C0603_1" H 11100 1700 50  0001 C CNN
F 3 "" H 11100 1700 50  0001 C CNN
F 4 "SMD FERRITE 200MA" H 11100 1700 50  0001 C CNN "Description"
F 5 "10022907" H 11100 1700 50  0001 C CNN "Item Number"
F 6 "WURTH ELEKTRONIK GMBH" H 11100 1700 50  0001 C CNN "Manufacturer"
F 7 "74279266" H 11100 1700 50  0001 C CNN "Manufacturer_No"
F 8 "MULTILAYER-SMD-FERRITE" H 11100 1700 50  0001 C CNN "Manufacturer_Desc"
	1    11100 1700
	-1   0    0    -1  
$EndComp
$Comp
L cpu-board:74279263 L?
U 1 1 0E380C20
P 11100 1900
AR Path="/0E380C20" Ref="L?"  Part="1" 
AR Path="/5E9258C0/0E380C20" Ref="L10"  Part="1" 
F 0 "L10" H 11012 1962 42  0000 L BNN
F 1 " " H 11000 1950 34  0000 L BNN
F 2 "AllModules:C0603_1" H 11100 1900 50  0001 C CNN
F 3 "" H 11100 1900 50  0001 C CNN
F 4 "SMD FERRITE 200MA" H 11100 1900 50  0001 C CNN "Description"
F 5 "10022907" H 11100 1900 50  0001 C CNN "Item Number"
F 6 "WURTH ELEKTRONIK GMBH" H 11100 1900 50  0001 C CNN "Manufacturer"
F 7 "74279266" H 11100 1900 50  0001 C CNN "Manufacturer_No"
F 8 "MULTILAYER-SMD-FERRITE" H 11100 1900 50  0001 C CNN "Manufacturer_Desc"
	1    11100 1900
	-1   0    0    -1  
$EndComp
$Comp
L cpu-board:RESEAU_4C C38
U 1 1 897E4B72
P 11550 2925
F 0 "C38" H 11950 2925 64  0000 L BNN
F 1 "47pF" H 11950 2825 42  0000 L BNN
F 2 "AllModules:C0612-4_1" H 11550 2925 50  0001 C CNN
F 3 "" H 11550 2925 50  0001 C CNN
F 4 "CAPACITOR ARRAY, 47PF, 50V, +/-10%,NPO,0612" H 11550 2925 50  0001 C CNN "Description"
F 5 "10095973" H 11550 2925 50  0001 C CNN "Item Number"
F 6 "YAGEO_RMS1" H 11550 2925 50  0001 C CNN "Manufacturer"
F 7 "225514611532" H 11550 2925 50  0001 C CNN "Manufacturer_No"
F 8 "ISOLATED C NETWORK, 50V, C0G, 0.000047UF, SURFACE MOUNT, CHIP-8" H 11550 2925 50  0001 C CNN "Manufacturer_Desc"
	1    11550 2925
	-1   0    0    -1  
$EndComp
$Comp
L cpu-board:GND #U$0268
U 1 1 6D17203A
P 11300 1000
F 0 "#U$0268" H 11300 1000 50  0001 C CNN
F 1 "GND" H 11212 913 59  0000 L BNN
F 2 "" H 11300 1000 50  0001 C CNN
F 3 "" H 11300 1000 50  0001 C CNN
	1    11300 1000
	1    0    0    1   
$EndComp
$Comp
L cpu-board:74279263 L?
U 1 1 9CA3DB02
P 4525 5825
AR Path="/9CA3DB02" Ref="L?"  Part="1" 
AR Path="/5E9258C0/9CA3DB02" Ref="L12"  Part="1" 
F 0 "L12" H 4463 5888 42  0000 L BNN
F 1 " " H 4425 5875 34  0000 L BNN
F 2 "AllModules:C0603_1" H 4525 5825 50  0001 C CNN
F 3 "" H 4525 5825 50  0001 C CNN
F 4 "SMD FERRITE 200MA" H 4525 5825 50  0001 C CNN "Description"
F 5 "10022907" H 4525 5825 50  0001 C CNN "Item Number"
F 6 "WURTH ELEKTRONIK GMBH" H 4525 5825 50  0001 C CNN "Manufacturer"
F 7 "74279266" H 4525 5825 50  0001 C CNN "Manufacturer_No"
F 8 "MULTILAYER-SMD-FERRITE" H 4525 5825 50  0001 C CNN "Manufacturer_Desc"
	1    4525 5825
	1    0    0    -1  
$EndComp
$Comp
L cpu-board:74279263 L?
U 1 1 4AF5E44F
P 4525 6150
AR Path="/4AF5E44F" Ref="L?"  Part="1" 
AR Path="/5E9258C0/4AF5E44F" Ref="L13"  Part="1" 
F 0 "L13" H 4463 6287 42  0000 L BNN
F 1 " " H 4425 6200 34  0001 L BNN
F 2 "AllModules:C0603_1" H 4525 6150 50  0001 C CNN
F 3 "" H 4525 6150 50  0001 C CNN
	1    4525 6150
	1    0    0    -1  
$EndComp
$Comp
L cpu-board:74279263 L?
U 1 1 1FFF9411
P 4525 6250
AR Path="/1FFF9411" Ref="L?"  Part="1" 
AR Path="/5E9258C0/1FFF9411" Ref="L14"  Part="1" 
F 0 "L14" H 4675 6262 42  0000 L BNN
F 1 " " H 4425 6300 34  0000 L BNN
F 2 "AllModules:C0603_1" H 4525 6250 50  0001 C CNN
F 3 "" H 4525 6250 50  0001 C CNN
F 4 "SMD FERRITE 200MA" H 4525 6250 50  0001 C CNN "Description"
F 5 "10022907" H 4525 6250 50  0001 C CNN "Item Number"
F 6 "WURTH ELEKTRONIK GMBH" H 4525 6250 50  0001 C CNN "Manufacturer"
F 7 "74279266" H 4525 6250 50  0001 C CNN "Manufacturer_No"
F 8 "MULTILAYER-SMD-FERRITE" H 4525 6250 50  0001 C CNN "Manufacturer_Desc"
	1    4525 6250
	1    0    0    -1  
$EndComp
$Comp
L cpu-board:74279263 L?
U 1 1 3DD13E20
P 4525 6350
AR Path="/3DD13E20" Ref="L?"  Part="1" 
AR Path="/5E9258C0/3DD13E20" Ref="L15"  Part="1" 
F 0 "L15" H 4675 6375 42  0000 L BNN
F 1 " " H 4425 6400 34  0000 L BNN
F 2 "AllModules:C0603_1" H 4525 6350 50  0001 C CNN
F 3 "" H 4525 6350 50  0001 C CNN
F 4 "SMD FERRITE 200MA" H 4525 6350 50  0001 C CNN "Description"
F 5 "10022907" H 4525 6350 50  0001 C CNN "Item Number"
F 6 "WURTH ELEKTRONIK GMBH" H 4525 6350 50  0001 C CNN "Manufacturer"
F 7 "74279266" H 4525 6350 50  0001 C CNN "Manufacturer_No"
F 8 "MULTILAYER-SMD-FERRITE" H 4525 6350 50  0001 C CNN "Manufacturer_Desc"
	1    4525 6350
	1    0    0    -1  
$EndComp
$Comp
L cpu-board:74279263 L?
U 1 1 DF33D3D6
P 4525 6450
AR Path="/DF33D3D6" Ref="L?"  Part="1" 
AR Path="/5E9258C0/DF33D3D6" Ref="L17"  Part="1" 
F 0 "L17" H 4663 6462 42  0000 L BNN
F 1 " " H 4663 6587 34  0000 L BNN
F 2 "AllModules:C0603_1" H 4525 6450 50  0001 C CNN
F 3 "" H 4525 6450 50  0001 C CNN
F 4 "SMD FERRITE 200MA" H 4525 6450 50  0001 C CNN "Description"
F 5 "10022907" H 4525 6450 50  0001 C CNN "Item Number"
F 6 "WURTH ELEKTRONIK GMBH" H 4525 6450 50  0001 C CNN "Manufacturer"
F 7 "74279266" H 4525 6450 50  0001 C CNN "Manufacturer_No"
F 8 "MULTILAYER-SMD-FERRITE" H 4525 6450 50  0001 C CNN "Manufacturer_Desc"
	1    4525 6450
	1    0    0    -1  
$EndComp
$Comp
L cpu-board:10BRMF J4
U 1 1 FA7CA15B
P 8650 7625
F 0 "J4" H 8650 7475 85  0000 L BNN
F 1 "10BRMF" H 8650 7625 50  0001 C CNN
F 2 "AllModules:BP2X5C_1" H 8650 7625 50  0001 C CNN
F 3 "" H 8650 7625 50  0001 C CNN
F 4 "HEADER CONNECTOR, RIGHT ANGLE, 10 PINS" H 8650 7625 50  0001 C CNN "Description"
F 5 "10052329" H 8650 7625 50  0001 C CNN "Item Number"
F 6 "FCI/BERG" H 8650 7625 50  0001 C CNN "Manufacturer"
F 7 "75867-101LF" H 8650 7625 50  0001 C CNN "Manufacturer_No"
F 8 "" H 8650 7625 50  0001 C CNN "Manufacturer_Desc"
F 9 "FCI/BERG" H 8650 7625 50  0001 C CNN "Manufacturer2"
F 10 "88874-010LF" H 8650 7625 50  0001 C CNN "Manufacturer_No2"
F 11 "" H 8650 7625 50  0001 C CNN "Manufacturer_Desc2"
	1    8650 7625
	1    0    0    -1  
$EndComp
$Comp
L cpu-board:74279263 L?
U 1 1 324ADF67
P 10575 6925
AR Path="/324ADF67" Ref="L?"  Part="1" 
AR Path="/5E9258C0/324ADF67" Ref="L32"  Part="1" 
F 0 "L32" H 10462 6975 42  0000 L BNN
F 1 " " H 10475 6975 34  0000 L BNN
F 2 "AllModules:C0603_1" H 10575 6925 50  0001 C CNN
F 3 "" H 10575 6925 50  0001 C CNN
F 4 "SMD FERRITE 200MA" H 10575 6925 50  0001 C CNN "Description"
F 5 "10022907" H 10575 6925 50  0001 C CNN "Item Number"
F 6 "WURTH ELEKTRONIK GMBH" H 10575 6925 50  0001 C CNN "Manufacturer"
F 7 "74279266" H 10575 6925 50  0001 C CNN "Manufacturer_No"
F 8 "MULTILAYER-SMD-FERRITE" H 10575 6925 50  0001 C CNN "Manufacturer_Desc"
	1    10575 6925
	1    0    0    -1  
$EndComp
$Comp
L cpu-board:74279263 L?
U 1 1 0382B5B7
P 10575 6725
AR Path="/0382B5B7" Ref="L?"  Part="1" 
AR Path="/5E9258C0/0382B5B7" Ref="L33"  Part="1" 
F 0 "L33" H 10475 6775 42  0000 L BNN
F 1 " " H 10475 6775 34  0000 L BNN
F 2 "AllModules:C0603_1" H 10575 6725 50  0001 C CNN
F 3 "" H 10575 6725 50  0001 C CNN
F 4 "SMD FERRITE 200MA" H 10575 6725 50  0001 C CNN "Description"
F 5 "10022907" H 10575 6725 50  0001 C CNN "Item Number"
F 6 "WURTH ELEKTRONIK GMBH" H 10575 6725 50  0001 C CNN "Manufacturer"
F 7 "74279266" H 10575 6725 50  0001 C CNN "Manufacturer_No"
F 8 "MULTILAYER-SMD-FERRITE" H 10575 6725 50  0001 C CNN "Manufacturer_Desc"
	1    10575 6725
	1    0    0    -1  
$EndComp
$Comp
L cpu-board:74279263 L?
U 1 1 04EF688F
P 10575 6525
AR Path="/04EF688F" Ref="L?"  Part="1" 
AR Path="/5E9258C0/04EF688F" Ref="L34"  Part="1" 
F 0 "L34" H 10475 6575 42  0000 L BNN
F 1 " " H 10475 6575 34  0000 L BNN
F 2 "AllModules:C0603_1" H 10575 6525 50  0001 C CNN
F 3 "" H 10575 6525 50  0001 C CNN
F 4 "SMD FERRITE 200MA" H 10575 6525 50  0001 C CNN "Description"
F 5 "10022907" H 10575 6525 50  0001 C CNN "Item Number"
F 6 "WURTH ELEKTRONIK GMBH" H 10575 6525 50  0001 C CNN "Manufacturer"
F 7 "74279266" H 10575 6525 50  0001 C CNN "Manufacturer_No"
F 8 "MULTILAYER-SMD-FERRITE" H 10575 6525 50  0001 C CNN "Manufacturer_Desc"
	1    10575 6525
	1    0    0    -1  
$EndComp
$Comp
L cpu-board:R0805 R11
U 1 1 D126BCF1
P 9275 5450
F 0 "R11" V 9350 5188 64  0000 L BNN
F 1 "3.3k" V 9250 5200 42  0000 L BNN
F 2 "AllModules:R0603_1" H 9275 5450 50  0001 C CNN
F 3 "" H 9275 5450 50  0001 C CNN
F 4 "RESISTOR,3.3K OHM,0.063W,+/-1%,0603" H 9275 5450 50  0001 C CNN "Description"
F 5 "10022731" H 9275 5450 50  0001 C CNN "Item Number"
F 6 "YAGEO_RMS1" H 9275 5450 50  0001 C CNN "Manufacturer"
F 7 "RC0603FR-073K3L" H 9275 5450 50  0001 C CNN "Manufacturer_No"
F 8 "RESISTOR, METAL GLAZE/THICK FILM, 0.1 W, 1 %, 100 PPM, 3300 OHM, SURFACE MOUNT, 0603" H 9275 5450 50  0001 C CNN "Manufacturer_Desc"
F 9 "YAGEO_RMS1" H 9275 5450 50  0001 C CNN "Manufacturer2"
F 10 "232270463302" H 9275 5450 50  0001 C CNN "Manufacturer_No2"
F 11 "RESISTOR, METAL GLAZE/THICK FILM, 0.1 W, 1 %, 100 PPM, 3300 OHM, SURFACE MOUNT, 0603" H 9275 5450 50  0001 C CNN "Manufacturer_Desc2"
F 12 "BOURNS_RMS1" H 9275 5450 50  0001 C CNN "Manufacturer3"
F 13 "CR0603-FX-3301ELF" H 9275 5450 50  0001 C CNN "Manufacturer_No3"
F 14 "CHIP RESISTOR" H 9275 5450 50  0001 C CNN "Manufacturer_Desc3"
F 15 "YAGEO_RMS1" H 9275 5450 50  0001 C CNN "Manufacturer4"
F 16 "232270463302L" H 9275 5450 50  0001 C CNN "Manufacturer_No4"
F 17 "RESISTOR, METAL GLAZE/THICK FILM, 0.1 W, 1 %, 100 PPM, 3300 OHM, SURFACE MOUNT, 0603" H 9275 5450 50  0001 C CNN "Manufacturer_Desc4"
	1    9275 5450
	0    -1   -1   0   
$EndComp
$Comp
L cpu-board:+5VREF #U$0167
U 1 1 5D80D2F4
P 9275 5025
F 0 "#U$0167" H 9275 5025 50  0001 C CNN
F 1 "+5VREF" H 9100 4938 59  0000 L BNN
F 2 "" H 9275 5025 50  0001 C CNN
F 3 "" H 9275 5025 50  0001 C CNN
	1    9275 5025
	-1   0    0    1   
$EndComp
$Comp
L cpu-board:C0805 C11
U 1 1 F1735AC7
P 9275 5875
F 0 "C11" H 9400 5950 64  0000 L CNN
F 1 "100nF" H 9400 5850 42  0000 L CNN
F 2 "AllModules:C0402_1" H 9275 5875 50  0001 C CNN
F 3 "" H 9275 5875 50  0001 C CNN
F 4 "CAPACITOR,100NF,16V,+/-10%,X7R,0402" H 9275 5875 50  0001 C CNN "Description"
F 5 "10022607" H 9275 5875 50  0001 C CNN "Item Number"
F 6 "MURATA" H 9275 5875 50  0001 C CNN "Manufacturer"
F 7 "GRM155R71C104JA88J" H 9275 5875 50  0001 C CNN "Manufacturer_No"
F 8 "CAPACITOR, CERAMIC, MULTILAYER, 16V, X7R, 0.1UF, 0402" H 9275 5875 50  0001 C CNN "Manufacturer_Desc"
F 9 "YAGEO_RMS1" H 9275 5875 50  0001 C CNN "Manufacturer2"
F 10 "CC0402KRX7R7BB104" H 9275 5875 50  0001 C CNN "Manufacturer_No2"
F 11 "CAP CER 0.1uF 16V X7R 10% 0402" H 9275 5875 50  0001 C CNN "Manufacturer_Desc2"
F 12 "YAGEO_RMS1" H 9275 5875 50  0001 C CNN "Manufacturer3"
F 13 "223878715649" H 9275 5875 50  0001 C CNN "Manufacturer_No3"
F 14 "CAPACITOR, CERAMIC, MULTILAYER, 16 V, X7R, 0.1 UF, SURFACE MOUNT, 0402" H 9275 5875 50  0001 C CNN "Manufacturer_Desc3"
F 15 "MURATA MANUFACTURING CO., LTD." H 9275 5875 50  0001 C CNN "Manufacturer4"
F 16 "GRM155R71C104KA88D" H 9275 5875 50  0001 C CNN "Manufacturer_No4"
F 17 "MONOLITHIC CERAMIC CAPACITOR" H 9275 5875 50  0001 C CNN "Manufacturer_Desc4"
	1    9275 5875
	1    0    0    -1  
$EndComp
$Comp
L cpu-board:C0603 C12
U 1 1 DF23C80B
P 11300 1300
F 0 "C12" H 11032 1313 64  0000 L BNN
F 1 "47pF" H 11038 1244 42  0000 L BNN
F 2 "AllModules:C0402_1" H 11300 1300 50  0001 C CNN
F 3 "" H 11300 1300 50  0001 C CNN
F 4 "CAPACITOR,47 PF,+/-5%,50V,0402" H 11300 1300 50  0001 C CNN "Description"
F 5 "10022623" H 11300 1300 50  0001 C CNN "Item Number"
F 6 "SAMSUNG_RMS1" H 11300 1300 50  0001 C CNN "Manufacturer"
F 7 "CL05C470JB5NNNC" H 11300 1300 50  0001 C CNN "Manufacturer_No"
F 8 "CAP CER 47PF 50V 5% NP0 0402" H 11300 1300 50  0001 C CNN "Manufacturer_Desc"
F 9 "KEMET_RMS1" H 11300 1300 50  0001 C CNN "Manufacturer2"
F 10 "C0402C470J5GACTU" H 11300 1300 50  0001 C CNN "Manufacturer_No2"
F 11 "CAP,CER,SMT,0402,5%,50V,47PF" H 11300 1300 50  0001 C CNN "Manufacturer_Desc2"
F 12 "MURATA MANUFACTURING CO., LTD." H 11300 1300 50  0001 C CNN "Manufacturer3"
F 13 "GRM1555C1H470JZ01D" H 11300 1300 50  0001 C CNN "Manufacturer_No3"
F 14 "MONOLITHIC CERAMIC CAPACITOR" H 11300 1300 50  0001 C CNN "Manufacturer_Desc3"
F 15 "KEMET_RMS1" H 11300 1300 50  0001 C CNN "Manufacturer4"
F 16 "C0402C470J5GAC" H 11300 1300 50  0001 C CNN "Manufacturer_No4"
F 17 "CAP,CER,SMT,0402,5%,50V,47PF" H 11300 1300 50  0001 C CNN "Manufacturer_Desc4"
F 18 "MURATA MANUFACTURING CO., LTD." H 11300 1300 50  0001 C CNN "Manufacturer5"
F 19 "GRM1555C1H470JA01D" H 11300 1300 50  0001 C CNN "Manufacturer_No5"
F 20 "CAP CER 47PF 50V 5% NP0 0402" H 11300 1300 50  0001 C CNN "Manufacturer_Desc5"
	1    11300 1300
	-1   0    0    -1  
$EndComp
$Comp
L cpu-board:C0603 C13
U 1 1 F7DD181D
P 3400 5425
F 0 "C13" H 3506 5450 64  0000 L BNN
F 1 "47pF" H 3500 5368 42  0000 L BNN
F 2 "AllModules:C0402_1" H 3400 5425 50  0001 C CNN
F 3 "" H 3400 5425 50  0001 C CNN
F 4 "CAPACITOR,47 PF,+/-5%,50V,0402" H 3400 5425 50  0001 C CNN "Description"
F 5 "10022623" H 3400 5425 50  0001 C CNN "Item Number"
F 6 "SAMSUNG_RMS1" H 3400 5425 50  0001 C CNN "Manufacturer"
F 7 "CL05C470JB5NNNC" H 3400 5425 50  0001 C CNN "Manufacturer_No"
F 8 "CAP CER 47PF 50V 5% NP0 0402" H 3400 5425 50  0001 C CNN "Manufacturer_Desc"
F 9 "KEMET_RMS1" H 3400 5425 50  0001 C CNN "Manufacturer2"
F 10 "C0402C470J5GACTU" H 3400 5425 50  0001 C CNN "Manufacturer_No2"
F 11 "CAP,CER,SMT,0402,5%,50V,47PF" H 3400 5425 50  0001 C CNN "Manufacturer_Desc2"
F 12 "MURATA MANUFACTURING CO., LTD." H 3400 5425 50  0001 C CNN "Manufacturer3"
F 13 "GRM1555C1H470JZ01D" H 3400 5425 50  0001 C CNN "Manufacturer_No3"
F 14 "MONOLITHIC CERAMIC CAPACITOR" H 3400 5425 50  0001 C CNN "Manufacturer_Desc3"
F 15 "KEMET_RMS1" H 3400 5425 50  0001 C CNN "Manufacturer4"
F 16 "C0402C470J5GAC" H 3400 5425 50  0001 C CNN "Manufacturer_No4"
F 17 "CAP,CER,SMT,0402,5%,50V,47PF" H 3400 5425 50  0001 C CNN "Manufacturer_Desc4"
F 18 "MURATA MANUFACTURING CO., LTD." H 3400 5425 50  0001 C CNN "Manufacturer5"
F 19 "GRM1555C1H470JA01D" H 3400 5425 50  0001 C CNN "Manufacturer_No5"
F 20 "CAP CER 47PF 50V 5% NP0 0402" H 3400 5425 50  0001 C CNN "Manufacturer_Desc5"
	1    3400 5425
	1    0    0    -1  
$EndComp
$Comp
L cpu-board:B8B_ZR J2
U 1 1 C3E76336
P 12300 2450
F 0 "J2" H 12250 1987 85  0000 L BNN
F 1 "B8B_ZR" H 12200 1862 59  0000 L BNN
F 2 "AllModules:B8BZR-SM3TF_1" H 12300 2450 50  0001 C CNN
F 3 "" H 12300 2450 50  0001 C CNN
F 4 "CONNECTOR, 8 CONTACTS" H 12300 2450 50  0001 C CNN "Description"
F 5 "10097257" H 12300 2450 50  0001 C CNN "Item Number"
F 6 "J.S.T. CORPORATION" H 12300 2450 50  0001 C CNN "Manufacturer"
F 7 "B8B-ZR-SM4-TF (LF)(SN)" H 12300 2450 50  0001 C CNN "Manufacturer_No"
F 8 "CONNECTOR" H 12300 2450 50  0001 C CNN "Manufacturer_Desc"
	1    12300 2450
	-1   0    0    -1  
$EndComp
$Comp
L cpu-board:G6K2G RL1
U 1 1 AE3C6605
P 10225 2400
F 0 "RL1" H 10550 2375 45  0001 L BNN
F 1 "G6K2G" H 10225 2650 59  0001 L BNN
F 2 "AllModules:G6K2G_1" H 10225 2400 50  0001 C CNN
F 3 "" H 10225 2400 50  0001 C CNN
F 4 "RELAY,LOW VOLTAGE 1A COIL 5VDC" H 10225 2400 50  0001 C CNN "Description"
F 5 "10023252" H 10225 2400 50  0001 C CNN "Item Number"
F 6 "OMRON ELECTRONICS INC" H 10225 2400 50  0001 C CNN "Manufacturer"
F 7 "G6K-2G-TR 5 VDC" H 10225 2400 50  0001 C CNN "Manufacturer_No"
F 8 "" H 10225 2400 50  0001 C CNN "Manufacturer_Desc"
F 9 "OMRON ELECTRONICS INC" H 10225 2400 50  0001 C CNN "Manufacturer2"
F 10 "G6K-2G 5 VDC" H 10225 2400 50  0001 C CNN "Manufacturer_No2"
F 11 "" H 10225 2400 50  0001 C CNN "Manufacturer_Desc2"
	1    10225 2400
	1    0    0    -1  
$EndComp
$Comp
L cpu-board:G6K2G RL1
U 2 1 AE3C6609
P 10275 3850
F 0 "RL1" H 10575 4150 85  0000 L BNN
F 1 "G6K2G" H 10575 4075 59  0000 L BNN
F 2 "AllModules:G6K2G_1" H 10275 3850 50  0001 C CNN
F 3 "" H 10275 3850 50  0001 C CNN
F 4 "RELAY,LOW VOLTAGE 1A COIL 5VDC" H 10225 2400 50  0001 C CNN "Description"
F 5 "10023252" H 10225 2400 50  0001 C CNN "Item Number"
F 6 "OMRON ELECTRONICS INC" H 10225 2400 50  0001 C CNN "Manufacturer"
F 7 "G6K-2G-TR 5 VDC" H 10225 2400 50  0001 C CNN "Manufacturer_No"
F 8 "" H 10225 2400 50  0001 C CNN "Manufacturer_Desc"
F 9 "OMRON ELECTRONICS INC" H 10225 2400 50  0001 C CNN "Manufacturer2"
F 10 "G6K-2G 5 VDC" H 10225 2400 50  0001 C CNN "Manufacturer_No2"
F 11 "" H 10225 2400 50  0001 C CNN "Manufacturer_Desc2"
	2    10275 3850
	1    0    0    -1  
$EndComp
$Comp
L cpu-board:G6K2G RL1
U 3 1 AE3C660D
P 10650 3000
F 0 "RL1" H 10625 3050 45  0001 L BNN
F 1 "G6K2G" H 10650 3250 59  0001 L BNN
F 2 "AllModules:G6K2G_1" H 10650 3000 50  0001 C CNN
F 3 "" H 10650 3000 50  0001 C CNN
F 4 "RELAY,LOW VOLTAGE 1A COIL 5VDC" H 10225 2400 50  0001 C CNN "Description"
F 5 "10023252" H 10225 2400 50  0001 C CNN "Item Number"
F 6 "OMRON ELECTRONICS INC" H 10225 2400 50  0001 C CNN "Manufacturer"
F 7 "G6K-2G-TR 5 VDC" H 10225 2400 50  0001 C CNN "Manufacturer_No"
F 8 "" H 10225 2400 50  0001 C CNN "Manufacturer_Desc"
F 9 "OMRON ELECTRONICS INC" H 10225 2400 50  0001 C CNN "Manufacturer2"
F 10 "G6K-2G 5 VDC" H 10225 2400 50  0001 C CNN "Manufacturer_No2"
F 11 "" H 10225 2400 50  0001 C CNN "Manufacturer_Desc2"
	3    10650 3000
	-1   0    0    1   
$EndComp
$Comp
L cpu-board:GND #U$0520
U 1 1 F1C50A96
P 10700 4400
F 0 "#U$0520" H 10700 4400 50  0001 C CNN
F 1 "GND" H 10637 4288 59  0000 L BNN
F 2 "" H 10700 4400 50  0001 C CNN
F 3 "" H 10700 4400 50  0001 C CNN
	1    10700 4400
	1    0    0    -1  
$EndComp
$Comp
L cpu-board:BAT54 D13
U 1 1 7D634AE3
P 9775 3750
F 0 "D13" H 9746 3904 59  0000 L BNN
F 1 "BAT54" H 9761 3836 42  0000 L BNN
F 2 "AllModules:SOT23-1G_1" H 9775 3750 50  0001 C CNN
F 3 "" H 9775 3750 50  0001 C CNN
F 4 "DIODE SCHOTTKY, 30V, 200MA" H 9775 3750 50  0001 C CNN "Description"
F 5 "10022652" H 9775 3750 50  0001 C CNN "Item Number"
F 6 "NXP SEMICONDUCTORS_RMS1" H 9775 3750 50  0001 C CNN "Manufacturer"
F 7 "BAT54,215" H 9775 3750 50  0001 C CNN "Manufacturer_No"
F 8 "" H 9775 3750 50  0001 C CNN "Manufacturer_Desc"
F 9 "NXP SEMICONDUCTORS_RMS1" H 9775 3750 50  0001 C CNN "Manufacturer2"
F 10 "BAT54" H 9775 3750 50  0001 C CNN "Manufacturer_No2"
F 11 "SCHOTTKY BARRIER DOUBLE DIODE" H 9775 3750 50  0001 C CNN "Manufacturer_Desc2"
	1    9775 3750
	1    0    0    -1  
$EndComp
$Comp
L cpu-board:GND #U$0525
U 1 1 09CA47E4
P 10900 3150
F 0 "#U$0525" H 10900 3150 50  0001 C CNN
F 1 "GND" H 10813 3062 59  0000 L BNN
F 2 "" H 10900 3150 50  0001 C CNN
F 3 "" H 10900 3150 50  0001 C CNN
	1    10900 3150
	1    0    0    -1  
$EndComp
$Comp
L cpu-board:IRLML5103 T19
U 1 1 EE28C6DF
P 9375 3850
F 0 "T19" V 9725 3765 59  0000 L BNN
F 1 "BSS84" V 9645 3777 56  0000 L BNN
F 2 "AllModules:SOT23-GSD_1" H 9375 3850 50  0001 C CNN
F 3 "" H 9375 3850 50  0001 C CNN
F 4 "TRANSISTOR, P CHANNEL, 50V, 0.13A,      5 OHM, SOT23" H 9375 3850 50  0001 C CNN "Description"
F 5 "10022157" H 9375 3850 50  0001 C CNN "Item Number"
F 6 "NXP SEMICONDUCTORS_RMS1" H 9375 3850 50  0001 C CNN "Manufacturer"
F 7 "BSS84" H 9375 3850 50  0001 C CNN "Manufacturer_No"
F 8 "MOSFET P CHANNEL" H 9375 3850 50  0001 C CNN "Manufacturer_Desc"
F 9 "ON SEMICONDUCTOR_RMS1" H 9375 3850 50  0001 C CNN "Manufacturer2"
F 10 "BSS84LT1G" H 9375 3850 50  0001 C CNN "Manufacturer_No2"
F 11 "POWER MOSFET" H 9375 3850 50  0001 C CNN "Manufacturer_Desc2"
F 12 "NXP SEMICONDUCTORS_RMS1" H 9375 3850 50  0001 C CNN "Manufacturer3"
F 13 "BSS84,215" H 9375 3850 50  0001 C CNN "Manufacturer_No3"
F 14 "" H 9375 3850 50  0001 C CNN "Manufacturer_Desc3"
	1    9375 3850
	0    1    -1   0   
$EndComp
$Comp
L cpu-board:R0805 R68
U 1 1 49CDDF81
P 9075 4000
F 0 "R68" V 9075 4263 64  0000 R TNN
F 1 "100k" V 9000 4263 42  0000 R TNN
F 2 "AllModules:R0603_1" H 9075 4000 50  0001 C CNN
F 3 "" H 9075 4000 50  0001 C CNN
F 4 "RESISTOR,100 K OHM, 0.063W +/-5%" H 9075 4000 50  0001 C CNN "Description"
F 5 "10022732" H 9075 4000 50  0001 C CNN "Item Number"
F 6 "YAGEO_RMS1" H 9075 4000 50  0001 C CNN "Manufacturer"
F 7 "232270260104L" H 9075 4000 50  0001 C CNN "Manufacturer_No"
F 8 "RESISTOR, METAL GLAZE/THICK FILM, 0.1 W, 5 %, 100 PPM, 100000 OHM, SURFACE MOUNT, 0603" H 9075 4000 50  0001 C CNN "Manufacturer_Desc"
F 9 "YAGEO_RMS1" H 9075 4000 50  0001 C CNN "Manufacturer2"
F 10 "232270260104" H 9075 4000 50  0001 C CNN "Manufacturer_No2"
F 11 "RESISTOR, METAL GLAZE/THICK FILM, 0.1 W, 5 %, 100 PPM, 100000 OHM, SURFACE MOUNT, 0603" H 9075 4000 50  0001 C CNN "Manufacturer_Desc2"
F 12 "YAGEO_RMS1" H 9075 4000 50  0001 C CNN "Manufacturer3"
F 13 "RC0603JR-07100KL" H 9075 4000 50  0001 C CNN "Manufacturer_No3"
F 14 "RESISTOR, METAL GLAZE/THICK FILM, 0.1 W, 5 %, 100 PPM, 100000 OHM, SURFACE MOUNT, 0603" H 9075 4000 50  0001 C CNN "Manufacturer_Desc3"
F 15 "PANASONIC_RMS1" H 9075 4000 50  0001 C CNN "Manufacturer4"
F 16 "ERJ3GEYJ104V" H 9075 4000 50  0001 C CNN "Manufacturer_No4"
F 17 "THICK FILM CHIP RESISTOR" H 9075 4000 50  0001 C CNN "Manufacturer_Desc4"
	1    9075 4000
	0    -1   -1   0   
$EndComp
$Comp
L cpu-board:+5V #U$0527
U 1 1 29A8FB04
P 9075 3525
F 0 "#U$0527" H 9075 3525 50  0001 C CNN
F 1 "+5V" H 8988 3437 59  0000 L BNN
F 2 "" H 9075 3525 50  0001 C CNN
F 3 "" H 9075 3525 50  0001 C CNN
	1    9075 3525
	-1   0    0    1   
$EndComp
$Comp
L cpu-board:ARF34 IC37
U 1 1 629CAE50
P 5850 3250
F 0 "IC37" H 6350 4775 59  0000 L BNN
F 1 "ARF34" H 6312 4675 59  0000 L BNN
F 2 "AllModules:ARF7151A_1" H 5850 3250 50  0001 C CNN
F 3 "" H 5850 3250 50  0001 C CNN
	1    5850 3250
	1    0    0    -1  
$EndComp
$Comp
L cpu-board:ANTENNE ANT1
U 1 1 9927FDA6
P 5050 1800
F 0 "ANT1" H 5150 2000 59  0000 L BNN
F 1 "ANTENNE" H 5050 1800 50  0001 C CNN
F 2 "AllModules:PT-1.0MM_TEST_1" H 5050 1800 50  0001 C CNN
F 3 "" H 5050 1800 50  0001 C CNN
	1    5050 1800
	1    0    0    -1  
$EndComp
$Comp
L cpu-board:+3,3V #U$0244
U 1 1 5E91CB51
P 8600 3150
F 0 "#U$0244" H 8600 3150 50  0001 C CNN
F 1 "+3,3V" H 8712 3437 59  0000 R TNN
F 2 "" H 8600 3150 50  0001 C CNN
F 3 "" H 8600 3150 50  0001 C CNN
	1    8600 3150
	1    0    0    -1  
$EndComp
$Comp
L cpu-board:GND #U$0245
U 1 1 F2C6DEAE
P 5100 3400
F 0 "#U$0245" H 5100 3400 50  0001 C CNN
F 1 "GND" H 5012 3312 59  0000 L BNN
F 2 "" H 5100 3400 50  0001 C CNN
F 3 "" H 5100 3400 50  0001 C CNN
	1    5100 3400
	1    0    0    -1  
$EndComp
$Comp
L cpu-board:TANTALB C89
U 1 1 71EBD326
P 7575 2800
F 0 "C89" H 7525 2650 56  0000 R CNN
F 1 "22uF" H 7525 2725 42  0000 R CNN
F 2 "AllModules:C3216_1" H 7575 2800 50  0001 C CNN
F 3 "" H 7575 2800 50  0001 C CNN
F 4 "CAPACITOR TANTALUM, 22UF, 10V,+/-10%" H 7575 2800 50  0001 C CNN "Description"
F 5 "10022973" H 7575 2800 50  0001 C CNN "Item Number"
F 6 "KEMET" H 7575 2800 50  0001 C CNN "Manufacturer"
F 7 "T495A226K010ATE1K2" H 7575 2800 50  0001 C CNN "Manufacturer_No"
F 8 "Cap, Tantalum, Polarized, 10V, 10% +/-Tol, 22uF, Surface Mount, Case A, EIA Metric 3216" H 7575 2800 50  0001 C CNN "Manufacturer_Desc"
	1    7575 2800
	-1   0    0    1   
$EndComp
$Comp
L cpu-board:C0805 C98
U 1 1 57D09F0C
P 7950 2775
F 0 "C98" H 8050 2900 64  0000 L CNN
F 1 "100nF" H 8050 2825 42  0000 L CNN
F 2 "AllModules:C0402_1" H 7950 2775 50  0001 C CNN
F 3 "" H 7950 2775 50  0001 C CNN
	1    7950 2775
	1    0    0    -1  
$EndComp
$Comp
L cpu-board:GND #U$0413
U 1 1 D8F75EB2
P 5100 2600
F 0 "#U$0413" H 5100 2600 50  0001 C CNN
F 1 "GND" H 5025 2525 59  0000 L BNN
F 2 "" H 5100 2600 50  0001 C CNN
F 3 "" H 5100 2600 50  0001 C CNN
	1    5100 2600
	1    0    0    -1  
$EndComp
$Comp
L cpu-board:IRLML5103 T17
U 1 1 E3A7CA7E
P 8300 3350
F 0 "T17" V 8687 3415 59  0000 L BNN
F 1 "IRLML5103" V 8595 3165 56  0000 L BNN
F 2 "AllModules:SOT23-GSD_1" H 8300 3350 50  0001 C CNN
F 3 "" H 8300 3350 50  0001 C CNN
F 4 "RSPTRANSISTOR MOSFET, P CHANNEL, 30V,0.6A" H 8300 3350 50  0001 C CNN "Description"
F 5 "10022933" H 8300 3350 50  0001 C CNN "Item Number"
F 6 "INTERNATIONAL RECTIFIER_RMS1" H 8300 3350 50  0001 C CNN "Manufacturer"
F 7 "IRLML5103TRPBF" H 8300 3350 50  0001 C CNN "Manufacturer_No"
F 8 "POWER MOSFET" H 8300 3350 50  0001 C CNN "Manufacturer_Desc"
	1    8300 3350
	0    -1   -1   0   
$EndComp
$Comp
L cpu-board:R0805 R48
U 1 1 19AB9E8C
P 8600 3500
F 0 "R48" V 8525 3762 64  0000 R TNN
F 1 "100k" V 8650 3587 42  0000 L BNN
F 2 "AllModules:R0603_1" H 8600 3500 50  0001 C CNN
F 3 "" H 8600 3500 50  0001 C CNN
F 4 "RESISTOR,100 K OHM, 0.063W +/-5%" H 8600 3500 50  0001 C CNN "Description"
F 5 "10022732" H 8600 3500 50  0001 C CNN "Item Number"
F 6 "YAGEO_RMS1" H 8600 3500 50  0001 C CNN "Manufacturer"
F 7 "232270260104L" H 8600 3500 50  0001 C CNN "Manufacturer_No"
F 8 "RESISTOR, METAL GLAZE/THICK FILM, 0.1 W, 5 %, 100 PPM, 100000 OHM, SURFACE MOUNT, 0603" H 8600 3500 50  0001 C CNN "Manufacturer_Desc"
F 9 "YAGEO_RMS1" H 8600 3500 50  0001 C CNN "Manufacturer2"
F 10 "232270260104" H 8600 3500 50  0001 C CNN "Manufacturer_No2"
F 11 "RESISTOR, METAL GLAZE/THICK FILM, 0.1 W, 5 %, 100 PPM, 100000 OHM, SURFACE MOUNT, 0603" H 8600 3500 50  0001 C CNN "Manufacturer_Desc2"
F 12 "YAGEO_RMS1" H 8600 3500 50  0001 C CNN "Manufacturer3"
F 13 "RC0603JR-07100KL" H 8600 3500 50  0001 C CNN "Manufacturer_No3"
F 14 "RESISTOR, METAL GLAZE/THICK FILM, 0.1 W, 5 %, 100 PPM, 100000 OHM, SURFACE MOUNT, 0603" H 8600 3500 50  0001 C CNN "Manufacturer_Desc3"
F 15 "PANASONIC_RMS1" H 8600 3500 50  0001 C CNN "Manufacturer4"
F 16 "ERJ3GEYJ104V" H 8600 3500 50  0001 C CNN "Manufacturer_No4"
F 17 "THICK FILM CHIP RESISTOR" H 8600 3500 50  0001 C CNN "Manufacturer_Desc4"
	1    8600 3500
	0    1    1    0   
$EndComp
$Comp
L cpu-board:C0805 C101
U 1 1 D5229C91
P 10275 7750
F 0 "C101" H 10400 7813 64  0000 L CNN
F 1 "4.7nF" H 10400 7713 42  0000 L CNN
F 2 "AllModules:C0402_1" H 10275 7750 50  0001 C CNN
F 3 "" H 10275 7750 50  0001 C CNN
F 4 "CAPACITOR CERAMIC,4.7NF,25V,+/-10%,0402" H 10275 7750 50  0001 C CNN "Description"
F 5 "10022976" H 10275 7750 50  0001 C CNN "Item Number"
F 6 "KYOCERA_RMS1" H 10275 7750 50  0001 C CNN "Manufacturer"
F 7 "CM05X7R472K25AT" H 10275 7750 50  0001 C CNN "Manufacturer_No"
F 8 "MULTILAYER CERAMIC CAPACITOR" H 10275 7750 50  0001 C CNN "Manufacturer_Desc"
F 9 "KEMET_RMS1" H 10275 7750 50  0001 C CNN "Manufacturer2"
F 10 "C0402C472K3RACTU" H 10275 7750 50  0001 C CNN "Manufacturer_No2"
F 11 "CERAMIC CHIP CAPACITOR" H 10275 7750 50  0001 C CNN "Manufacturer_Desc2"
F 12 "AVX_RMS1" H 10275 7750 50  0001 C CNN "Manufacturer3"
F 13 "04023C472KAT2A" H 10275 7750 50  0001 C CNN "Manufacturer_No3"
F 14 "CERAMIC CAPACITOR X7R" H 10275 7750 50  0001 C CNN "Manufacturer_Desc3"
	1    10275 7750
	1    0    0    -1  
$EndComp
$Comp
L cpu-board:GND #U$0432
U 1 1 28434D00
P 10275 8150
F 0 "#U$0432" H 10275 8150 50  0001 C CNN
F 1 "GND" H 10188 8063 59  0000 L BNN
F 2 "" H 10275 8150 50  0001 C CNN
F 3 "" H 10275 8150 50  0001 C CNN
	1    10275 8150
	-1   0    0    -1  
$EndComp
Wire Notes Line
	7562 4600 12012 4600
Wire Notes Line
	7562 8263 7562 4600
Wire Notes Line
	12812 863  4512 863 
Wire Notes Line
	4512 863  4512 4538
Wire Notes Line
	12812 863  12812 4538
Wire Notes Line
	12812 4538 4512 4538
Wire Notes Line
	15925 850  12887 850 
Wire Notes Line
	12887 850  12887 2788
Wire Notes Line
	15925 2788 12887 2788
Wire Notes Line
	15925 850  15925 2788
Wire Notes Line
	7487 4600 987  4600
Wire Notes Line
	7487 8263 987  8263
Wire Notes Line
	7487 4600 7487 8263
Wire Notes Line
	7562 8263 12012 8263
Wire Notes Line
	12012 8263 12012 4600
Wire Notes Line
	1995 6913 2002 6916
Wire Notes Line
	987  2713 4450 2713
Wire Notes Line
	4450 2713 4450 4538
Wire Notes Line
	4450 4538 987  4538
Wire Notes Line
	987  4538 987  2713
Wire Notes Line
	13870 2863 13877 2866
Wire Notes Line
	12887 2863 15925 2863
Wire Notes Line
	15925 2863 15925 4538
Wire Notes Line
	15925 4538 12887 4538
Wire Notes Line
	12887 4538 12887 2863
Wire Notes Line
	12062 4600 15937 4600
Wire Notes Line
	12062 6975 12062 4600
Wire Notes Line
	12062 6975 15937 6975
Wire Notes Line
	15937 6975 15937 4600
Wire Notes Line
	4450 863  987  863 
Wire Notes Line
	987  863  987  2650
Wire Notes Line
	4450 863  4450 2650
Wire Notes Line
	4450 2650 987  2650
Wire Notes Line
	10425 3663 10412 3663
Wire Notes Line
	10412 3663 10412 2738
Wire Notes Line
	10412 2663 10412 2438
Wire Notes Line
	10412 2438 10425 2438
Wire Notes Line
	987  4600 987  8263
Text Notes 4550 1025 0    59   ~ 0
ALARM REPEATER
Text Notes 12600 2375 1    59   ~ 0
To Alarm Repeater
Text Notes 13500 2200 1    59   ~ 0
To FIO2 sensor
Text Notes 7650 4850 0    59   ~ 0
BLOWER CONNECTOR
Text Notes 13012 988  0    59   ~ 0
FiO2 SENSOR CONNECTOR
Text Notes 1087 4788 0    59   ~ 0
BUZZER BOARD CONNECTOR
Text Notes 1062 5688 0    59   ~ 0
INHIB-STOP-INV
Text Notes 1050 5888 0    59   ~ 0
SUPPLY-BUZ
Text Notes 1050 6088 0    59   ~ 0
TESTBUZ
Text Notes 1050 6263 0    59   ~ 0
STOP-INV
Text Notes 1062 6475 0    59   ~ 0
PWM-BUZ
Text Notes 1062 6875 0    59   ~ 0
GND
Text Notes 1062 6675 0    59   ~ 0
+5V
Text Notes 1062 2863 0    59   ~ 0
EXHALATION VALVE CONNECTOR
Text Notes 12937 3025 0    59   ~ 0
O2 VALVE CONNECTOR
Text Notes 12187 5650 0    59   ~ 0
+10VREF
Text Notes 12112 5850 0    59   ~ 0
MES-Q-O2
Text Notes 12287 6050 0    59   ~ 0
0VANA
Text Notes 12300 6250 0    59   ~ 0
0VANA
Text Notes 12125 4750 0    59   ~ 0
O2 FLOW SENSOR CONNECTOR
Text Notes 15750 10750 0    59   ~ 0
A
Text Notes 15925 10750 0    59   ~ 0
05/03/14
Text Notes 16500 10750 0    59   ~ 0
JR
Text Notes 7775 7575 0    59   ~ 0
GND
Text Notes 7762 6150 0    59   ~ 0
NC
Text Notes 7762 6350 0    59   ~ 0
NC
Text Notes 1050 1013 0    59   ~ 0
AMBIENT TEMPERATURE SENSOR CONNECTOR
Text Notes 4475 6088 0    47   ~ 0
NC
Text Notes 7775 5975 0    59   ~ 0
0VANA
Text Notes 7775 5775 0    59   ~ 0
TURBINE-TEMP
Text Notes 7775 6550 0    59   ~ 0
SPEED-MEASURE
Text Notes 7775 6725 0    59   ~ 0
SPEED-SETPOINT
Text Notes 7775 6925 0    59   ~ 0
BRAKE/
Text Notes 7775 7125 0    59   ~ 0
FAULT/
Text Notes 7775 7325 0    59   ~ 0
ENABLE
$Comp
L cpu-board:C0805 C86
U 1 1 908E3118
P 2225 2025
F 0 "C86" H 2300 2025 64  0000 L CNN
F 1 "47pF" H 2325 1950 42  0000 L CNN
F 2 "AllModules:C0402_1" H 2225 2025 50  0001 C CNN
F 3 "" H 2225 2025 50  0001 C CNN
F 4 "CAPACITOR,47 PF,+/-5%,50V,0402" H 2225 2025 50  0001 C CNN "Description"
F 5 "10022623" H 2225 2025 50  0001 C CNN "Item Number"
F 6 "SAMSUNG_RMS1" H 2225 2025 50  0001 C CNN "Manufacturer"
F 7 "CL05C470JB5NNNC" H 2225 2025 50  0001 C CNN "Manufacturer_No"
F 8 "CAP CER 47PF 50V 5% NP0 0402" H 2225 2025 50  0001 C CNN "Manufacturer_Desc"
F 9 "KEMET_RMS1" H 2225 2025 50  0001 C CNN "Manufacturer2"
F 10 "C0402C470J5GACTU" H 2225 2025 50  0001 C CNN "Manufacturer_No2"
F 11 "CAP,CER,SMT,0402,5%,50V,47PF" H 2225 2025 50  0001 C CNN "Manufacturer_Desc2"
F 12 "MURATA MANUFACTURING CO., LTD." H 2225 2025 50  0001 C CNN "Manufacturer3"
F 13 "GRM1555C1H470JZ01D" H 2225 2025 50  0001 C CNN "Manufacturer_No3"
F 14 "MONOLITHIC CERAMIC CAPACITOR" H 2225 2025 50  0001 C CNN "Manufacturer_Desc3"
F 15 "KEMET_RMS1" H 2225 2025 50  0001 C CNN "Manufacturer4"
F 16 "C0402C470J5GAC" H 2225 2025 50  0001 C CNN "Manufacturer_No4"
F 17 "CAP,CER,SMT,0402,5%,50V,47PF" H 2225 2025 50  0001 C CNN "Manufacturer_Desc4"
F 18 "MURATA MANUFACTURING CO., LTD." H 2225 2025 50  0001 C CNN "Manufacturer5"
F 19 "GRM1555C1H470JA01D" H 2225 2025 50  0001 C CNN "Manufacturer_No5"
F 20 "CAP CER 47PF 50V 5% NP0 0402" H 2225 2025 50  0001 C CNN "Manufacturer_Desc5"
	1    2225 2025
	1    0    0    -1  
$EndComp
$Comp
L cpu-board:74279263 L?
U 1 1 A9F7421E
P 2475 1875
AR Path="/A9F7421E" Ref="L?"  Part="1" 
AR Path="/5E9258C0/A9F7421E" Ref="L37"  Part="1" 
F 0 "L37" H 2413 1937 64  0000 L BNN
F 1 " " H 2375 1925 34  0000 L BNN
F 2 "AllModules:C0603_1" H 2475 1875 50  0001 C CNN
F 3 "" H 2475 1875 50  0001 C CNN
F 4 "SMD FERRITE 200MA" H 2475 1875 50  0001 C CNN "Description"
F 5 "10022907" H 2475 1875 50  0001 C CNN "Item Number"
F 6 "WURTH ELEKTRONIK GMBH" H 2475 1875 50  0001 C CNN "Manufacturer"
F 7 "74279266" H 2475 1875 50  0001 C CNN "Manufacturer_No"
F 8 "MULTILAYER-SMD-FERRITE" H 2475 1875 50  0001 C CNN "Manufacturer_Desc"
	1    2475 1875
	1    0    0    -1  
$EndComp
$Comp
L cpu-board:C0603 C76
U 1 1 D58B9C26
P 2725 2025
F 0 "C76" H 2806 2038 64  0000 L BNN
F 1 "100nF" H 2812 1969 42  0000 L BNN
F 2 "AllModules:C0402_1" H 2725 2025 50  0001 C CNN
F 3 "" H 2725 2025 50  0001 C CNN
F 4 "CAPACITOR,100NF,16V,+/-10%,X7R,0402" H 2725 2025 50  0001 C CNN "Description"
F 5 "10022607" H 2725 2025 50  0001 C CNN "Item Number"
F 6 "MURATA" H 2725 2025 50  0001 C CNN "Manufacturer"
F 7 "GRM155R71C104JA88J" H 2725 2025 50  0001 C CNN "Manufacturer_No"
F 8 "CAPACITOR, CERAMIC, MULTILAYER, 16V, X7R, 0.1UF, 0402" H 2725 2025 50  0001 C CNN "Manufacturer_Desc"
F 9 "YAGEO_RMS1" H 2725 2025 50  0001 C CNN "Manufacturer2"
F 10 "CC0402KRX7R7BB104" H 2725 2025 50  0001 C CNN "Manufacturer_No2"
F 11 "CAP CER 0.1uF 16V X7R 10% 0402" H 2725 2025 50  0001 C CNN "Manufacturer_Desc2"
F 12 "YAGEO_RMS1" H 2725 2025 50  0001 C CNN "Manufacturer3"
F 13 "223878715649" H 2725 2025 50  0001 C CNN "Manufacturer_No3"
F 14 "CAPACITOR, CERAMIC, MULTILAYER, 16 V, X7R, 0.1 UF, SURFACE MOUNT, 0402" H 2725 2025 50  0001 C CNN "Manufacturer_Desc3"
F 15 "MURATA MANUFACTURING CO., LTD." H 2725 2025 50  0001 C CNN "Manufacturer4"
F 16 "GRM155R71C104KA88D" H 2725 2025 50  0001 C CNN "Manufacturer_No4"
F 17 "MONOLITHIC CERAMIC CAPACITOR" H 2725 2025 50  0001 C CNN "Manufacturer_Desc4"
	1    2725 2025
	1    0    0    -1  
$EndComp
$Comp
L cpu-board:+5VREF #U$0407
U 1 1 6E26571B
P 2725 1225
F 0 "#U$0407" H 2725 1225 50  0001 C CNN
F 1 "+5VREF" H 2550 1137 59  0000 L BNN
F 2 "" H 2725 1225 50  0001 C CNN
F 3 "" H 2725 1225 50  0001 C CNN
	1    2725 1225
	-1   0    0    1   
$EndComp
$Comp
L cpu-board:R0805 R43
U 1 1 DA0B1885
P 2725 1600
F 0 "R43" V 2813 1338 64  0000 L BNN
F 1 "10k" V 2713 1388 42  0000 L BNN
F 2 "AllModules:R0603_1" H 2725 1600 50  0001 C CNN
F 3 "" H 2725 1600 50  0001 C CNN
F 4 "RESISTOR,10K OHM, 0.063W,+/-5%,0603" H 2725 1600 50  0001 C CNN "Description"
F 5 "10097266" H 2725 1600 50  0001 C CNN "Item Number"
F 6 "YAGEO_RMS1" H 2725 1600 50  0001 C CNN "Manufacturer"
F 7 "232270260103L" H 2725 1600 50  0001 C CNN "Manufacturer_No"
F 8 "RESISTOR, METAL GLAZE/THICK FILM, 0.1 W, 5 %, 100 PPM, 10000 OHM, SURFACE MOUNT, 0603" H 2725 1600 50  0001 C CNN "Manufacturer_Desc"
F 9 "YAGEO_RMS1" H 2725 1600 50  0001 C CNN "Manufacturer2"
F 10 "232270260103" H 2725 1600 50  0001 C CNN "Manufacturer_No2"
F 11 "RESISTOR, METAL GLAZE/THICK FILM, 0.1 W, 5 %, 100 PPM, 10000 OHM, SURFACE MOUNT, 0603" H 2725 1600 50  0001 C CNN "Manufacturer_Desc2"
F 12 "VISHAY_RMS1" H 2725 1600 50  0001 C CNN "Manufacturer3"
F 13 "CRCW060310K0JNEA" H 2725 1600 50  0001 C CNN "Manufacturer_No3"
F 14 "THICK FILM RECTANGULAR CHIP RESISTOR" H 2725 1600 50  0001 C CNN "Manufacturer_Desc3"
F 15 "ASJ" H 2725 1600 50  0001 C CNN "Manufacturer4"
F 16 "CR16-103JL" H 2725 1600 50  0001 C CNN "Manufacturer_No4"
F 17 "THICK FILM CHIP RESISTOR" H 2725 1600 50  0001 C CNN "Manufacturer_Desc4"
F 18 "YAGEO_RMS1" H 2725 1600 50  0001 C CNN "Manufacturer5"
F 19 "RC0603JR-0710KL" H 2725 1600 50  0001 C CNN "Manufacturer_No5"
F 20 "RESISTOR, METAL GLAZE/THICK FILM, 0.1 W, 5 %, 100 PPM, 10000 OHM, SURFACE MOUNT, 0603" H 2725 1600 50  0001 C CNN "Manufacturer_Desc5"
	1    2725 1600
	0    -1   -1   0   
$EndComp
$Comp
L cpu-board:0VANA #U$0405
U 1 1 F4807D6B
P 2625 2400
F 0 "#U$0405" H 2625 2400 50  0001 C CNN
F 1 "0VANA" H 2525 2225 59  0000 L BNN
F 2 "" H 2625 2400 50  0001 C CNN
F 3 "" H 2625 2400 50  0001 C CNN
	1    2625 2400
	1    0    0    -1  
$EndComp
Text HLabel 3050 1875 2    56   Input ~ 0
FLOW-TEMP
Wire Wire Line
	2075 2075 2100 2075
$Comp
L cpu-board:B2B_ZR J5
U 1 1 7C49DE93
P 1875 1975
F 0 "J5" H 1775 1625 85  0000 L BNN
F 1 "B2B_ZR" H 1775 1537 59  0001 L BNN
F 2 "AllModules:B2BZR-SM3TF_1" H 1875 1975 50  0001 C CNN
F 3 "" H 1875 1975 50  0001 C CNN
F 4 "CONNECTOR, TEMPERATURE MEASURE, 2 CONTACTS" H 1875 1975 50  0001 C CNN "Description"
F 5 "10097260" H 1875 1975 50  0001 C CNN "Item Number"
F 6 "J.S.T. CORPORATION" H 1875 1975 50  0001 C CNN "Manufacturer"
F 7 "B2B-ZR-SM4-TF (LF)(SN)" H 1875 1975 50  0001 C CNN "Manufacturer_No"
F 8 "CONNECTOR" H 1875 1975 50  0001 C CNN "Manufacturer_Desc"
	1    1875 1975
	1    0    0    -1  
$EndComp
Wire Wire Line
	2100 2075 2100 2200
Wire Wire Line
	2100 2200 2225 2200
Wire Wire Line
	2225 2125 2225 2200
Wire Wire Line
	2225 2200 2625 2200
Wire Wire Line
	2725 2200 2725 2125
Connection ~ 2225 2200
Wire Wire Line
	2625 2400 2625 2200
Connection ~ 2625 2200
Wire Wire Line
	2625 2200 2725 2200
Wire Wire Line
	2225 1925 2225 1875
Wire Wire Line
	2225 1875 2325 1875
Wire Wire Line
	2225 1875 2075 1875
Connection ~ 2225 1875
Wire Wire Line
	2625 1875 2725 1875
Wire Wire Line
	2725 1925 2725 1875
Connection ~ 2725 1875
Wire Wire Line
	2725 1875 3050 1875
Wire Wire Line
	2725 1875 2725 1800
Wire Wire Line
	2725 1325 2725 1400
Wire Wire Line
	2725 3775 2775 3775
$Comp
L cpu-board:GND #U$0256
U 1 1 7293558A
P 2300 3075
F 0 "#U$0256" H 2300 3075 50  0001 C CNN
F 1 "GND" H 2225 3012 59  0000 L BNN
F 2 "" H 2300 3075 50  0001 C CNN
F 3 "" H 2300 3075 50  0001 C CNN
	1    2300 3075
	-1   0    0    1   
$EndComp
Wire Wire Line
	2300 3200 2300 3175
Wire Wire Line
	2850 6650 3075 6650
$Comp
L cpu-board:GND #U$0251
U 1 1 E87EA68E
P 3600 7725
F 0 "#U$0251" H 3600 7725 50  0001 C CNN
F 1 "GND" H 3512 7638 59  0000 L BNN
F 2 "" H 3600 7725 50  0001 C CNN
F 3 "" H 3600 7725 50  0001 C CNN
	1    3600 7725
	1    0    0    -1  
$EndComp
Wire Wire Line
	3400 7475 3400 7625
Wire Wire Line
	3400 7625 3600 7625
Wire Wire Line
	3600 7625 3600 7475
Connection ~ 3600 7625
Wire Wire Line
	3800 7475 3800 7625
Wire Wire Line
	3800 7625 3600 7625
Wire Wire Line
	4000 7475 4000 7625
Wire Wire Line
	4000 7625 3800 7625
Connection ~ 3800 7625
Wire Wire Line
	4375 5825 4175 5825
Wire Wire Line
	4175 5650 4175 5825
Wire Wire Line
	4975 5825 4675 5825
Wire Wire Line
	6350 6900 6350 7000
Wire Wire Line
	6525 6800 6525 7000
Wire Wire Line
	6525 7000 6350 7000
Connection ~ 6350 7000
Wire Wire Line
	6350 7000 6350 7125
$Comp
L cpu-board:R0805 R70
U 1 1 AC81A314
P 6350 6700
F 0 "R70" V 6350 6963 64  0000 R TNN
F 1 "10k" V 6250 6975 42  0000 R TNN
F 2 "AllModules:R0603_1" H 6350 6700 50  0001 C CNN
F 3 "" H 6350 6700 50  0001 C CNN
F 4 "RESISTOR,10K OHM, 0.063W,+/-5%,0603" H 6350 6700 50  0001 C CNN "Description"
F 5 "10097266" H 6350 6700 50  0001 C CNN "Item Number"
F 6 "YAGEO_RMS1" H 6350 6700 50  0001 C CNN "Manufacturer"
F 7 "232270260103L" H 6350 6700 50  0001 C CNN "Manufacturer_No"
F 8 "RESISTOR, METAL GLAZE/THICK FILM, 0.1 W, 5 %, 100 PPM, 10000 OHM, SURFACE MOUNT, 0603" H 6350 6700 50  0001 C CNN "Manufacturer_Desc"
F 9 "YAGEO_RMS1" H 6350 6700 50  0001 C CNN "Manufacturer2"
F 10 "232270260103" H 6350 6700 50  0001 C CNN "Manufacturer_No2"
F 11 "RESISTOR, METAL GLAZE/THICK FILM, 0.1 W, 5 %, 100 PPM, 10000 OHM, SURFACE MOUNT, 0603" H 6350 6700 50  0001 C CNN "Manufacturer_Desc2"
F 12 "VISHAY_RMS1" H 6350 6700 50  0001 C CNN "Manufacturer3"
F 13 "CRCW060310K0JNEA" H 6350 6700 50  0001 C CNN "Manufacturer_No3"
F 14 "THICK FILM RECTANGULAR CHIP RESISTOR" H 6350 6700 50  0001 C CNN "Manufacturer_Desc3"
F 15 "ASJ" H 6350 6700 50  0001 C CNN "Manufacturer4"
F 16 "CR16-103JL" H 6350 6700 50  0001 C CNN "Manufacturer_No4"
F 17 "THICK FILM CHIP RESISTOR" H 6350 6700 50  0001 C CNN "Manufacturer_Desc4"
F 18 "YAGEO_RMS1" H 6350 6700 50  0001 C CNN "Manufacturer5"
F 19 "RC0603JR-0710KL" H 6350 6700 50  0001 C CNN "Manufacturer_No5"
F 20 "RESISTOR, METAL GLAZE/THICK FILM, 0.1 W, 5 %, 100 PPM, 10000 OHM, SURFACE MOUNT, 0603" H 6350 6700 50  0001 C CNN "Manufacturer_Desc5"
	1    6350 6700
	0    -1   -1   0   
$EndComp
Wire Wire Line
	6350 6250 6525 6250
Wire Wire Line
	6525 6600 6525 6250
Connection ~ 6525 6250
Wire Wire Line
	6525 6250 6650 6250
$Comp
L cpu-board:0VANA #U$0132
U 1 1 30C30973
P 9025 6000
F 0 "#U$0132" H 9025 6000 50  0001 C CNN
F 1 "0VANA" H 8913 5812 59  0000 L BNN
F 2 "" H 9025 6000 50  0001 C CNN
F 3 "" H 9025 6000 50  0001 C CNN
	1    9025 6000
	1    0    0    -1  
$EndComp
Wire Wire Line
	9025 6000 9025 5975
Wire Wire Line
	9025 5925 8850 5925
Wire Wire Line
	9275 5975 9025 5975
Connection ~ 9025 5975
Wire Wire Line
	9025 5975 9025 5925
Wire Wire Line
	9275 5725 9275 5775
NoConn ~ 8850 6125
NoConn ~ 8850 6325
$Comp
L cpu-board:74279263 L?
U 1 1 4B3EEFE3
P 10575 7125
AR Path="/4B3EEFE3" Ref="L?"  Part="1" 
AR Path="/5E9258C0/4B3EEFE3" Ref="L31"  Part="1" 
F 0 "L31" H 10475 7175 42  0000 L BNN
F 1 " " H 10475 7175 34  0000 L BNN
F 2 "AllModules:C0603_1" H 10575 7125 50  0001 C CNN
F 3 "" H 10575 7125 50  0001 C CNN
F 4 "SMD FERRITE 200MA" H 10575 7125 50  0001 C CNN "Description"
F 5 "10022907" H 10575 7125 50  0001 C CNN "Item Number"
F 6 "WURTH ELEKTRONIK GMBH" H 10575 7125 50  0001 C CNN "Manufacturer"
F 7 "74279266" H 10575 7125 50  0001 C CNN "Manufacturer_No"
F 8 "MULTILAYER-SMD-FERRITE" H 10575 7125 50  0001 C CNN "Manufacturer_Desc"
	1    10575 7125
	1    0    0    -1  
$EndComp
$Comp
L cpu-board:74279263 L?
U 1 1 2B9F3777
P 10575 7325
AR Path="/2B9F3777" Ref="L?"  Part="1" 
AR Path="/5E9258C0/2B9F3777" Ref="L29"  Part="1" 
F 0 "L29" H 10475 7375 42  0000 L BNN
F 1 " " H 10475 7375 34  0000 L BNN
F 2 "AllModules:C0603_1" H 10575 7325 50  0001 C CNN
F 3 "" H 10575 7325 50  0001 C CNN
F 4 "SMD FERRITE 200MA" H 10575 7325 50  0001 C CNN "Description"
F 5 "10022907" H 10575 7325 50  0001 C CNN "Item Number"
F 6 "WURTH ELEKTRONIK GMBH" H 10575 7325 50  0001 C CNN "Manufacturer"
F 7 "74279266" H 10575 7325 50  0001 C CNN "Manufacturer_No"
F 8 "MULTILAYER-SMD-FERRITE" H 10575 7325 50  0001 C CNN "Manufacturer_Desc"
	1    10575 7325
	1    0    0    -1  
$EndComp
Wire Wire Line
	10725 7325 10850 7325
Wire Wire Line
	10725 7125 10850 7125
Wire Wire Line
	10725 6925 10850 6925
Wire Wire Line
	10725 6725 10850 6725
Wire Wire Line
	10275 6525 10425 6525
Wire Wire Line
	10725 6525 10850 6525
$Comp
L cpu-board:74279263 L?
U 1 1 BACB79CB
P 13525 5800
AR Path="/BACB79CB" Ref="L?"  Part="1" 
AR Path="/5E9258C0/BACB79CB" Ref="L28"  Part="1" 
F 0 "L28" H 13463 5863 42  0000 L BNN
F 1 "74279263" H 13425 5850 34  0001 L BNN
F 2 "AllModules:C0603_1" H 13525 5800 50  0001 C CNN
F 3 "" H 13525 5800 50  0001 C CNN
	1    13525 5800
	1    0    0    -1  
$EndComp
$Comp
L cpu-board:B4B_ZR J20
U 1 1 DB725FC6
P 12725 5900
F 0 "J20" H 12625 5350 85  0000 L BNN
F 1 "B4B_ZR" H 12625 5263 59  0001 L BNN
F 2 "AllModules:B4BZR-SM3TF_1" H 12725 5900 50  0001 C CNN
F 3 "" H 12725 5900 50  0001 C CNN
	1    12725 5900
	1    0    0    -1  
$EndComp
$Comp
L cpu-board:0VANA #U$0263
U 1 1 DEDC7F62
P 13150 6300
F 0 "#U$0263" H 13150 6300 50  0001 C CNN
F 1 "0VANA" H 13063 6113 59  0000 L BNN
F 2 "" H 13150 6300 50  0001 C CNN
F 3 "" H 13150 6300 50  0001 C CNN
	1    13150 6300
	1    0    0    -1  
$EndComp
Wire Wire Line
	13150 6300 13150 6200
Wire Wire Line
	12925 6000 13025 6000
Wire Wire Line
	13025 6000 13025 6200
Wire Wire Line
	13025 6200 12925 6200
Wire Wire Line
	13025 6200 13150 6200
Connection ~ 13025 6200
Connection ~ 13150 6200
Wire Wire Line
	13150 6200 13150 6100
Wire Wire Line
	12925 5800 13150 5800
Wire Wire Line
	13150 5900 13150 5800
Connection ~ 13150 5800
Wire Wire Line
	13150 5800 13375 5800
Wire Wire Line
	12925 5600 13175 5600
Wire Wire Line
	13175 5425 13175 5600
Connection ~ 13175 5600
Wire Wire Line
	13175 5600 13375 5600
Wire Wire Line
	13175 5175 13175 5225
Wire Wire Line
	13675 5600 13900 5600
Wire Wire Line
	13900 5600 13900 5350
Wire Wire Line
	13675 5800 13700 5800
Wire Wire Line
	14100 5800 14125 5800
Wire Wire Line
	14125 5800 14125 6000
Wire Wire Line
	14125 5800 14500 5800
Connection ~ 14125 5800
Wire Wire Line
	14125 6200 14125 6300
Wire Wire Line
	14550 3650 14600 3650
Wire Wire Line
	14550 3850 14600 3850
Wire Wire Line
	14125 4000 14125 3850
Connection ~ 14125 3850
Wire Wire Line
	14125 3850 14250 3850
Wire Wire Line
	14125 4275 14125 4200
Wire Wire Line
	13775 3850 14125 3850
Wire Wire Line
	13775 3650 14125 3650
Wire Wire Line
	14125 3475 14125 3650
Connection ~ 14125 3650
Wire Wire Line
	14125 3650 14250 3650
Wire Wire Line
	14125 3225 14125 3275
Wire Wire Line
	14025 1350 14025 1475
Wire Wire Line
	14025 1675 14025 1925
Wire Wire Line
	14025 1925 13825 1925
NoConn ~ 13825 1725
Wire Wire Line
	14125 1925 14025 1925
Connection ~ 14025 1925
Wire Wire Line
	13825 2125 14825 2125
Wire Wire Line
	14425 1925 14525 1925
$Comp
L cpu-board:GND #U$0267
U 1 1 65AF9A20
P 11975 2200
F 0 "#U$0267" H 11975 2200 50  0001 C CNN
F 1 "GND" H 11887 2112 59  0000 L BNN
F 2 "" H 11975 2200 50  0001 C CNN
F 3 "" H 11975 2200 50  0001 C CNN
	1    11975 2200
	-1   0    0    -1  
$EndComp
$Comp
L cpu-board:TANTALB C75
U 1 1 C2D1BC15
P 11750 2100
F 0 "C75" V 11719 2338 56  0000 L BNN
F 1 "47uF" V 11782 2338 42  0000 L BNN
F 2 "AllModules:C3528_1" H 11750 2100 50  0001 C CNN
F 3 "" H 11750 2100 50  0001 C CNN
F 4 "CAPACITOR TANALUM, 47UF, 10V +/-10%" H 11750 2100 50  0001 C CNN "Description"
F 5 "10022962" H 11750 2100 50  0001 C CNN "Item Number"
F 6 "KEMET" H 11750 2100 50  0001 C CNN "Manufacturer"
F 7 "T495B476K010ATE500" H 11750 2100 50  0001 C CNN "Manufacturer_No"
F 8 "Cap, Tantalum, Polarized, 10V, 10% +/-Tol, 47uF, Surface Mount, Case B, EIA Metric 3528" H 11750 2100 50  0001 C CNN "Manufacturer_Desc"
	1    11750 2100
	0    -1   1    0   
$EndComp
Wire Wire Line
	11250 1500 11550 1500
Wire Wire Line
	11550 2100 11650 2100
Wire Wire Line
	11850 2100 11975 2100
Wire Wire Line
	11975 2100 12100 2100
Connection ~ 11975 2100
Wire Wire Line
	11550 2100 11550 1500
Connection ~ 11550 1500
Wire Wire Line
	11550 1500 12100 1500
Wire Wire Line
	11300 1400 11300 1700
Wire Wire Line
	10950 1500 10050 1500
Wire Wire Line
	10950 1700 9825 1700
Wire Wire Line
	10950 1900 9825 1900
Text HLabel 9825 1900 0    56   Output ~ 0
RX-AL-RP
Wire Wire Line
	9325 4050 9325 4275
Wire Wire Line
	9325 4275 9075 4275
Wire Wire Line
	9075 4200 9075 4275
Connection ~ 9075 4275
Wire Wire Line
	9075 4275 8875 4275
Wire Wire Line
	9075 3625 9075 3750
Wire Wire Line
	9125 3750 9075 3750
Connection ~ 9075 3750
Wire Wire Line
	9075 3750 9075 3800
Wire Wire Line
	9675 3750 9625 3750
Wire Wire Line
	10175 3750 10050 3750
Wire Wire Line
	10250 4025 10050 4025
Wire Wire Line
	10050 4025 10050 3750
Connection ~ 10050 3750
Wire Wire Line
	10050 3750 9975 3750
Wire Wire Line
	10050 3750 10050 3325
Wire Wire Line
	10050 3325 9700 3325
$Comp
L cpu-board:PRLL5819 D6
U 1 1 D13B7196
P 10450 4025
F 0 "D6" H 10566 4183 59  0000 R TNN
F 1 "PRLL5819" H 10563 4264 42  0000 R TNN
F 2 "AllModules:SOD87_1" H 10450 4025 50  0001 C CNN
F 3 "" H 10450 4025 50  0001 C CNN
F 4 "DIODE SCHOTTKY, 40V, 1A" H 10450 4025 50  0001 C CNN "Description"
F 5 "10097253" H 10450 4025 50  0001 C CNN "Item Number"
F 6 "DIODES INC_RMS1" H 10450 4025 50  0001 C CNN "Manufacturer"
F 7 "1N5819HW-7-F" H 10450 4025 50  0001 C CNN "Manufacturer_No"
F 8 "SURFACE MOUNT SCHOTTKY BARRIER RECTIFIER" H 10450 4025 50  0001 C CNN "Manufacturer_Desc"
	1    10450 4025
	-1   0    0    1   
$EndComp
Wire Wire Line
	10550 4025 10700 4025
Wire Wire Line
	10700 4025 10700 3750
Wire Wire Line
	10700 3750 10675 3750
Wire Wire Line
	10700 4025 10700 4300
Connection ~ 10700 4025
Wire Wire Line
	10050 3100 10150 3100
NoConn ~ 10150 2800
Wire Wire Line
	10900 3050 10900 3000
Wire Wire Line
	10900 3000 10650 3000
Wire Wire Line
	11600 3213 11600 3250
NoConn ~ 12100 1300
Wire Wire Line
	11300 1100 11300 1200
NoConn ~ 6650 2050
NoConn ~ 6650 2150
NoConn ~ 6650 2250
NoConn ~ 6650 2550
NoConn ~ 6650 2650
NoConn ~ 6650 2750
NoConn ~ 6650 3050
NoConn ~ 6650 3150
$Comp
L cpu-board:GND #U$0246
U 1 1 7FB4A0FD
P 8100 2450
F 0 "#U$0246" H 8100 2450 50  0001 C CNN
F 1 "GND" H 8012 2362 59  0000 L BNN
F 2 "" H 8100 2450 50  0001 C CNN
F 3 "" H 8100 2450 50  0001 C CNN
	1    8100 2450
	0    -1   -1   0   
$EndComp
Wire Wire Line
	7575 2450 7950 2450
Wire Wire Line
	7950 2675 7950 2450
Connection ~ 7950 2450
Wire Wire Line
	7950 2450 8000 2450
Wire Wire Line
	7575 3250 7950 3250
Wire Wire Line
	7950 2875 7950 3250
Connection ~ 7950 3250
Wire Wire Line
	7950 3250 8050 3250
Wire Wire Line
	7575 2450 7575 2700
Wire Wire Line
	8600 3050 8600 3250
Wire Wire Line
	8550 3250 8600 3250
Connection ~ 8600 3250
Wire Wire Line
	8600 3250 8600 3300
NoConn ~ 5350 2550
NoConn ~ 5350 2650
NoConn ~ 5350 2750
NoConn ~ 5350 2850
Wire Wire Line
	4850 2000 4850 2250
Wire Wire Line
	5050 2000 5050 2150
Wire Wire Line
	5250 2000 5250 2050
Wire Wire Line
	9275 5725 9700 5725
Wire Wire Line
	8850 6725 9775 6725
Wire Wire Line
	8850 6925 9575 6925
Wire Wire Line
	8850 7125 9375 7125
Wire Wire Line
	8850 7325 9175 7325
Wire Wire Line
	9775 7925 9775 8000
Wire Wire Line
	9775 8000 9575 8000
Wire Wire Line
	9025 8000 9025 8050
Wire Wire Line
	9175 7925 9175 8000
Connection ~ 9175 8000
Wire Wire Line
	9175 8000 9025 8000
Wire Wire Line
	9375 7925 9375 8000
Connection ~ 9375 8000
Wire Wire Line
	9375 8000 9175 8000
Wire Wire Line
	9575 7925 9575 8000
Connection ~ 9575 8000
Wire Wire Line
	9575 8000 9375 8000
Wire Wire Line
	9025 8000 9025 7525
Connection ~ 9025 8000
Wire Wire Line
	9025 7525 8850 7525
Wire Wire Line
	9175 7625 9175 7325
Connection ~ 9175 7325
Wire Wire Line
	9175 7325 10425 7325
Wire Wire Line
	9375 7625 9375 7125
Connection ~ 9375 7125
Wire Wire Line
	9375 7125 10425 7125
Wire Wire Line
	9575 7625 9575 6925
Connection ~ 9575 6925
Wire Wire Line
	9575 6925 10425 6925
Wire Wire Line
	9775 7625 9775 6725
Connection ~ 9775 6725
Wire Wire Line
	9775 6725 10425 6725
Wire Wire Line
	10275 6525 10275 7650
Wire Wire Line
	10275 7850 10275 8050
Text Notes 1900 8025 0    50   ~ 0
*Note: in earlier version, L22 connects to +5V instead of +5VSUPPLYBOARD
$Comp
L cpu-board:+5V #0101
U 1 1 5E99C70E
P 3075 6500
F 0 "#0101" H 3125 6550 50  0001 C CNN
F 1 "+5V" H 3025 6550 59  0000 R CNN
F 2 "" H 3075 6500 50  0001 C CNN
F 3 "" H 3075 6500 50  0001 C CNN
	1    3075 6500
	-1   0    0    1   
$EndComp
Wire Wire Line
	3075 6600 3075 6650
$EndSCHEMATC
