(module 85SMX_1 (layer F.Cu) (tedit 5E9E0921)
  (attr smd)
  (fp_text reference Q3 (at -5.9212 -0.45023 -270 unlocked) (layer F.SilkS)
    (effects (font (size 1.0496 1.104) (thickness 0.1)))
  )
  (fp_text value Y-BC-85SMX (at -0.0332 3.35673 -270 unlocked) (layer F.SilkS) hide
    (effects (font (size 1.0496 1.104) (thickness 0.1)))
  )
  (fp_line (start -1.671 1.7) (end 1.671 1.7) (layer F.SilkS) (width 0.18))
  (fp_line (start -4.4 -1.7) (end -3.829 -1.7) (layer F.SilkS) (width 0.18))
  (fp_line (start 3.829 -1.7) (end 4.4 -1.7) (layer F.SilkS) (width 0.18))
  (fp_line (start 4.4 1.7) (end 4.4 -1.7) (layer F.SilkS) (width 0.18))
  (fp_line (start -4.4 1.7) (end -3.829 1.7) (layer F.SilkS) (width 0.18))
  (fp_line (start -4.4 1.7) (end -4.4 0.85865) (layer F.SilkS) (width 0.18))
  (fp_line (start -1.671 -1.7) (end 1.671 -1.7) (layer F.SilkS) (width 0.18))
  (fp_line (start 3.829 1.7) (end 4.4 1.7) (layer F.SilkS) (width 0.18))
  (fp_line (start -4.4 -0.97128) (end -4.4 -1.7) (layer F.SilkS) (width 0.18))
  (fp_line (start -3.2 1.2) (end -3.2 -1.2) (layer F.Fab) (width 0.1))
  (fp_line (start -4.4 -1.7) (end -3.2 -1.2) (layer F.Fab) (width 0.1))
  (fp_line (start 3.9 -1.2) (end 4.4 -1.7) (layer F.Fab) (width 0.1))
  (fp_line (start 4.4 1.7) (end 4.4 -1.7) (layer F.Fab) (width 0.1))
  (fp_line (start -4.4 -1.7) (end 4.4 -1.7) (layer F.Fab) (width 0.1))
  (fp_line (start 3.9 1.2) (end 3.9 -1.2) (layer F.Fab) (width 0.1))
  (fp_line (start -3.2 -1.2) (end 3.9 -1.2) (layer F.Fab) (width 0.1))
  (fp_line (start -4.4 1.7) (end -3.2 1.2) (layer F.Fab) (width 0.1))
  (fp_line (start 3.9 1.2) (end 4.4 1.7) (layer F.Fab) (width 0.1))
  (fp_line (start -4.4 1.7) (end -4.4 -1.7) (layer F.Fab) (width 0.1))
  (fp_line (start -3.2 1.2) (end 3.9 1.2) (layer F.Fab) (width 0.1))
  (fp_line (start -4.4 1.7) (end 4.4 1.7) (layer F.Fab) (width 0.1))
  (pad 4 smd rect (at -2.75 -1.6) (size 1.5748 1.905) (layers F.Cu F.Paste F.Mask))
  (pad 3 smd rect (at 2.75 -1.6) (size 1.5748 1.905) (layers F.Cu F.Paste F.Mask))
  (pad 2 smd rect (at 2.75 1.6) (size 1.5748 1.905) (layers F.Cu F.Paste F.Mask))
  (pad 1 smd rect (at -2.75 1.6) (size 1.5748 1.905) (layers F.Cu F.Paste F.Mask))
  (model ${KIPRJMOD}/Footprints.3dshapes/85SMX.step
    (at (xyz 0 0 0))
    (scale (xyz 1 1 1))
    (rotate (xyz 0 0 0))
  )
)
