(module R2010_1 (layer F.Cu) (tedit 5E9525D5)
  (attr smd)
  (fp_text reference R80 (at 0.438 -2.705 unlocked) (layer F.SilkS)
    (effects (font (size 1.0496 1.104) (thickness 0.18)))
  )
  (fp_text value R-BC-R2010 (at 4 -0.8 unlocked) (layer F.SilkS) hide
    (effects (font (size 1.0496 1.104) (thickness 0.18)))
  )
  (fp_line (start -2.8 -1.5) (end 2.8 -1.5) (layer F.Fab) (width 0.1))
  (fp_line (start 2.8 1.5) (end 2.8 -1.5) (layer F.Fab) (width 0.1))
  (fp_line (start -2.8 1.5) (end 2.8 1.5) (layer F.Fab) (width 0.1))
  (fp_line (start -2.8 1.5) (end -2.8 -1.5) (layer F.Fab) (width 0.1))
  (fp_line (start -2.10292 1.905) (end 2.10292 1.905) (layer F.SilkS) (width 0.18))
  (fp_line (start -2.10292 -1.905) (end 2.10292 -1.905) (layer F.SilkS) (width 0.18))
  (pad 1 smd rect (at -2.5 0) (size 1.5748 3.175) (layers F.Cu F.Paste F.Mask))
  (pad 2 smd rect (at 2.5 0) (size 1.5748 3.175) (layers F.Cu F.Paste F.Mask))
  (model ${KISYS3DMOD}/Resistor_SMD.3dshapes/R_2010_5025Metric.wrl
    (at (xyz 0 0 0))
    (scale (xyz 1 1 1))
    (rotate (xyz 0 0 0))
  )
)
