(module FIX40_1 (layer F.Cu) (tedit 5E9869F8)
  (attr smd)
  (fp_text reference ZM5 (at 1.524 -1.016 unlocked) (layer F.SilkS) hide
    (effects (font (size 1.332992 1.40208) (thickness 0.254)))
  )
  (fp_text value FIX-0040 (at 4.064 -1.016 unlocked) (layer F.SilkS) hide
    (effects (font (size 1.332992 1.40208) (thickness 0.254)))
  )
  (fp_circle (center 0 0) (end 2 0) (layer F.Fab) (width 0.1))
  (pad 1 thru_hole circle (at 0 0) (size 2.54 2.54) (drill 4.0132) (layers *.Cu *.Mask))
  (model "${KIPRJMOD}/3D Models/entretoise richco - recenter.stp"
    (at (xyz 0 0 0))
    (scale (xyz 1 1 1))
    (rotate (xyz 0 0 0))
  )
)
