(module BP2X5D_1 (layer F.Cu) (tedit 0)
  (attr smd)
  (fp_text reference REF** (at 4.5466 -0.7112 -180 unlocked) (layer F.SilkS)
    (effects (font (size 1.033069 1.086612) (thickness 0.127)))
  )
  (fp_text value F-CO-HE10-2010D (at -5.9055 0.7874 -180 unlocked) (layer F.SilkS) hide
    (effects (font (size 1.033069 1.086612) (thickness 0.127)))
  )
  (fp_line (start -5.207 3.175) (end 15.367 3.175) (layer F.SilkS) (width 0.1778))
  (fp_line (start -5.207 3.175) (end -5.207 -5.715) (layer F.SilkS) (width 0.1778))
  (fp_line (start 15.367 3.175) (end 15.367 -5.715) (layer F.SilkS) (width 0.1778))
  (fp_line (start -5.207 -5.715) (end 15.367 -5.715) (layer F.SilkS) (width 0.1778))
  (fp_line (start -5.207 3.175) (end 15.367 3.175) (layer Dwgs.User) (width 0.1778))
  (fp_line (start -5.207 3.175) (end -5.207 -5.715) (layer Dwgs.User) (width 0.1778))
  (fp_line (start 15.367 3.175) (end 15.367 -5.715) (layer Dwgs.User) (width 0.1778))
  (fp_line (start -5.207 -5.715) (end 15.367 -5.715) (layer Dwgs.User) (width 0.1778))
  (fp_line (start 14.605 2.54) (end 14.605 -5.08) (layer F.Fab) (width 0.0762))
  (fp_line (start -4.445 -5.08) (end 14.605 -5.08) (layer F.Fab) (width 0.0762))
  (fp_line (start 0.635 3.175) (end 0.635 2.54) (layer F.Fab) (width 0.0762))
  (fp_line (start -5.207 3.175) (end -5.207 -5.715) (layer F.Fab) (width 0.0762))
  (fp_line (start -4.445 2.54) (end -4.445 -5.08) (layer F.Fab) (width 0.0762))
  (fp_line (start -4.445 2.54) (end 14.605 2.54) (layer F.Fab) (width 0.0762))
  (fp_line (start -5.207 3.175) (end 15.367 3.175) (layer F.Fab) (width 0.0762))
  (fp_line (start 3.175 3.175) (end 3.175 2.54) (layer F.Fab) (width 0.0762))
  (fp_line (start 6.985 3.175) (end 6.985 2.54) (layer F.Fab) (width 0.0762))
  (fp_line (start -0.635 3.175) (end -0.635 2.54) (layer F.Fab) (width 0.0762))
  (fp_line (start 15.367 3.175) (end 15.367 -5.715) (layer F.Fab) (width 0.0762))
  (fp_line (start -5.207 -5.715) (end 15.367 -5.715) (layer F.Fab) (width 0.0762))
  (pad 10 thru_hole circle (at 10.16 -2.54) (size 1.5748 1.5748) (drill 0.9144) (layers *.Cu *.Mask))
  (pad 9 thru_hole circle (at 10.16 0) (size 1.5748 1.5748) (drill 0.9144) (layers *.Cu *.Mask))
  (pad 8 thru_hole circle (at 7.62 -2.54) (size 1.5748 1.5748) (drill 0.9144) (layers *.Cu *.Mask))
  (pad 7 thru_hole circle (at 7.62 0) (size 1.5748 1.5748) (drill 0.9144) (layers *.Cu *.Mask))
  (pad 6 thru_hole circle (at 5.08 -2.54) (size 1.5748 1.5748) (drill 0.9144) (layers *.Cu *.Mask))
  (pad 5 thru_hole circle (at 5.08 0) (size 1.5748 1.5748) (drill 0.9144) (layers *.Cu *.Mask))
  (pad 4 thru_hole circle (at 2.54 -2.54) (size 1.5748 1.5748) (drill 0.9144) (layers *.Cu *.Mask))
  (pad 3 thru_hole circle (at 2.54 0) (size 1.5748 1.5748) (drill 0.9144) (layers *.Cu *.Mask))
  (pad 2 thru_hole circle (at 0 -2.54) (size 1.5748 1.5748) (drill 0.9144) (layers *.Cu *.Mask))
  (pad 1 thru_hole rect (at 0 0) (size 1.5748 1.5748) (drill 0.9144) (layers *.Cu *.Mask))
  (model "${KIPRJMOD}/10096315 Blower Driver.pretty/7810-0000xxSE-recenter.stp"
    (at (xyz 0 0 0))
    (scale (xyz 1 1 1))
    (rotate (xyz 0 0 0))
  )
)
