(module C0805_1 (layer F.Cu) (tedit 5E951046)
  (attr smd)
  (fp_text reference C32 (at -3.4417 0.127 unlocked) (layer F.SilkS)
    (effects (font (size 1.033069 1.086612) (thickness 0.1778)))
  )
  (fp_text value C-BC-C0805 (at 3.937 -0.7874 unlocked) (layer F.SilkS) hide
    (effects (font (size 1.033069 1.086612) (thickness 0.1778)))
  )
  (fp_line (start -0.9906 0.6096) (end 0.9906 0.6096) (layer B.Fab) (width 0.0762))
  (fp_line (start -0.9906 -0.6096) (end 0.9906 -0.6096) (layer B.Fab) (width 0.0762))
  (fp_line (start 0.9906 0.6096) (end 0.9906 -0.6096) (layer B.Fab) (width 0.0762))
  (fp_line (start -0.9906 0.6096) (end -0.9906 -0.6096) (layer B.Fab) (width 0.0762))
  (fp_line (start -2.0574 -1.0922) (end 0.4826 -1.0922) (layer F.SilkS) (width 0.1778))
  (fp_line (start 2.0574 1.0922) (end 2.0574 -1.0922) (layer F.SilkS) (width 0.1778))
  (fp_line (start 1.6002 -1.0922) (end 2.0574 -1.0922) (layer F.SilkS) (width 0.1778))
  (fp_line (start -2.0574 1.0922) (end -2.0574 -1.0922) (layer F.SilkS) (width 0.1778))
  (fp_line (start -2.0574 1.0922) (end 2.0574 1.0922) (layer F.SilkS) (width 0.1778))
  (pad 1 smd rect (at -1.0414 0 180) (size 1.27 1.4224) (layers F.Cu F.Paste F.Mask))
  (pad 2 smd rect (at 1.0414 0 180) (size 1.27 1.4224) (layers F.Cu F.Paste F.Mask))
  (model ${KISYS3DMOD}/Capacitor_SMD.3dshapes/C_0805_2012Metric.wrl
    (at (xyz 0 0 0))
    (scale (xyz 1 1 1))
    (rotate (xyz 0 0 0))
  )
)
