(module WE-FA_1 (layer F.Cu) (tedit 5E99F9D7)
  (attr smd)
  (fp_text reference FI1 (at -3.656 -0.2 unlocked) (layer F.SilkS)
    (effects (font (size 1.0496 1.104) (thickness 0.18)))
  )
  (fp_text value SF-BC-WEFA (at 4 -0.8 unlocked) (layer F.SilkS) hide
    (effects (font (size 1.0496 1.104) (thickness 0.18)))
  )
  (fp_line (start -1.778 1.524) (end -1.778 -1.524) (layer F.SilkS) (width 0.18))
  (fp_line (start 1.67486 1.524) (end 1.778 1.524) (layer F.SilkS) (width 0.18))
  (fp_line (start -1.778 -1.524) (end -1.67486 -1.524) (layer F.SilkS) (width 0.18))
  (fp_line (start 1.67486 -1.524) (end 1.778 -1.524) (layer F.SilkS) (width 0.18))
  (fp_line (start 1.778 1.524) (end 1.778 -1.524) (layer F.SilkS) (width 0.18))
  (fp_line (start -1.778 1.524) (end -1.67486 1.524) (layer F.SilkS) (width 0.18))
  (fp_line (start 0.6 -0.6) (end 1 -0.6) (layer F.Fab) (width 0.1))
  (fp_line (start 0.6 -0.6) (end 0.6 -0.8) (layer F.Fab) (width 0.1))
  (fp_line (start 0.2 -0.8) (end 0.6 -0.8) (layer F.Fab) (width 0.1))
  (fp_line (start -1.4 0.8) (end -1.4 0.6) (layer F.Fab) (width 0.1))
  (fp_line (start -1.6 0.6) (end -1.4 0.6) (layer F.Fab) (width 0.1))
  (fp_line (start -1.4 0.8) (end -1 0.8) (layer F.Fab) (width 0.1))
  (fp_line (start 0.2 -0.6) (end 0.2 -0.8) (layer F.Fab) (width 0.1))
  (fp_line (start -1 0.8) (end -1 0.6) (layer F.Fab) (width 0.1))
  (fp_line (start -1 -0.6) (end -1 -0.8) (layer F.Fab) (width 0.1))
  (fp_line (start 1.4 0.6) (end 1.6 0.6) (layer F.Fab) (width 0.1))
  (fp_line (start -0.2 0.6) (end 0.2 0.6) (layer F.Fab) (width 0.1))
  (fp_line (start -1.4 -0.8) (end -1 -0.8) (layer F.Fab) (width 0.1))
  (fp_line (start 0.2 0.8) (end 0.2 0.6) (layer F.Fab) (width 0.1))
  (fp_line (start -0.2 -0.6) (end 0.2 -0.6) (layer F.Fab) (width 0.1))
  (fp_line (start 1.4 0.8) (end 1.4 0.6) (layer F.Fab) (width 0.1))
  (fp_line (start -0.2 -0.6) (end -0.2 -0.8) (layer F.Fab) (width 0.1))
  (fp_line (start -1 0.6) (end -0.6 0.6) (layer F.Fab) (width 0.1))
  (fp_line (start -0.6 -0.8) (end -0.2 -0.8) (layer F.Fab) (width 0.1))
  (fp_line (start -0.6 0.8) (end -0.6 0.6) (layer F.Fab) (width 0.1))
  (fp_line (start 1 0.8) (end 1.4 0.8) (layer F.Fab) (width 0.1))
  (fp_line (start -1.6 0.6) (end -1.6 -0.6) (layer F.Fab) (width 0.1))
  (fp_line (start -0.6 0.8) (end -0.2 0.8) (layer F.Fab) (width 0.1))
  (fp_line (start 1 0.8) (end 1 0.6) (layer F.Fab) (width 0.1))
  (fp_line (start 0.6 0.6) (end 1 0.6) (layer F.Fab) (width 0.1))
  (fp_line (start 0.2 0.8) (end 0.6 0.8) (layer F.Fab) (width 0.1))
  (fp_line (start -0.6 -0.6) (end -0.6 -0.8) (layer F.Fab) (width 0.1))
  (fp_line (start -0.2 0.8) (end -0.2 0.6) (layer F.Fab) (width 0.1))
  (fp_line (start -1.6 -0.6) (end -1.4 -0.6) (layer F.Fab) (width 0.1))
  (fp_line (start -1 -0.6) (end -0.6 -0.6) (layer F.Fab) (width 0.1))
  (fp_line (start 0.6 0.8) (end 0.6 0.6) (layer F.Fab) (width 0.1))
  (fp_line (start -1.4 -0.6) (end -1.4 -0.8) (layer F.Fab) (width 0.1))
  (fp_line (start 1.4 -0.6) (end 1.4 -0.8) (layer F.Fab) (width 0.1))
  (fp_line (start 1.4 -0.6) (end 1.6 -0.6) (layer F.Fab) (width 0.1))
  (fp_line (start 1 -0.8) (end 1.4 -0.8) (layer F.Fab) (width 0.1))
  (fp_line (start 1.6 0.6) (end 1.6 -0.6) (layer F.Fab) (width 0.1))
  (fp_line (start 1 -0.6) (end 1 -0.8) (layer F.Fab) (width 0.1))
  (pad L4B smd rect (at 1.2 -0.8) (size 0.5588 0.9144) (layers F.Cu F.Paste F.Mask))
  (pad L4A smd rect (at 1.2 0.8) (size 0.5588 0.9144) (layers F.Cu F.Paste F.Mask))
  (pad L3B smd rect (at 0.4 -0.8) (size 0.5588 0.9144) (layers F.Cu F.Paste F.Mask))
  (pad L3A smd rect (at 0.4 0.8) (size 0.5588 0.9144) (layers F.Cu F.Paste F.Mask))
  (pad L2B smd rect (at -0.4 -0.8) (size 0.5588 0.9144) (layers F.Cu F.Paste F.Mask))
  (pad L2A smd rect (at -0.4 0.8) (size 0.5588 0.9144) (layers F.Cu F.Paste F.Mask))
  (pad L1B smd rect (at -1.2 -0.8) (size 0.5588 0.9144) (layers F.Cu F.Paste F.Mask))
  (pad L1A smd rect (at -1.2 0.8) (size 0.5588 0.9144) (layers F.Cu F.Paste F.Mask))
  (model "${KIPRJMOD}/3D models/BLACKCAPCAF80P160X320X90-8N.stp"
    (at (xyz 0 0 0))
    (scale (xyz 1 1 1))
    (rotate (xyz 0 0 90))
  )
)
