(module R0402_1 (layer F.Cu) (tedit 5E98FCDA)
  (attr smd)
  (fp_text reference R1 (at -2.04534 0.05298 unlocked) (layer F.SilkS)
    (effects (font (size 1.0496 1.104) (thickness 0.18)))
  )
  (fp_text value R-BC-R0402 (at 4 -0.8 unlocked) (layer F.SilkS) hide
    (effects (font (size 1.0496 1.104) (thickness 0.18)))
  )
  (fp_line (start -0.55 0.3) (end -0.55 -0.3) (layer F.Fab) (width 0.1))
  (fp_line (start 0.55 0.3) (end 0.55 -0.3) (layer F.Fab) (width 0.1))
  (fp_line (start -0.55 -0.3) (end 0.55 -0.3) (layer F.Fab) (width 0.1))
  (fp_line (start -0.55 0.3) (end 0.55 0.3) (layer F.Fab) (width 0.1))
  (pad 2 smd rect (at 0.55 0 270) (size 0.5 0.6) (layers F.Cu F.Paste F.Mask))
  (pad 1 smd rect (at -0.55 0 270) (size 0.5 0.6) (layers F.Cu F.Paste F.Mask))
  (model ${KISYS3DMOD}/Resistor_SMD.3dshapes/R_0402_1005Metric.wrl
    (at (xyz 0 0 0))
    (scale (xyz 1 1 1))
    (rotate (xyz 0 0 0))
  )
)
