(module WE-7427504_ENT-12.7X3_1 (layer F.Cu) (tedit 5E9C6A2F)
  (attr smd)
  (fp_text reference L30 (at 8.6263 0.73697 90 unlocked) (layer F.SilkS)
    (effects (font (size 1.0496 1.104) (thickness 0.1)))
  )
  (fp_text value SF-WE-7427504 (at 0.0459 -4.46127 90 unlocked) (layer F.SilkS) hide
    (effects (font (size 1.0496 1.104) (thickness 0.1)))
  )
  (fp_line (start 5.37 -3.175) (end -5.38 -3.175) (layer F.SilkS) (width 0.18))
  (fp_line (start -5.38 1.84582) (end -5.38 3.175) (layer F.SilkS) (width 0.18))
  (fp_line (start 5.37 3.175) (end -5.38 3.175) (layer F.SilkS) (width 0.18))
  (fp_line (start 5.37 -3.175) (end 5.37 -1.81637) (layer F.SilkS) (width 0.18))
  (fp_line (start -5.38 -3.175) (end -5.38 1.15418) (layer F.SilkS) (width 0.18))
  (fp_line (start 5.37 -1.18363) (end 5.37 3.175) (layer F.SilkS) (width 0.18))
  (fp_line (start 5.37 -3.175) (end -5.38 -3.175) (layer B.Fab) (width 0.1))
  (fp_line (start -5.38 -3.175) (end -5.38 3.175) (layer B.Fab) (width 0.1))
  (fp_line (start -5.38 1.5) (end -6.35 1.5) (layer B.Fab) (width 0.1))
  (fp_line (start 5.37 3.175) (end -5.38 3.175) (layer B.Fab) (width 0.1))
  (fp_line (start 6.35 -1.5) (end 5.37 -1.5) (layer B.Fab) (width 0.1))
  (fp_line (start 5.37 -3.175) (end 5.37 3.175) (layer B.Fab) (width 0.1))
  (pad 2 thru_hole circle (at -6.35 1.5 180) (size 1.6764 1.6764) (drill 0.9652) (layers *.Cu *.Mask))
  (pad 1 thru_hole circle (at 6.35 -1.5 180) (size 1.6764 1.6764) (drill 0.9652) (layers *.Cu *.Mask))
  (model ${KIPRJMOD}/Footprints.3dshapes/7427504_rev1-recenter.stp
    (at (xyz 0 0 0))
    (scale (xyz 1 1 1))
    (rotate (xyz 0 0 0))
  )
)
