(module TB-CMS-AIROX-2_1 (layer F.Cu) (tedit 0)
  (attr smd)
  (fp_text reference SJ1 (at -0.5682 -0.8555 270 unlocked) (layer F.SilkS)
    (effects (font (size 1.0496 1.104) (thickness 0.18)))
  )
  (fp_text value TB-CMS-AIROX (at -0.8 -4.8 270 unlocked) (layer F.SilkS) hide
    (effects (font (size 1.0496 1.104) (thickness 0.18)))
  )
  (fp_arc (start 0 0) (end -0.068044 -1.498456) (angle -174.7) (layer B.Fab) (width 0.1))
  (fp_arc (start -0.00001 0) (end 0.535101 1.401316) (angle -138.1) (layer B.Fab) (width 0.1))
  (fp_line (start -0.069 1.49841) (end -0.64244 0) (layer B.Fab) (width 0.1))
  (fp_line (start 0.53613 -1.40092) (end -0.00001 0) (layer B.Fab) (width 0.1))
  (fp_line (start -0.069 -1.49841) (end -0.64244 0) (layer B.Fab) (width 0.1))
  (fp_line (start 0.53613 1.40092) (end -0.00001 0) (layer B.Fab) (width 0.1))
  (pad 2 smd circle (at -1.1481 0 180) (size 0.40004 0.40004) (layers F.Cu F.Paste F.Mask))
  (pad 1 smd circle (at 0.7654 0 180) (size 0.40004 0.40004) (layers F.Cu F.Paste F.Mask))
)
