G04 #@! TF.GenerationSoftware,KiCad,Pcbnew,(5.1.5)-3*
G04 #@! TF.CreationDate,2020-04-20T12:10:47-07:00*
G04 #@! TF.ProjectId,10096510 Battery Connection,31303039-3635-4313-9020-426174746572,rev?*
G04 #@! TF.SameCoordinates,PXb874050PY8789ff8*
G04 #@! TF.FileFunction,Paste,Top*
G04 #@! TF.FilePolarity,Positive*
%FSLAX46Y46*%
G04 Gerber Fmt 4.6, Leading zero omitted, Abs format (unit mm)*
G04 Created by KiCad (PCBNEW (5.1.5)-3) date 2020-04-20 12:10:47*
%MOMM*%
%LPD*%
G04 APERTURE LIST*
%ADD10C,0.254000*%
%ADD11C,2.000000*%
%ADD12C,0.100000*%
G04 APERTURE END LIST*
D10*
X-15588948Y-29784523D02*
X-14863234Y-29784523D01*
X-15226091Y-31054523D02*
X-15226091Y-29784523D01*
X-14197996Y-29784523D02*
X-13956091Y-29784523D01*
X-13835139Y-29845000D01*
X-13714186Y-29965952D01*
X-13653710Y-30207857D01*
X-13653710Y-30631190D01*
X-13714186Y-30873095D01*
X-13835139Y-30994047D01*
X-13956091Y-31054523D01*
X-14197996Y-31054523D01*
X-14318948Y-30994047D01*
X-14439900Y-30873095D01*
X-14500377Y-30631190D01*
X-14500377Y-30207857D01*
X-14439900Y-29965952D01*
X-14318948Y-29845000D01*
X-14197996Y-29784523D01*
X-13109424Y-31054523D02*
X-13109424Y-29784523D01*
X-12625615Y-29784523D01*
X-12504662Y-29845000D01*
X-12444186Y-29905476D01*
X-12383710Y-30026428D01*
X-12383710Y-30207857D01*
X-12444186Y-30328809D01*
X-12504662Y-30389285D01*
X-12625615Y-30449761D01*
X-13109424Y-30449761D01*
X-10871805Y-31054523D02*
X-10871805Y-29784523D01*
X-10387996Y-29784523D01*
X-10267043Y-29845000D01*
X-10206567Y-29905476D01*
X-10146091Y-30026428D01*
X-10146091Y-30207857D01*
X-10206567Y-30328809D01*
X-10267043Y-30389285D01*
X-10387996Y-30449761D01*
X-10871805Y-30449761D01*
X-9662281Y-30691666D02*
X-9057520Y-30691666D01*
X-9783234Y-31054523D02*
X-9359900Y-29784523D01*
X-8936567Y-31054523D01*
X-8573710Y-30994047D02*
X-8392281Y-31054523D01*
X-8089900Y-31054523D01*
X-7968948Y-30994047D01*
X-7908472Y-30933571D01*
X-7847996Y-30812619D01*
X-7847996Y-30691666D01*
X-7908472Y-30570714D01*
X-7968948Y-30510238D01*
X-8089900Y-30449761D01*
X-8331805Y-30389285D01*
X-8452758Y-30328809D01*
X-8513234Y-30268333D01*
X-8573710Y-30147380D01*
X-8573710Y-30026428D01*
X-8513234Y-29905476D01*
X-8452758Y-29845000D01*
X-8331805Y-29784523D01*
X-8029424Y-29784523D01*
X-7847996Y-29845000D01*
X-7485139Y-29784523D02*
X-6759424Y-29784523D01*
X-7122281Y-31054523D02*
X-7122281Y-29784523D01*
X-6336091Y-30389285D02*
X-5912758Y-30389285D01*
X-5731329Y-31054523D02*
X-6336091Y-31054523D01*
X-6336091Y-29784523D01*
X-5731329Y-29784523D01*
X-5187043Y-31054523D02*
X-5187043Y-29784523D01*
X-4763710Y-30691666D01*
X-4340377Y-29784523D01*
X-4340377Y-31054523D01*
X-3796091Y-30691666D02*
X-3191329Y-30691666D01*
X-3917043Y-31054523D02*
X-3493710Y-29784523D01*
X-3070377Y-31054523D01*
X-2707520Y-30994047D02*
X-2526091Y-31054523D01*
X-2223710Y-31054523D01*
X-2102758Y-30994047D01*
X-2042281Y-30933571D01*
X-1981805Y-30812619D01*
X-1981805Y-30691666D01*
X-2042281Y-30570714D01*
X-2102758Y-30510238D01*
X-2223710Y-30449761D01*
X-2465615Y-30389285D01*
X-2586567Y-30328809D01*
X-2647043Y-30268333D01*
X-2707520Y-30147380D01*
X-2707520Y-30026428D01*
X-2647043Y-29905476D01*
X-2586567Y-29845000D01*
X-2465615Y-29784523D01*
X-2163234Y-29784523D01*
X-1981805Y-29845000D01*
X-1437520Y-31054523D02*
X-1437520Y-29784523D01*
X-711805Y-31054523D02*
X-1256091Y-30328809D01*
X-711805Y-29784523D02*
X-1437520Y-30510238D01*
X1162957Y-31538333D02*
X1102480Y-31477857D01*
X981528Y-31296428D01*
X921052Y-31175476D01*
X860576Y-30994047D01*
X800100Y-30691666D01*
X800100Y-30449761D01*
X860576Y-30147380D01*
X921052Y-29965952D01*
X981528Y-29845000D01*
X1102480Y-29663571D01*
X1162957Y-29603095D01*
X2070100Y-30389285D02*
X1646766Y-30389285D01*
X1646766Y-31054523D02*
X1646766Y-29784523D01*
X2251528Y-29784523D01*
X2432957Y-31175476D02*
X3400576Y-31175476D01*
X3702957Y-31054523D02*
X3702957Y-29784523D01*
X4186766Y-29784523D01*
X4307719Y-29845000D01*
X4368195Y-29905476D01*
X4428671Y-30026428D01*
X4428671Y-30207857D01*
X4368195Y-30328809D01*
X4307719Y-30389285D01*
X4186766Y-30449761D01*
X3702957Y-30449761D01*
X4912480Y-30691666D02*
X5517242Y-30691666D01*
X4791528Y-31054523D02*
X5214861Y-29784523D01*
X5638195Y-31054523D01*
X6001052Y-30994047D02*
X6182480Y-31054523D01*
X6484861Y-31054523D01*
X6605814Y-30994047D01*
X6666290Y-30933571D01*
X6726766Y-30812619D01*
X6726766Y-30691666D01*
X6666290Y-30570714D01*
X6605814Y-30510238D01*
X6484861Y-30449761D01*
X6242957Y-30389285D01*
X6122004Y-30328809D01*
X6061528Y-30268333D01*
X6001052Y-30147380D01*
X6001052Y-30026428D01*
X6061528Y-29905476D01*
X6122004Y-29845000D01*
X6242957Y-29784523D01*
X6545338Y-29784523D01*
X6726766Y-29845000D01*
X7089623Y-29784523D02*
X7815338Y-29784523D01*
X7452480Y-31054523D02*
X7452480Y-29784523D01*
X8238671Y-30389285D02*
X8662004Y-30389285D01*
X8843433Y-31054523D02*
X8238671Y-31054523D01*
X8238671Y-29784523D01*
X8843433Y-29784523D01*
X9387719Y-30933571D02*
X9448195Y-30994047D01*
X9387719Y-31054523D01*
X9327242Y-30994047D01*
X9387719Y-30933571D01*
X9387719Y-31054523D01*
X10657719Y-29845000D02*
X10536766Y-29784523D01*
X10355338Y-29784523D01*
X10173909Y-29845000D01*
X10052957Y-29965952D01*
X9992480Y-30086904D01*
X9932004Y-30328809D01*
X9932004Y-30510238D01*
X9992480Y-30752142D01*
X10052957Y-30873095D01*
X10173909Y-30994047D01*
X10355338Y-31054523D01*
X10476290Y-31054523D01*
X10657719Y-30994047D01*
X10718195Y-30933571D01*
X10718195Y-30510238D01*
X10476290Y-30510238D01*
X11685814Y-30389285D02*
X11867242Y-30449761D01*
X11927719Y-30510238D01*
X11988195Y-30631190D01*
X11988195Y-30812619D01*
X11927719Y-30933571D01*
X11867242Y-30994047D01*
X11746290Y-31054523D01*
X11262480Y-31054523D01*
X11262480Y-29784523D01*
X11685814Y-29784523D01*
X11806766Y-29845000D01*
X11867242Y-29905476D01*
X11927719Y-30026428D01*
X11927719Y-30147380D01*
X11867242Y-30268333D01*
X11806766Y-30328809D01*
X11685814Y-30389285D01*
X11262480Y-30389285D01*
X13258195Y-31054523D02*
X12834861Y-30449761D01*
X12532480Y-31054523D02*
X12532480Y-29784523D01*
X13016290Y-29784523D01*
X13137242Y-29845000D01*
X13197719Y-29905476D01*
X13258195Y-30026428D01*
X13258195Y-30207857D01*
X13197719Y-30328809D01*
X13137242Y-30389285D01*
X13016290Y-30449761D01*
X12532480Y-30449761D01*
X13681528Y-31538333D02*
X13742004Y-31477857D01*
X13862957Y-31296428D01*
X13923433Y-31175476D01*
X13983909Y-30994047D01*
X14044385Y-30691666D01*
X14044385Y-30449761D01*
X13983909Y-30147380D01*
X13923433Y-29965952D01*
X13862957Y-29845000D01*
X13742004Y-29663571D01*
X13681528Y-29603095D01*
D11*
X56007000Y12979400D03*
X53467000Y12979400D03*
X56007000Y16992600D03*
X53467000Y16992600D03*
X56007000Y20980400D03*
X53467000Y20980400D03*
D12*
G36*
X26427691Y39843947D02*
G01*
X26448926Y39840797D01*
X26469750Y39835581D01*
X26489962Y39828349D01*
X26509368Y39819170D01*
X26527781Y39808134D01*
X26545024Y39795346D01*
X26560930Y39780930D01*
X26575346Y39765024D01*
X26588134Y39747781D01*
X26599170Y39729368D01*
X26608349Y39709962D01*
X26615581Y39689750D01*
X26620797Y39668926D01*
X26623947Y39647691D01*
X26625000Y39626250D01*
X26625000Y39113750D01*
X26623947Y39092309D01*
X26620797Y39071074D01*
X26615581Y39050250D01*
X26608349Y39030038D01*
X26599170Y39010632D01*
X26588134Y38992219D01*
X26575346Y38974976D01*
X26560930Y38959070D01*
X26545024Y38944654D01*
X26527781Y38931866D01*
X26509368Y38920830D01*
X26489962Y38911651D01*
X26469750Y38904419D01*
X26448926Y38899203D01*
X26427691Y38896053D01*
X26406250Y38895000D01*
X25968750Y38895000D01*
X25947309Y38896053D01*
X25926074Y38899203D01*
X25905250Y38904419D01*
X25885038Y38911651D01*
X25865632Y38920830D01*
X25847219Y38931866D01*
X25829976Y38944654D01*
X25814070Y38959070D01*
X25799654Y38974976D01*
X25786866Y38992219D01*
X25775830Y39010632D01*
X25766651Y39030038D01*
X25759419Y39050250D01*
X25754203Y39071074D01*
X25751053Y39092309D01*
X25750000Y39113750D01*
X25750000Y39626250D01*
X25751053Y39647691D01*
X25754203Y39668926D01*
X25759419Y39689750D01*
X25766651Y39709962D01*
X25775830Y39729368D01*
X25786866Y39747781D01*
X25799654Y39765024D01*
X25814070Y39780930D01*
X25829976Y39795346D01*
X25847219Y39808134D01*
X25865632Y39819170D01*
X25885038Y39828349D01*
X25905250Y39835581D01*
X25926074Y39840797D01*
X25947309Y39843947D01*
X25968750Y39845000D01*
X26406250Y39845000D01*
X26427691Y39843947D01*
G37*
G36*
X24852691Y39843947D02*
G01*
X24873926Y39840797D01*
X24894750Y39835581D01*
X24914962Y39828349D01*
X24934368Y39819170D01*
X24952781Y39808134D01*
X24970024Y39795346D01*
X24985930Y39780930D01*
X25000346Y39765024D01*
X25013134Y39747781D01*
X25024170Y39729368D01*
X25033349Y39709962D01*
X25040581Y39689750D01*
X25045797Y39668926D01*
X25048947Y39647691D01*
X25050000Y39626250D01*
X25050000Y39113750D01*
X25048947Y39092309D01*
X25045797Y39071074D01*
X25040581Y39050250D01*
X25033349Y39030038D01*
X25024170Y39010632D01*
X25013134Y38992219D01*
X25000346Y38974976D01*
X24985930Y38959070D01*
X24970024Y38944654D01*
X24952781Y38931866D01*
X24934368Y38920830D01*
X24914962Y38911651D01*
X24894750Y38904419D01*
X24873926Y38899203D01*
X24852691Y38896053D01*
X24831250Y38895000D01*
X24393750Y38895000D01*
X24372309Y38896053D01*
X24351074Y38899203D01*
X24330250Y38904419D01*
X24310038Y38911651D01*
X24290632Y38920830D01*
X24272219Y38931866D01*
X24254976Y38944654D01*
X24239070Y38959070D01*
X24224654Y38974976D01*
X24211866Y38992219D01*
X24200830Y39010632D01*
X24191651Y39030038D01*
X24184419Y39050250D01*
X24179203Y39071074D01*
X24176053Y39092309D01*
X24175000Y39113750D01*
X24175000Y39626250D01*
X24176053Y39647691D01*
X24179203Y39668926D01*
X24184419Y39689750D01*
X24191651Y39709962D01*
X24200830Y39729368D01*
X24211866Y39747781D01*
X24224654Y39765024D01*
X24239070Y39780930D01*
X24254976Y39795346D01*
X24272219Y39808134D01*
X24290632Y39819170D01*
X24310038Y39828349D01*
X24330250Y39835581D01*
X24351074Y39840797D01*
X24372309Y39843947D01*
X24393750Y39845000D01*
X24831250Y39845000D01*
X24852691Y39843947D01*
G37*
G36*
X24852691Y41748947D02*
G01*
X24873926Y41745797D01*
X24894750Y41740581D01*
X24914962Y41733349D01*
X24934368Y41724170D01*
X24952781Y41713134D01*
X24970024Y41700346D01*
X24985930Y41685930D01*
X25000346Y41670024D01*
X25013134Y41652781D01*
X25024170Y41634368D01*
X25033349Y41614962D01*
X25040581Y41594750D01*
X25045797Y41573926D01*
X25048947Y41552691D01*
X25050000Y41531250D01*
X25050000Y41018750D01*
X25048947Y40997309D01*
X25045797Y40976074D01*
X25040581Y40955250D01*
X25033349Y40935038D01*
X25024170Y40915632D01*
X25013134Y40897219D01*
X25000346Y40879976D01*
X24985930Y40864070D01*
X24970024Y40849654D01*
X24952781Y40836866D01*
X24934368Y40825830D01*
X24914962Y40816651D01*
X24894750Y40809419D01*
X24873926Y40804203D01*
X24852691Y40801053D01*
X24831250Y40800000D01*
X24393750Y40800000D01*
X24372309Y40801053D01*
X24351074Y40804203D01*
X24330250Y40809419D01*
X24310038Y40816651D01*
X24290632Y40825830D01*
X24272219Y40836866D01*
X24254976Y40849654D01*
X24239070Y40864070D01*
X24224654Y40879976D01*
X24211866Y40897219D01*
X24200830Y40915632D01*
X24191651Y40935038D01*
X24184419Y40955250D01*
X24179203Y40976074D01*
X24176053Y40997309D01*
X24175000Y41018750D01*
X24175000Y41531250D01*
X24176053Y41552691D01*
X24179203Y41573926D01*
X24184419Y41594750D01*
X24191651Y41614962D01*
X24200830Y41634368D01*
X24211866Y41652781D01*
X24224654Y41670024D01*
X24239070Y41685930D01*
X24254976Y41700346D01*
X24272219Y41713134D01*
X24290632Y41724170D01*
X24310038Y41733349D01*
X24330250Y41740581D01*
X24351074Y41745797D01*
X24372309Y41748947D01*
X24393750Y41750000D01*
X24831250Y41750000D01*
X24852691Y41748947D01*
G37*
G36*
X26427691Y41748947D02*
G01*
X26448926Y41745797D01*
X26469750Y41740581D01*
X26489962Y41733349D01*
X26509368Y41724170D01*
X26527781Y41713134D01*
X26545024Y41700346D01*
X26560930Y41685930D01*
X26575346Y41670024D01*
X26588134Y41652781D01*
X26599170Y41634368D01*
X26608349Y41614962D01*
X26615581Y41594750D01*
X26620797Y41573926D01*
X26623947Y41552691D01*
X26625000Y41531250D01*
X26625000Y41018750D01*
X26623947Y40997309D01*
X26620797Y40976074D01*
X26615581Y40955250D01*
X26608349Y40935038D01*
X26599170Y40915632D01*
X26588134Y40897219D01*
X26575346Y40879976D01*
X26560930Y40864070D01*
X26545024Y40849654D01*
X26527781Y40836866D01*
X26509368Y40825830D01*
X26489962Y40816651D01*
X26469750Y40809419D01*
X26448926Y40804203D01*
X26427691Y40801053D01*
X26406250Y40800000D01*
X25968750Y40800000D01*
X25947309Y40801053D01*
X25926074Y40804203D01*
X25905250Y40809419D01*
X25885038Y40816651D01*
X25865632Y40825830D01*
X25847219Y40836866D01*
X25829976Y40849654D01*
X25814070Y40864070D01*
X25799654Y40879976D01*
X25786866Y40897219D01*
X25775830Y40915632D01*
X25766651Y40935038D01*
X25759419Y40955250D01*
X25754203Y40976074D01*
X25751053Y40997309D01*
X25750000Y41018750D01*
X25750000Y41531250D01*
X25751053Y41552691D01*
X25754203Y41573926D01*
X25759419Y41594750D01*
X25766651Y41614962D01*
X25775830Y41634368D01*
X25786866Y41652781D01*
X25799654Y41670024D01*
X25814070Y41685930D01*
X25829976Y41700346D01*
X25847219Y41713134D01*
X25865632Y41724170D01*
X25885038Y41733349D01*
X25905250Y41740581D01*
X25926074Y41745797D01*
X25947309Y41748947D01*
X25968750Y41750000D01*
X26406250Y41750000D01*
X26427691Y41748947D01*
G37*
G36*
X31936958Y32829290D02*
G01*
X31951276Y32827166D01*
X31965317Y32823649D01*
X31978946Y32818772D01*
X31992031Y32812583D01*
X32004447Y32805142D01*
X32016073Y32796519D01*
X32026798Y32786798D01*
X32036519Y32776073D01*
X32045142Y32764447D01*
X32052583Y32752031D01*
X32058772Y32738946D01*
X32063649Y32725317D01*
X32067166Y32711276D01*
X32069290Y32696958D01*
X32070000Y32682500D01*
X32070000Y32387500D01*
X32069290Y32373042D01*
X32067166Y32358724D01*
X32063649Y32344683D01*
X32058772Y32331054D01*
X32052583Y32317969D01*
X32045142Y32305553D01*
X32036519Y32293927D01*
X32026798Y32283202D01*
X32016073Y32273481D01*
X32004447Y32264858D01*
X31992031Y32257417D01*
X31978946Y32251228D01*
X31965317Y32246351D01*
X31951276Y32242834D01*
X31936958Y32240710D01*
X31922500Y32240000D01*
X31577500Y32240000D01*
X31563042Y32240710D01*
X31548724Y32242834D01*
X31534683Y32246351D01*
X31521054Y32251228D01*
X31507969Y32257417D01*
X31495553Y32264858D01*
X31483927Y32273481D01*
X31473202Y32283202D01*
X31463481Y32293927D01*
X31454858Y32305553D01*
X31447417Y32317969D01*
X31441228Y32331054D01*
X31436351Y32344683D01*
X31432834Y32358724D01*
X31430710Y32373042D01*
X31430000Y32387500D01*
X31430000Y32682500D01*
X31430710Y32696958D01*
X31432834Y32711276D01*
X31436351Y32725317D01*
X31441228Y32738946D01*
X31447417Y32752031D01*
X31454858Y32764447D01*
X31463481Y32776073D01*
X31473202Y32786798D01*
X31483927Y32796519D01*
X31495553Y32805142D01*
X31507969Y32812583D01*
X31521054Y32818772D01*
X31534683Y32823649D01*
X31548724Y32827166D01*
X31563042Y32829290D01*
X31577500Y32830000D01*
X31922500Y32830000D01*
X31936958Y32829290D01*
G37*
G36*
X31936958Y33799290D02*
G01*
X31951276Y33797166D01*
X31965317Y33793649D01*
X31978946Y33788772D01*
X31992031Y33782583D01*
X32004447Y33775142D01*
X32016073Y33766519D01*
X32026798Y33756798D01*
X32036519Y33746073D01*
X32045142Y33734447D01*
X32052583Y33722031D01*
X32058772Y33708946D01*
X32063649Y33695317D01*
X32067166Y33681276D01*
X32069290Y33666958D01*
X32070000Y33652500D01*
X32070000Y33357500D01*
X32069290Y33343042D01*
X32067166Y33328724D01*
X32063649Y33314683D01*
X32058772Y33301054D01*
X32052583Y33287969D01*
X32045142Y33275553D01*
X32036519Y33263927D01*
X32026798Y33253202D01*
X32016073Y33243481D01*
X32004447Y33234858D01*
X31992031Y33227417D01*
X31978946Y33221228D01*
X31965317Y33216351D01*
X31951276Y33212834D01*
X31936958Y33210710D01*
X31922500Y33210000D01*
X31577500Y33210000D01*
X31563042Y33210710D01*
X31548724Y33212834D01*
X31534683Y33216351D01*
X31521054Y33221228D01*
X31507969Y33227417D01*
X31495553Y33234858D01*
X31483927Y33243481D01*
X31473202Y33253202D01*
X31463481Y33263927D01*
X31454858Y33275553D01*
X31447417Y33287969D01*
X31441228Y33301054D01*
X31436351Y33314683D01*
X31432834Y33328724D01*
X31430710Y33343042D01*
X31430000Y33357500D01*
X31430000Y33652500D01*
X31430710Y33666958D01*
X31432834Y33681276D01*
X31436351Y33695317D01*
X31441228Y33708946D01*
X31447417Y33722031D01*
X31454858Y33734447D01*
X31463481Y33746073D01*
X31473202Y33756798D01*
X31483927Y33766519D01*
X31495553Y33775142D01*
X31507969Y33782583D01*
X31521054Y33788772D01*
X31534683Y33793649D01*
X31548724Y33797166D01*
X31563042Y33799290D01*
X31577500Y33800000D01*
X31922500Y33800000D01*
X31936958Y33799290D01*
G37*
G36*
X33841958Y37909290D02*
G01*
X33856276Y37907166D01*
X33870317Y37903649D01*
X33883946Y37898772D01*
X33897031Y37892583D01*
X33909447Y37885142D01*
X33921073Y37876519D01*
X33931798Y37866798D01*
X33941519Y37856073D01*
X33950142Y37844447D01*
X33957583Y37832031D01*
X33963772Y37818946D01*
X33968649Y37805317D01*
X33972166Y37791276D01*
X33974290Y37776958D01*
X33975000Y37762500D01*
X33975000Y37467500D01*
X33974290Y37453042D01*
X33972166Y37438724D01*
X33968649Y37424683D01*
X33963772Y37411054D01*
X33957583Y37397969D01*
X33950142Y37385553D01*
X33941519Y37373927D01*
X33931798Y37363202D01*
X33921073Y37353481D01*
X33909447Y37344858D01*
X33897031Y37337417D01*
X33883946Y37331228D01*
X33870317Y37326351D01*
X33856276Y37322834D01*
X33841958Y37320710D01*
X33827500Y37320000D01*
X33482500Y37320000D01*
X33468042Y37320710D01*
X33453724Y37322834D01*
X33439683Y37326351D01*
X33426054Y37331228D01*
X33412969Y37337417D01*
X33400553Y37344858D01*
X33388927Y37353481D01*
X33378202Y37363202D01*
X33368481Y37373927D01*
X33359858Y37385553D01*
X33352417Y37397969D01*
X33346228Y37411054D01*
X33341351Y37424683D01*
X33337834Y37438724D01*
X33335710Y37453042D01*
X33335000Y37467500D01*
X33335000Y37762500D01*
X33335710Y37776958D01*
X33337834Y37791276D01*
X33341351Y37805317D01*
X33346228Y37818946D01*
X33352417Y37832031D01*
X33359858Y37844447D01*
X33368481Y37856073D01*
X33378202Y37866798D01*
X33388927Y37876519D01*
X33400553Y37885142D01*
X33412969Y37892583D01*
X33426054Y37898772D01*
X33439683Y37903649D01*
X33453724Y37907166D01*
X33468042Y37909290D01*
X33482500Y37910000D01*
X33827500Y37910000D01*
X33841958Y37909290D01*
G37*
G36*
X33841958Y38879290D02*
G01*
X33856276Y38877166D01*
X33870317Y38873649D01*
X33883946Y38868772D01*
X33897031Y38862583D01*
X33909447Y38855142D01*
X33921073Y38846519D01*
X33931798Y38836798D01*
X33941519Y38826073D01*
X33950142Y38814447D01*
X33957583Y38802031D01*
X33963772Y38788946D01*
X33968649Y38775317D01*
X33972166Y38761276D01*
X33974290Y38746958D01*
X33975000Y38732500D01*
X33975000Y38437500D01*
X33974290Y38423042D01*
X33972166Y38408724D01*
X33968649Y38394683D01*
X33963772Y38381054D01*
X33957583Y38367969D01*
X33950142Y38355553D01*
X33941519Y38343927D01*
X33931798Y38333202D01*
X33921073Y38323481D01*
X33909447Y38314858D01*
X33897031Y38307417D01*
X33883946Y38301228D01*
X33870317Y38296351D01*
X33856276Y38292834D01*
X33841958Y38290710D01*
X33827500Y38290000D01*
X33482500Y38290000D01*
X33468042Y38290710D01*
X33453724Y38292834D01*
X33439683Y38296351D01*
X33426054Y38301228D01*
X33412969Y38307417D01*
X33400553Y38314858D01*
X33388927Y38323481D01*
X33378202Y38333202D01*
X33368481Y38343927D01*
X33359858Y38355553D01*
X33352417Y38367969D01*
X33346228Y38381054D01*
X33341351Y38394683D01*
X33337834Y38408724D01*
X33335710Y38423042D01*
X33335000Y38437500D01*
X33335000Y38732500D01*
X33335710Y38746958D01*
X33337834Y38761276D01*
X33341351Y38775317D01*
X33346228Y38788946D01*
X33352417Y38802031D01*
X33359858Y38814447D01*
X33368481Y38826073D01*
X33378202Y38836798D01*
X33388927Y38846519D01*
X33400553Y38855142D01*
X33412969Y38862583D01*
X33426054Y38868772D01*
X33439683Y38873649D01*
X33453724Y38877166D01*
X33468042Y38879290D01*
X33482500Y38880000D01*
X33827500Y38880000D01*
X33841958Y38879290D01*
G37*
G36*
X46632691Y19003947D02*
G01*
X46653926Y19000797D01*
X46674750Y18995581D01*
X46694962Y18988349D01*
X46714368Y18979170D01*
X46732781Y18968134D01*
X46750024Y18955346D01*
X46765930Y18940930D01*
X46780346Y18925024D01*
X46793134Y18907781D01*
X46804170Y18889368D01*
X46813349Y18869962D01*
X46820581Y18849750D01*
X46825797Y18828926D01*
X46828947Y18807691D01*
X46830000Y18786250D01*
X46830000Y18348750D01*
X46828947Y18327309D01*
X46825797Y18306074D01*
X46820581Y18285250D01*
X46813349Y18265038D01*
X46804170Y18245632D01*
X46793134Y18227219D01*
X46780346Y18209976D01*
X46765930Y18194070D01*
X46750024Y18179654D01*
X46732781Y18166866D01*
X46714368Y18155830D01*
X46694962Y18146651D01*
X46674750Y18139419D01*
X46653926Y18134203D01*
X46632691Y18131053D01*
X46611250Y18130000D01*
X46098750Y18130000D01*
X46077309Y18131053D01*
X46056074Y18134203D01*
X46035250Y18139419D01*
X46015038Y18146651D01*
X45995632Y18155830D01*
X45977219Y18166866D01*
X45959976Y18179654D01*
X45944070Y18194070D01*
X45929654Y18209976D01*
X45916866Y18227219D01*
X45905830Y18245632D01*
X45896651Y18265038D01*
X45889419Y18285250D01*
X45884203Y18306074D01*
X45881053Y18327309D01*
X45880000Y18348750D01*
X45880000Y18786250D01*
X45881053Y18807691D01*
X45884203Y18828926D01*
X45889419Y18849750D01*
X45896651Y18869962D01*
X45905830Y18889368D01*
X45916866Y18907781D01*
X45929654Y18925024D01*
X45944070Y18940930D01*
X45959976Y18955346D01*
X45977219Y18968134D01*
X45995632Y18979170D01*
X46015038Y18988349D01*
X46035250Y18995581D01*
X46056074Y19000797D01*
X46077309Y19003947D01*
X46098750Y19005000D01*
X46611250Y19005000D01*
X46632691Y19003947D01*
G37*
G36*
X46632691Y17428947D02*
G01*
X46653926Y17425797D01*
X46674750Y17420581D01*
X46694962Y17413349D01*
X46714368Y17404170D01*
X46732781Y17393134D01*
X46750024Y17380346D01*
X46765930Y17365930D01*
X46780346Y17350024D01*
X46793134Y17332781D01*
X46804170Y17314368D01*
X46813349Y17294962D01*
X46820581Y17274750D01*
X46825797Y17253926D01*
X46828947Y17232691D01*
X46830000Y17211250D01*
X46830000Y16773750D01*
X46828947Y16752309D01*
X46825797Y16731074D01*
X46820581Y16710250D01*
X46813349Y16690038D01*
X46804170Y16670632D01*
X46793134Y16652219D01*
X46780346Y16634976D01*
X46765930Y16619070D01*
X46750024Y16604654D01*
X46732781Y16591866D01*
X46714368Y16580830D01*
X46694962Y16571651D01*
X46674750Y16564419D01*
X46653926Y16559203D01*
X46632691Y16556053D01*
X46611250Y16555000D01*
X46098750Y16555000D01*
X46077309Y16556053D01*
X46056074Y16559203D01*
X46035250Y16564419D01*
X46015038Y16571651D01*
X45995632Y16580830D01*
X45977219Y16591866D01*
X45959976Y16604654D01*
X45944070Y16619070D01*
X45929654Y16634976D01*
X45916866Y16652219D01*
X45905830Y16670632D01*
X45896651Y16690038D01*
X45889419Y16710250D01*
X45884203Y16731074D01*
X45881053Y16752309D01*
X45880000Y16773750D01*
X45880000Y17211250D01*
X45881053Y17232691D01*
X45884203Y17253926D01*
X45889419Y17274750D01*
X45896651Y17294962D01*
X45905830Y17314368D01*
X45916866Y17332781D01*
X45929654Y17350024D01*
X45944070Y17365930D01*
X45959976Y17380346D01*
X45977219Y17393134D01*
X45995632Y17404170D01*
X46015038Y17413349D01*
X46035250Y17420581D01*
X46056074Y17425797D01*
X46077309Y17428947D01*
X46098750Y17430000D01*
X46611250Y17430000D01*
X46632691Y17428947D01*
G37*
G36*
X19137691Y27778947D02*
G01*
X19158926Y27775797D01*
X19179750Y27770581D01*
X19199962Y27763349D01*
X19219368Y27754170D01*
X19237781Y27743134D01*
X19255024Y27730346D01*
X19270930Y27715930D01*
X19285346Y27700024D01*
X19298134Y27682781D01*
X19309170Y27664368D01*
X19318349Y27644962D01*
X19325581Y27624750D01*
X19330797Y27603926D01*
X19333947Y27582691D01*
X19335000Y27561250D01*
X19335000Y27048750D01*
X19333947Y27027309D01*
X19330797Y27006074D01*
X19325581Y26985250D01*
X19318349Y26965038D01*
X19309170Y26945632D01*
X19298134Y26927219D01*
X19285346Y26909976D01*
X19270930Y26894070D01*
X19255024Y26879654D01*
X19237781Y26866866D01*
X19219368Y26855830D01*
X19199962Y26846651D01*
X19179750Y26839419D01*
X19158926Y26834203D01*
X19137691Y26831053D01*
X19116250Y26830000D01*
X18678750Y26830000D01*
X18657309Y26831053D01*
X18636074Y26834203D01*
X18615250Y26839419D01*
X18595038Y26846651D01*
X18575632Y26855830D01*
X18557219Y26866866D01*
X18539976Y26879654D01*
X18524070Y26894070D01*
X18509654Y26909976D01*
X18496866Y26927219D01*
X18485830Y26945632D01*
X18476651Y26965038D01*
X18469419Y26985250D01*
X18464203Y27006074D01*
X18461053Y27027309D01*
X18460000Y27048750D01*
X18460000Y27561250D01*
X18461053Y27582691D01*
X18464203Y27603926D01*
X18469419Y27624750D01*
X18476651Y27644962D01*
X18485830Y27664368D01*
X18496866Y27682781D01*
X18509654Y27700024D01*
X18524070Y27715930D01*
X18539976Y27730346D01*
X18557219Y27743134D01*
X18575632Y27754170D01*
X18595038Y27763349D01*
X18615250Y27770581D01*
X18636074Y27775797D01*
X18657309Y27778947D01*
X18678750Y27780000D01*
X19116250Y27780000D01*
X19137691Y27778947D01*
G37*
G36*
X20712691Y27778947D02*
G01*
X20733926Y27775797D01*
X20754750Y27770581D01*
X20774962Y27763349D01*
X20794368Y27754170D01*
X20812781Y27743134D01*
X20830024Y27730346D01*
X20845930Y27715930D01*
X20860346Y27700024D01*
X20873134Y27682781D01*
X20884170Y27664368D01*
X20893349Y27644962D01*
X20900581Y27624750D01*
X20905797Y27603926D01*
X20908947Y27582691D01*
X20910000Y27561250D01*
X20910000Y27048750D01*
X20908947Y27027309D01*
X20905797Y27006074D01*
X20900581Y26985250D01*
X20893349Y26965038D01*
X20884170Y26945632D01*
X20873134Y26927219D01*
X20860346Y26909976D01*
X20845930Y26894070D01*
X20830024Y26879654D01*
X20812781Y26866866D01*
X20794368Y26855830D01*
X20774962Y26846651D01*
X20754750Y26839419D01*
X20733926Y26834203D01*
X20712691Y26831053D01*
X20691250Y26830000D01*
X20253750Y26830000D01*
X20232309Y26831053D01*
X20211074Y26834203D01*
X20190250Y26839419D01*
X20170038Y26846651D01*
X20150632Y26855830D01*
X20132219Y26866866D01*
X20114976Y26879654D01*
X20099070Y26894070D01*
X20084654Y26909976D01*
X20071866Y26927219D01*
X20060830Y26945632D01*
X20051651Y26965038D01*
X20044419Y26985250D01*
X20039203Y27006074D01*
X20036053Y27027309D01*
X20035000Y27048750D01*
X20035000Y27561250D01*
X20036053Y27582691D01*
X20039203Y27603926D01*
X20044419Y27624750D01*
X20051651Y27644962D01*
X20060830Y27664368D01*
X20071866Y27682781D01*
X20084654Y27700024D01*
X20099070Y27715930D01*
X20114976Y27730346D01*
X20132219Y27743134D01*
X20150632Y27754170D01*
X20170038Y27763349D01*
X20190250Y27770581D01*
X20211074Y27775797D01*
X20232309Y27778947D01*
X20253750Y27780000D01*
X20691250Y27780000D01*
X20712691Y27778947D01*
G37*
M02*
