(module C0805-AIROX-MURATA-BLM21PG221D (layer F.Cu) (tedit 5E951031)
  (attr smd)
  (fp_text reference L24 (at 0.4572 0.7239 -90 unlocked) (layer F.SilkS)
    (effects (font (size 1.033069 1.086612) (thickness 0.1778)))
  )
  (fp_text value SF-BC-S0805 (at 0.7874 4.3307 -90 unlocked) (layer F.SilkS) hide
    (effects (font (size 1.033069 1.086612) (thickness 0.1778)))
  )
  (fp_line (start -0.4826 0.635) (end -0.4826 -0.635) (layer F.Fab) (width 0.0762))
  (fp_line (start -0.9906 -0.635) (end -0.4826 -0.635) (layer F.Fab) (width 0.0762))
  (fp_line (start -0.9906 0.635) (end 0.9906 0.635) (layer F.Fab) (width 0.0762))
  (fp_line (start 0.4826 0.635) (end 0.9906 0.635) (layer F.Fab) (width 0.0762))
  (fp_line (start -0.9906 0.635) (end -0.4826 0.635) (layer F.Fab) (width 0.0762))
  (fp_line (start 0.4826 0.635) (end 0.4826 -0.635) (layer F.Fab) (width 0.0762))
  (fp_line (start -0.9906 -0.635) (end 0.9906 -0.635) (layer F.Fab) (width 0.0762))
  (fp_line (start -0.9906 0.635) (end -0.9906 -0.635) (layer F.Fab) (width 0.0762))
  (fp_line (start 0.9906 0.635) (end 0.9906 -0.635) (layer F.Fab) (width 0.0762))
  (fp_line (start 0.4826 -0.635) (end 0.9906 -0.635) (layer F.Fab) (width 0.0762))
  (fp_line (start -1.6764 0.9906) (end -1.6764 0.8636) (layer F.SilkS) (width 0.1778))
  (fp_line (start -1.6764 -0.9906) (end 1.6764 -0.9906) (layer F.SilkS) (width 0.1778))
  (fp_line (start 1.6764 -0.8636) (end 1.6764 -0.9906) (layer F.SilkS) (width 0.1778))
  (fp_line (start -1.6764 -0.8636) (end -1.6764 -0.9906) (layer F.SilkS) (width 0.1778))
  (fp_line (start -1.6764 0.9906) (end 1.6764 0.9906) (layer F.SilkS) (width 0.1778))
  (fp_line (start 1.6764 0.9906) (end 1.6764 0.8636) (layer F.SilkS) (width 0.1778))
  (pad 1 smd rect (at -0.889 0) (size 1.143 1.4478) (layers F.Cu F.Paste F.Mask))
  (pad 2 smd rect (at 0.889 0) (size 1.143 1.4478) (layers F.Cu F.Paste F.Mask))
  (model ${KISYS3DMOD}/Capacitor_SMD.3dshapes/C_0805_2012Metric.wrl
    (at (xyz 0 0 0))
    (scale (xyz 1 1 1))
    (rotate (xyz 0 0 0))
  )
)
