ISO-10303-21;
HEADER;
/* Generated by software containing ST-Developer
 * from STEP Tools, Inc. (www.steptools.com) 
 */

FILE_DESCRIPTION(
/* description */ (''),
/* implementation_level */ '2;1');

FILE_NAME(
/* name */ 
'C:\\Users\\huesof\\Downloads\\medtronic-pb560-ventilator-system-file-
set-2\\Electronic PCBAs\\10005011_Power Management_PCBA\\3842800_POWER
 SUPPLY BOARD - TANTALUM LESS_PCBA\\PCBA\\3842800F00_3D_Model\\entreto
ise richco - recenter.stp',
/* time_stamp */ '2020-04-16T10:18:20-04:00',
/* author */ ('huesof'),
/* organization */ (''),
/* preprocessor_version */ 'ST-DEVELOPER v18',
/* originating_system */ 'Autodesk Inventor 2020',
/* authorisation */ '');

FILE_SCHEMA (('AUTOMOTIVE_DESIGN { 1 0 10303 214 3 1 1 }'));
ENDSEC;

DATA;
#10=MECHANICAL_DESIGN_GEOMETRIC_PRESENTATION_REPRESENTATION('',(#13),#322);
#11=SHAPE_REPRESENTATION_RELATIONSHIP('SRR','None',#329,#12);
#12=ADVANCED_BREP_SHAPE_REPRESENTATION('',(#14),#321);
#13=STYLED_ITEM('',(#338),#14);
#14=MANIFOLD_SOLID_BREP('Solid1',#167);
#15=CONICAL_SURFACE('',#204,3.,0.380506377112365);
#16=CONICAL_SURFACE('',#210,1.2,0.422853926132941);
#17=LINE('',#286,#22);
#18=LINE('',#289,#23);
#19=LINE('',#295,#24);
#20=LINE('',#306,#25);
#21=LINE('',#316,#26);
#22=VECTOR('',#231,3.);
#23=VECTOR('',#234,1.2);
#24=VECTOR('',#241,1.2);
#25=VECTOR('',#254,3.);
#26=VECTOR('',#267,1.2);
#27=CYLINDRICAL_SURFACE('',#194,3.);
#28=CYLINDRICAL_SURFACE('',#195,1.2);
#29=CYLINDRICAL_SURFACE('',#198,1.2);
#30=FACE_BOUND('',#46,.T.);
#31=FACE_BOUND('',#48,.T.);
#32=FACE_BOUND('',#53,.T.);
#33=FACE_BOUND('',#57,.T.);
#34=FACE_OUTER_BOUND('',#45,.T.);
#35=FACE_OUTER_BOUND('',#47,.T.);
#36=FACE_OUTER_BOUND('',#49,.T.);
#37=FACE_OUTER_BOUND('',#50,.T.);
#38=FACE_OUTER_BOUND('',#51,.T.);
#39=FACE_OUTER_BOUND('',#52,.T.);
#40=FACE_OUTER_BOUND('',#54,.T.);
#41=FACE_OUTER_BOUND('',#55,.T.);
#42=FACE_OUTER_BOUND('',#56,.T.);
#43=FACE_OUTER_BOUND('',#58,.T.);
#44=FACE_OUTER_BOUND('',#59,.T.);
#45=EDGE_LOOP('',(#110));
#46=EDGE_LOOP('',(#111,#112));
#47=EDGE_LOOP('',(#113));
#48=EDGE_LOOP('',(#114));
#49=EDGE_LOOP('',(#115,#116,#117,#118));
#50=EDGE_LOOP('',(#119,#120,#121,#122,#123));
#51=EDGE_LOOP('',(#124,#125,#126,#127,#128,#129));
#52=EDGE_LOOP('',(#130,#131));
#53=EDGE_LOOP('',(#132,#133));
#54=EDGE_LOOP('',(#134,#135,#136,#137,#138,#139));
#55=EDGE_LOOP('',(#140,#141));
#56=EDGE_LOOP('',(#142));
#57=EDGE_LOOP('',(#143,#144));
#58=EDGE_LOOP('',(#145,#146,#147,#148));
#59=EDGE_LOOP('',(#149));
#60=CIRCLE('',#188,3.);
#61=CIRCLE('',#189,1.2);
#62=CIRCLE('',#190,1.2);
#63=CIRCLE('',#192,3.);
#64=CIRCLE('',#193,1.2);
#65=CIRCLE('',#196,1.2);
#66=CIRCLE('',#197,1.2);
#67=CIRCLE('',#199,1.2);
#68=CIRCLE('',#200,1.2);
#69=CIRCLE('',#202,3.);
#70=CIRCLE('',#203,3.);
#71=CIRCLE('',#205,1.2);
#72=CIRCLE('',#206,1.2);
#73=CIRCLE('',#209,3.);
#74=CIRCLE('',#211,1.2);
#75=VERTEX_POINT('',#274);
#76=VERTEX_POINT('',#276);
#77=VERTEX_POINT('',#277);
#78=VERTEX_POINT('',#281);
#79=VERTEX_POINT('',#283);
#80=VERTEX_POINT('',#288);
#81=VERTEX_POINT('',#290);
#82=VERTEX_POINT('',#294);
#83=VERTEX_POINT('',#296);
#84=VERTEX_POINT('',#300);
#85=VERTEX_POINT('',#301);
#86=VERTEX_POINT('',#305);
#87=VERTEX_POINT('',#307);
#88=VERTEX_POINT('',#312);
#89=VERTEX_POINT('',#315);
#90=EDGE_CURVE('',#75,#75,#60,.T.);
#91=EDGE_CURVE('',#76,#77,#61,.F.);
#92=EDGE_CURVE('',#77,#76,#62,.F.);
#93=EDGE_CURVE('',#78,#78,#63,.T.);
#94=EDGE_CURVE('',#79,#79,#64,.T.);
#95=EDGE_CURVE('',#75,#78,#17,.T.);
#96=EDGE_CURVE('',#79,#80,#18,.T.);
#97=EDGE_CURVE('',#80,#81,#65,.T.);
#98=EDGE_CURVE('',#81,#80,#66,.T.);
#99=EDGE_CURVE('',#77,#82,#19,.T.);
#100=EDGE_CURVE('',#82,#83,#67,.T.);
#101=EDGE_CURVE('',#83,#82,#68,.T.);
#102=EDGE_CURVE('',#84,#85,#69,.T.);
#103=EDGE_CURVE('',#85,#84,#70,.T.);
#104=EDGE_CURVE('',#85,#86,#20,.T.);
#105=EDGE_CURVE('',#86,#87,#71,.T.);
#106=EDGE_CURVE('',#87,#86,#72,.T.);
#107=EDGE_CURVE('',#88,#88,#73,.T.);
#108=EDGE_CURVE('',#88,#89,#21,.T.);
#109=EDGE_CURVE('',#89,#89,#74,.T.);
#110=ORIENTED_EDGE('',*,*,#90,.F.);
#111=ORIENTED_EDGE('',*,*,#91,.F.);
#112=ORIENTED_EDGE('',*,*,#92,.F.);
#113=ORIENTED_EDGE('',*,*,#93,.T.);
#114=ORIENTED_EDGE('',*,*,#94,.F.);
#115=ORIENTED_EDGE('',*,*,#90,.T.);
#116=ORIENTED_EDGE('',*,*,#95,.T.);
#117=ORIENTED_EDGE('',*,*,#93,.F.);
#118=ORIENTED_EDGE('',*,*,#95,.F.);
#119=ORIENTED_EDGE('',*,*,#94,.T.);
#120=ORIENTED_EDGE('',*,*,#96,.T.);
#121=ORIENTED_EDGE('',*,*,#97,.T.);
#122=ORIENTED_EDGE('',*,*,#98,.T.);
#123=ORIENTED_EDGE('',*,*,#96,.F.);
#124=ORIENTED_EDGE('',*,*,#91,.T.);
#125=ORIENTED_EDGE('',*,*,#99,.T.);
#126=ORIENTED_EDGE('',*,*,#100,.T.);
#127=ORIENTED_EDGE('',*,*,#101,.T.);
#128=ORIENTED_EDGE('',*,*,#99,.F.);
#129=ORIENTED_EDGE('',*,*,#92,.T.);
#130=ORIENTED_EDGE('',*,*,#102,.T.);
#131=ORIENTED_EDGE('',*,*,#103,.T.);
#132=ORIENTED_EDGE('',*,*,#101,.F.);
#133=ORIENTED_EDGE('',*,*,#100,.F.);
#134=ORIENTED_EDGE('',*,*,#102,.F.);
#135=ORIENTED_EDGE('',*,*,#103,.F.);
#136=ORIENTED_EDGE('',*,*,#104,.T.);
#137=ORIENTED_EDGE('',*,*,#105,.T.);
#138=ORIENTED_EDGE('',*,*,#106,.T.);
#139=ORIENTED_EDGE('',*,*,#104,.F.);
#140=ORIENTED_EDGE('',*,*,#106,.F.);
#141=ORIENTED_EDGE('',*,*,#105,.F.);
#142=ORIENTED_EDGE('',*,*,#107,.F.);
#143=ORIENTED_EDGE('',*,*,#98,.F.);
#144=ORIENTED_EDGE('',*,*,#97,.F.);
#145=ORIENTED_EDGE('',*,*,#107,.T.);
#146=ORIENTED_EDGE('',*,*,#108,.T.);
#147=ORIENTED_EDGE('',*,*,#109,.F.);
#148=ORIENTED_EDGE('',*,*,#108,.F.);
#149=ORIENTED_EDGE('',*,*,#109,.T.);
#150=PLANE('',#187);
#151=PLANE('',#191);
#152=PLANE('',#201);
#153=PLANE('',#207);
#154=PLANE('',#208);
#155=PLANE('',#212);
#156=ADVANCED_FACE('',(#34,#30),#150,.F.);
#157=ADVANCED_FACE('',(#35,#31),#151,.T.);
#158=ADVANCED_FACE('',(#36),#27,.T.);
#159=ADVANCED_FACE('',(#37),#28,.T.);
#160=ADVANCED_FACE('',(#38),#29,.T.);
#161=ADVANCED_FACE('',(#39,#32),#152,.T.);
#162=ADVANCED_FACE('',(#40),#15,.T.);
#163=ADVANCED_FACE('',(#41),#153,.T.);
#164=ADVANCED_FACE('',(#42,#33),#154,.T.);
#165=ADVANCED_FACE('',(#43),#16,.T.);
#166=ADVANCED_FACE('',(#44),#155,.T.);
#167=CLOSED_SHELL('',(#156,#157,#158,#159,#160,#161,#162,#163,#164,#165,
#166));
#168=DERIVED_UNIT_ELEMENT(#170,1.);
#169=DERIVED_UNIT_ELEMENT(#324,3.);
#170=(
MASS_UNIT()
NAMED_UNIT(*)
SI_UNIT($,.GRAM.)
);
#171=DERIVED_UNIT((#168,#169));
#172=MEASURE_REPRESENTATION_ITEM('density measure',
POSITIVE_RATIO_MEASURE(2.7),#171);
#173=PROPERTY_DEFINITION_REPRESENTATION(#178,#175);
#174=PROPERTY_DEFINITION_REPRESENTATION(#179,#176);
#175=REPRESENTATION('material name',(#177),#321);
#176=REPRESENTATION('density',(#172),#321);
#177=DESCRIPTIVE_REPRESENTATION_ITEM('Aluminum 6061','Aluminum 6061');
#178=PROPERTY_DEFINITION('material property','material name',#331);
#179=PROPERTY_DEFINITION('material property','density of part',#331);
#180=DATE_TIME_ROLE('creation_date');
#181=APPLIED_DATE_AND_TIME_ASSIGNMENT(#182,#180,(#331));
#182=DATE_AND_TIME(#183,#184);
#183=CALENDAR_DATE(2006,17,11);
#184=LOCAL_TIME(14,7,14.,#185);
#185=COORDINATED_UNIVERSAL_TIME_OFFSET(0,0,.BEHIND.);
#186=AXIS2_PLACEMENT_3D('placement',#272,#213,#214);
#187=AXIS2_PLACEMENT_3D('',#273,#215,#216);
#188=AXIS2_PLACEMENT_3D('',#275,#217,#218);
#189=AXIS2_PLACEMENT_3D('',#278,#219,#220);
#190=AXIS2_PLACEMENT_3D('',#279,#221,#222);
#191=AXIS2_PLACEMENT_3D('',#280,#223,#224);
#192=AXIS2_PLACEMENT_3D('',#282,#225,#226);
#193=AXIS2_PLACEMENT_3D('',#284,#227,#228);
#194=AXIS2_PLACEMENT_3D('',#285,#229,#230);
#195=AXIS2_PLACEMENT_3D('',#287,#232,#233);
#196=AXIS2_PLACEMENT_3D('',#291,#235,#236);
#197=AXIS2_PLACEMENT_3D('',#292,#237,#238);
#198=AXIS2_PLACEMENT_3D('',#293,#239,#240);
#199=AXIS2_PLACEMENT_3D('',#297,#242,#243);
#200=AXIS2_PLACEMENT_3D('',#298,#244,#245);
#201=AXIS2_PLACEMENT_3D('',#299,#246,#247);
#202=AXIS2_PLACEMENT_3D('',#302,#248,#249);
#203=AXIS2_PLACEMENT_3D('',#303,#250,#251);
#204=AXIS2_PLACEMENT_3D('',#304,#252,#253);
#205=AXIS2_PLACEMENT_3D('',#308,#255,#256);
#206=AXIS2_PLACEMENT_3D('',#309,#257,#258);
#207=AXIS2_PLACEMENT_3D('',#310,#259,#260);
#208=AXIS2_PLACEMENT_3D('',#311,#261,#262);
#209=AXIS2_PLACEMENT_3D('',#313,#263,#264);
#210=AXIS2_PLACEMENT_3D('',#314,#265,#266);
#211=AXIS2_PLACEMENT_3D('',#317,#268,#269);
#212=AXIS2_PLACEMENT_3D('',#318,#270,#271);
#213=DIRECTION('axis',(0.,0.,1.));
#214=DIRECTION('refdir',(1.,0.,0.));
#215=DIRECTION('center_axis',(0.,0.,1.));
#216=DIRECTION('ref_axis',(1.,0.,0.));
#217=DIRECTION('center_axis',(0.,0.,1.));
#218=DIRECTION('ref_axis',(1.,0.,0.));
#219=DIRECTION('center_axis',(0.,0.,1.));
#220=DIRECTION('ref_axis',(1.,0.,0.));
#221=DIRECTION('center_axis',(0.,0.,1.));
#222=DIRECTION('ref_axis',(1.,0.,0.));
#223=DIRECTION('center_axis',(0.,0.,1.));
#224=DIRECTION('ref_axis',(1.,0.,0.));
#225=DIRECTION('center_axis',(0.,0.,1.));
#226=DIRECTION('ref_axis',(1.,0.,0.));
#227=DIRECTION('center_axis',(0.,0.,1.));
#228=DIRECTION('ref_axis',(1.,0.,0.));
#229=DIRECTION('center_axis',(0.,0.,-1.));
#230=DIRECTION('ref_axis',(-1.,0.,0.));
#231=DIRECTION('',(0.,0.,1.));
#232=DIRECTION('center_axis',(0.,0.,-1.));
#233=DIRECTION('ref_axis',(-1.,0.,0.));
#234=DIRECTION('',(0.,0.,1.));
#235=DIRECTION('center_axis',(0.,0.,-1.));
#236=DIRECTION('ref_axis',(-1.,0.,0.));
#237=DIRECTION('center_axis',(0.,0.,-1.));
#238=DIRECTION('ref_axis',(-1.,0.,0.));
#239=DIRECTION('center_axis',(0.,0.,1.));
#240=DIRECTION('ref_axis',(1.,0.,0.));
#241=DIRECTION('',(0.,0.,-1.));
#242=DIRECTION('center_axis',(0.,0.,1.));
#243=DIRECTION('ref_axis',(1.,0.,0.));
#244=DIRECTION('center_axis',(0.,0.,1.));
#245=DIRECTION('ref_axis',(1.,0.,0.));
#246=DIRECTION('center_axis',(0.,0.,1.));
#247=DIRECTION('ref_axis',(1.,0.,0.));
#248=DIRECTION('center_axis',(0.,0.,1.));
#249=DIRECTION('ref_axis',(1.,0.,0.));
#250=DIRECTION('center_axis',(0.,0.,1.));
#251=DIRECTION('ref_axis',(1.,0.,0.));
#252=DIRECTION('center_axis',(0.,0.,1.));
#253=DIRECTION('ref_axis',(1.,0.,0.));
#254=DIRECTION('',(0.371390676354104,4.54822403030224E-17,-0.928476690885259));
#255=DIRECTION('center_axis',(0.,0.,1.));
#256=DIRECTION('ref_axis',(1.,0.,0.));
#257=DIRECTION('center_axis',(0.,0.,1.));
#258=DIRECTION('ref_axis',(1.,0.,0.));
#259=DIRECTION('center_axis',(0.,0.,-1.));
#260=DIRECTION('ref_axis',(-1.,0.,0.));
#261=DIRECTION('center_axis',(0.,0.,-1.));
#262=DIRECTION('ref_axis',(-1.,0.,0.));
#263=DIRECTION('center_axis',(0.,0.,1.));
#264=DIRECTION('ref_axis',(1.,0.,0.));
#265=DIRECTION('center_axis',(0.,0.,-1.));
#266=DIRECTION('ref_axis',(-1.,0.,0.));
#267=DIRECTION('',(-0.410364677328798,5.02551788573848E-17,0.911921505175106));
#268=DIRECTION('center_axis',(0.,0.,1.));
#269=DIRECTION('ref_axis',(1.,0.,0.));
#270=DIRECTION('center_axis',(0.,0.,1.));
#271=DIRECTION('ref_axis',(1.,0.,0.));
#272=CARTESIAN_POINT('',(0.,0.,0.));
#273=CARTESIAN_POINT('Origin',(0.,0.,0.));
#274=CARTESIAN_POINT('',(3.,0.,0.));
#275=CARTESIAN_POINT('Origin',(0.,0.,0.));
#276=CARTESIAN_POINT('',(1.2,0.,0.));
#277=CARTESIAN_POINT('',(-1.2,-1.46957615897682E-16,0.));
#278=CARTESIAN_POINT('Origin',(0.,0.,0.));
#279=CARTESIAN_POINT('Origin',(0.,0.,0.));
#280=CARTESIAN_POINT('Origin',(0.,0.,16.));
#281=CARTESIAN_POINT('',(3.,0.,16.));
#282=CARTESIAN_POINT('Origin',(0.,0.,16.));
#283=CARTESIAN_POINT('',(1.2,0.,16.));
#284=CARTESIAN_POINT('Origin',(0.,0.,16.));
#285=CARTESIAN_POINT('Origin',(0.,0.,16.));
#286=CARTESIAN_POINT('',(3.,-3.67394039744206E-16,16.));
#287=CARTESIAN_POINT('Origin',(0.,0.,21.));
#288=CARTESIAN_POINT('',(1.2,-1.46957615897682E-16,17.));
#289=CARTESIAN_POINT('',(1.2,-1.46957615897682E-16,21.));
#290=CARTESIAN_POINT('',(-1.2,0.,17.));
#291=CARTESIAN_POINT('Origin',(0.,0.,17.));
#292=CARTESIAN_POINT('Origin',(0.,0.,17.));
#293=CARTESIAN_POINT('Origin',(0.,0.,-5.5));
#294=CARTESIAN_POINT('',(-1.2,-1.46957615897682E-16,-1.));
#295=CARTESIAN_POINT('',(-1.2,-1.46957615897682E-16,-5.5));
#296=CARTESIAN_POINT('',(1.2,0.,-1.));
#297=CARTESIAN_POINT('Origin',(0.,0.,-1.));
#298=CARTESIAN_POINT('Origin',(0.,0.,-1.));
#299=CARTESIAN_POINT('Origin',(0.,0.,-1.));
#300=CARTESIAN_POINT('',(3.,0.,-1.));
#301=CARTESIAN_POINT('',(-3.,-3.67394039744206E-16,-1.));
#302=CARTESIAN_POINT('Origin',(0.,0.,-1.));
#303=CARTESIAN_POINT('Origin',(0.,0.,-1.));
#304=CARTESIAN_POINT('Origin',(0.,0.,-1.));
#305=CARTESIAN_POINT('',(-1.2,-1.46957615897682E-16,-5.5));
#306=CARTESIAN_POINT('',(-3.,-3.67394039744206E-16,-1.));
#307=CARTESIAN_POINT('',(1.2,0.,-5.5));
#308=CARTESIAN_POINT('Origin',(0.,0.,-5.5));
#309=CARTESIAN_POINT('Origin',(0.,0.,-5.5));
#310=CARTESIAN_POINT('Origin',(0.,0.,-5.5));
#311=CARTESIAN_POINT('Origin',(3.,0.,17.));
#312=CARTESIAN_POINT('',(3.,0.,17.));
#313=CARTESIAN_POINT('Origin',(0.,0.,17.));
#314=CARTESIAN_POINT('Origin',(0.,0.,21.));
#315=CARTESIAN_POINT('',(1.2,0.,21.));
#316=CARTESIAN_POINT('',(1.2,-1.46957615897682E-16,21.));
#317=CARTESIAN_POINT('Origin',(0.,0.,21.));
#318=CARTESIAN_POINT('Origin',(0.,0.,21.));
#319=UNCERTAINTY_MEASURE_WITH_UNIT(LENGTH_MEASURE(0.01),#323,
'DISTANCE_ACCURACY_VALUE',
'Maximum model space distance between geometric entities at asserted c
onnectivities');
#320=UNCERTAINTY_MEASURE_WITH_UNIT(LENGTH_MEASURE(0.01),#323,
'DISTANCE_ACCURACY_VALUE',
'Maximum model space distance between geometric entities at asserted c
onnectivities');
#321=(
GEOMETRIC_REPRESENTATION_CONTEXT(3)
GLOBAL_UNCERTAINTY_ASSIGNED_CONTEXT((#319))
GLOBAL_UNIT_ASSIGNED_CONTEXT((#323,#325,#326))
REPRESENTATION_CONTEXT('','3D')
);
#322=(
GEOMETRIC_REPRESENTATION_CONTEXT(3)
GLOBAL_UNCERTAINTY_ASSIGNED_CONTEXT((#320))
GLOBAL_UNIT_ASSIGNED_CONTEXT((#323,#325,#326))
REPRESENTATION_CONTEXT('','3D')
);
#323=(
LENGTH_UNIT()
NAMED_UNIT(*)
SI_UNIT(.MILLI.,.METRE.)
);
#324=(
LENGTH_UNIT()
NAMED_UNIT(*)
SI_UNIT(.CENTI.,.METRE.)
);
#325=(
NAMED_UNIT(*)
PLANE_ANGLE_UNIT()
SI_UNIT($,.RADIAN.)
);
#326=(
NAMED_UNIT(*)
SI_UNIT($,.STERADIAN.)
SOLID_ANGLE_UNIT()
);
#327=SHAPE_DEFINITION_REPRESENTATION(#328,#329);
#328=PRODUCT_DEFINITION_SHAPE('',$,#331);
#329=SHAPE_REPRESENTATION('',(#186),#321);
#330=PRODUCT_DEFINITION_CONTEXT('part definition',#335,'design');
#331=PRODUCT_DEFINITION('entretoise richco - recenter',
'entretoise richco - recenter',#332,#330);
#332=PRODUCT_DEFINITION_FORMATION('',$,#337);
#333=PRODUCT_RELATED_PRODUCT_CATEGORY('entretoise richco - recenter',
'entretoise richco - recenter',(#337));
#334=APPLICATION_PROTOCOL_DEFINITION('international standard',
'automotive_design',2009,#335);
#335=APPLICATION_CONTEXT(
'Core Data for Automotive Mechanical Design Process');
#336=PRODUCT_CONTEXT('part definition',#335,'mechanical');
#337=PRODUCT('entretoise richco - recenter',
'entretoise richco - recenter',$,(#336));
#338=PRESENTATION_STYLE_ASSIGNMENT((#339));
#339=SURFACE_STYLE_USAGE(.BOTH.,#342);
#340=SURFACE_STYLE_RENDERING_WITH_PROPERTIES($,#346,(#341));
#341=SURFACE_STYLE_TRANSPARENT(0.);
#342=SURFACE_SIDE_STYLE('',(#343,#340));
#343=SURFACE_STYLE_FILL_AREA(#344);
#344=FILL_AREA_STYLE('',(#345));
#345=FILL_AREA_STYLE_COLOUR('',#346);
#346=COLOUR_RGB('',0.996078431372549,0.996078431372549,1.);
ENDSEC;
END-ISO-10303-21;
