(module C0805_1b (layer F.Cu) (tedit 5E98DB69)
  (attr smd)
  (fp_text reference C3 (at 2.82213 -0.03147 unlocked) (layer F.SilkS)
    (effects (font (size 1.0496 1.104) (thickness 0.18)))
  )
  (fp_text value C-BC-C0805 (at 4 -0.8 unlocked) (layer F.SilkS) hide
    (effects (font (size 1.0496 1.104) (thickness 0.18)))
  )
  (fp_line (start 1.80059 0.9525) (end 1.905 0.9525) (layer F.SilkS) (width 0.18))
  (fp_line (start -1.905 0.9525) (end -1.905 -0.9525) (layer F.SilkS) (width 0.18))
  (fp_line (start 1.905 0.9525) (end 1.905 -0.9525) (layer F.SilkS) (width 0.18))
  (fp_line (start -1.905 -0.9525) (end 1.905 -0.9525) (layer F.SilkS) (width 0.18))
  (fp_line (start -1.905 0.9525) (end -1.65773 0.9525) (layer F.SilkS) (width 0.18))
  (fp_line (start -1 0.625) (end -1 -0.625) (layer F.Fab) (width 0.1))
  (fp_line (start 1 0.625) (end 1 -0.625) (layer F.Fab) (width 0.1))
  (fp_line (start -1 -0.625) (end 1 -0.625) (layer F.Fab) (width 0.1))
  (fp_line (start -1 0.625) (end 1 0.625) (layer F.Fab) (width 0.1))
  (pad 2 smd rect (at 1 0) (size 1 1.25) (layers F.Cu F.Paste F.Mask))
  (pad 1 smd rect (at -1 0) (size 1 1.25) (layers F.Cu F.Paste F.Mask))
  (model ${KISYS3DMOD}/Capacitor_SMD.3dshapes/C_0805_2012Metric.wrl
    (at (xyz 0 0 0))
    (scale (xyz 1 1 1))
    (rotate (xyz 0 0 0))
  )
)
