(module F6126_1 (layer F.Cu) (tedit 5E98E0CC)
  (attr smd)
  (fp_text reference FU1 (at 0.027 -2.613 unlocked) (layer F.SilkS)
    (effects (font (size 1.0496 1.104) (thickness 0.18)))
  )
  (fp_text value FU-BC-R451 (at 4 -0.8 unlocked) (layer F.SilkS) hide
    (effects (font (size 1.0496 1.104) (thickness 0.18)))
  )
  (fp_line (start 4.1275 1.905) (end 4.1275 -1.905) (layer F.SilkS) (width 0.18))
  (fp_line (start -4.1275 -1.905) (end 4.1275 -1.905) (layer F.SilkS) (width 0.18))
  (fp_line (start 0.57066 1.905) (end 4.1275 1.905) (layer F.SilkS) (width 0.18))
  (fp_line (start -4.1275 1.905) (end -4.1275 -1.905) (layer F.SilkS) (width 0.18))
  (fp_line (start -4.1275 1.905) (end -0.27066 1.905) (layer F.SilkS) (width 0.18))
  (fp_line (start -3.05 1.35) (end -3.05 -1.35) (layer F.Fab) (width 0.1))
  (fp_line (start -3.05 1.35) (end 3.05 1.35) (layer F.Fab) (width 0.1))
  (fp_line (start 3.05 1.35) (end 3.05 -1.35) (layer F.Fab) (width 0.1))
  (fp_line (start -3.05 -1.35) (end 3.05 -1.35) (layer F.Fab) (width 0.1))
  (pad 2 smd rect (at 2.54 0) (size 2.286 3.2004) (layers F.Cu F.Paste F.Mask))
  (pad 1 smd rect (at -2.54 0) (size 2.286 3.2004) (layers F.Cu F.Paste F.Mask))
  (model "${KIPRJMOD}/Footprints.3dshapes/0451Series.step"
    (at (xyz 0 0 0))
    (scale (xyz 1 1 1))
    (rotate (xyz 0 0 0))
  )
)
