(module SOD80_1 (layer F.Cu) (tedit 0)
  (attr smd)
  (fp_text reference REF** (at 0.6731 -0.4572 unlocked) (layer F.SilkS)
    (effects (font (size 1.033069 1.086612) (thickness 0.127)))
  )
  (fp_text value D-BC-SOD80 (at 3.937 -0.7874 unlocked) (layer F.SilkS) hide
    (effects (font (size 1.033069 1.086612) (thickness 0.127)))
  )
  (fp_line (start -2.6924 1.27) (end 2.3622 1.27) (layer F.SilkS) (width 0.1778))
  (fp_line (start -2.6924 1.27) (end -2.6924 -1.27) (layer F.SilkS) (width 0.1778))
  (fp_line (start 2.3622 -1.27) (end 2.6924 -0.9398) (layer F.SilkS) (width 0.1778))
  (fp_line (start 2.6924 0.9398) (end 2.6924 -0.9398) (layer F.SilkS) (width 0.1778))
  (fp_line (start -2.6924 -1.27) (end 2.3622 -1.27) (layer F.SilkS) (width 0.1778))
  (fp_line (start 2.3622 1.27) (end 2.6924 0.9398) (layer F.SilkS) (width 0.1778))
  (fp_line (start -2.6924 1.27) (end 2.3622 1.27) (layer Dwgs.User) (width 0.1778))
  (fp_line (start -2.6924 1.27) (end -2.6924 -1.27) (layer Dwgs.User) (width 0.1778))
  (fp_line (start 2.3622 -1.27) (end 2.6924 -0.9398) (layer Dwgs.User) (width 0.1778))
  (fp_line (start 2.6924 0.9398) (end 2.6924 -0.9398) (layer Dwgs.User) (width 0.1778))
  (fp_line (start -2.6924 -1.27) (end 2.3622 -1.27) (layer Dwgs.User) (width 0.1778))
  (fp_line (start 2.3622 1.27) (end 2.6924 0.9398) (layer Dwgs.User) (width 0.1778))
  (fp_line (start -1.8542 0.8636) (end 1.8542 0.8636) (layer F.Fab) (width 0.0762))
  (fp_line (start -1.8542 0.8636) (end -1.8542 -0.8636) (layer F.Fab) (width 0.0762))
  (fp_line (start 1.8542 0.8636) (end 1.8542 -0.8636) (layer F.Fab) (width 0.0762))
  (fp_line (start -1.8542 -0.8636) (end 1.8542 -0.8636) (layer F.Fab) (width 0.0762))
  (fp_line (start 1.016 0.8636) (end 1.016 -0.8636) (layer F.Fab) (width 0.0762))
  (pad 2 smd rect (at 1.5748 0) (size 1.5748 1.905) (layers F.Cu F.Paste F.Mask))
  (pad 1 smd rect (at -1.5748 0) (size 1.5748 1.905) (layers F.Cu F.Paste F.Mask))
  (pad K smd rect (at 1.5748 0) (size 1.5748 1.905) (layers F.Cu F.Paste F.Mask))
  (pad A smd rect (at -1.5748 0) (size 1.5748 1.905) (layers F.Cu F.Paste F.Mask))
  (model ${KISYS3DMOD}/Diode_SMD.3dshapes/D_MiniMELF.wrl
    (at (xyz 0 0 0))
    (scale (xyz 1 1 1))
    (rotate (xyz 0 0 0))
  )
)
