G04 #@! TF.GenerationSoftware,KiCad,Pcbnew,(5.1.5)-3*
G04 #@! TF.CreationDate,2020-04-20T12:10:47-07:00*
G04 #@! TF.ProjectId,10096510 Battery Connection,31303039-3635-4313-9020-426174746572,rev?*
G04 #@! TF.SameCoordinates,PXb874050PY8789ff8*
G04 #@! TF.FileFunction,Copper,L2,Bot*
G04 #@! TF.FilePolarity,Positive*
%FSLAX46Y46*%
G04 Gerber Fmt 4.6, Leading zero omitted, Abs format (unit mm)*
G04 Created by KiCad (PCBNEW (5.1.5)-3) date 2020-04-20 12:10:47*
%MOMM*%
%LPD*%
G04 APERTURE LIST*
%ADD10C,0.254000*%
%ADD11C,4.292600*%
%ADD12C,1.574800*%
%ADD13R,1.574800X1.574800*%
%ADD14C,2.235200*%
%ADD15C,1.016000*%
%ADD16C,0.635000*%
%ADD17C,0.304800*%
%ADD18C,0.508000*%
%ADD19C,1.016000*%
G04 APERTURE END LIST*
D10*
X19940814Y-25309285D02*
X20122242Y-25369761D01*
X20182719Y-25430238D01*
X20243195Y-25551190D01*
X20243195Y-25732619D01*
X20182719Y-25853571D01*
X20122242Y-25914047D01*
X20001290Y-25974523D01*
X19517480Y-25974523D01*
X19517480Y-24704523D01*
X19940814Y-24704523D01*
X20061766Y-24765000D01*
X20122242Y-24825476D01*
X20182719Y-24946428D01*
X20182719Y-25067380D01*
X20122242Y-25188333D01*
X20061766Y-25248809D01*
X19940814Y-25309285D01*
X19517480Y-25309285D01*
X21029385Y-24704523D02*
X21271290Y-24704523D01*
X21392242Y-24765000D01*
X21513195Y-24885952D01*
X21573671Y-25127857D01*
X21573671Y-25551190D01*
X21513195Y-25793095D01*
X21392242Y-25914047D01*
X21271290Y-25974523D01*
X21029385Y-25974523D01*
X20908433Y-25914047D01*
X20787480Y-25793095D01*
X20727004Y-25551190D01*
X20727004Y-25127857D01*
X20787480Y-24885952D01*
X20908433Y-24765000D01*
X21029385Y-24704523D01*
X21936528Y-24704523D02*
X22662242Y-24704523D01*
X22299385Y-25974523D02*
X22299385Y-24704523D01*
X22904147Y-24704523D02*
X23629861Y-24704523D01*
X23267004Y-25974523D02*
X23267004Y-24704523D01*
X24295100Y-24704523D02*
X24537004Y-24704523D01*
X24657957Y-24765000D01*
X24778909Y-24885952D01*
X24839385Y-25127857D01*
X24839385Y-25551190D01*
X24778909Y-25793095D01*
X24657957Y-25914047D01*
X24537004Y-25974523D01*
X24295100Y-25974523D01*
X24174147Y-25914047D01*
X24053195Y-25793095D01*
X23992719Y-25551190D01*
X23992719Y-25127857D01*
X24053195Y-24885952D01*
X24174147Y-24765000D01*
X24295100Y-24704523D01*
X25383671Y-25974523D02*
X25383671Y-24704523D01*
X25807004Y-25611666D01*
X26230338Y-24704523D01*
X26230338Y-25974523D01*
X28528433Y-25853571D02*
X28467957Y-25914047D01*
X28286528Y-25974523D01*
X28165576Y-25974523D01*
X27984147Y-25914047D01*
X27863195Y-25793095D01*
X27802719Y-25672142D01*
X27742242Y-25430238D01*
X27742242Y-25248809D01*
X27802719Y-25006904D01*
X27863195Y-24885952D01*
X27984147Y-24765000D01*
X28165576Y-24704523D01*
X28286528Y-24704523D01*
X28467957Y-24765000D01*
X28528433Y-24825476D01*
X29314623Y-24704523D02*
X29556528Y-24704523D01*
X29677480Y-24765000D01*
X29798433Y-24885952D01*
X29858909Y-25127857D01*
X29858909Y-25551190D01*
X29798433Y-25793095D01*
X29677480Y-25914047D01*
X29556528Y-25974523D01*
X29314623Y-25974523D01*
X29193671Y-25914047D01*
X29072719Y-25793095D01*
X29012242Y-25551190D01*
X29012242Y-25127857D01*
X29072719Y-24885952D01*
X29193671Y-24765000D01*
X29314623Y-24704523D01*
X30403195Y-25974523D02*
X30403195Y-24704523D01*
X30887004Y-24704523D01*
X31007957Y-24765000D01*
X31068433Y-24825476D01*
X31128909Y-24946428D01*
X31128909Y-25127857D01*
X31068433Y-25248809D01*
X31007957Y-25309285D01*
X30887004Y-25369761D01*
X30403195Y-25369761D01*
X31673195Y-25974523D02*
X31673195Y-24704523D01*
X32157004Y-24704523D01*
X32277957Y-24765000D01*
X32338433Y-24825476D01*
X32398909Y-24946428D01*
X32398909Y-25127857D01*
X32338433Y-25248809D01*
X32277957Y-25309285D01*
X32157004Y-25369761D01*
X31673195Y-25369761D01*
X32943195Y-25309285D02*
X33366528Y-25309285D01*
X33547957Y-25974523D02*
X32943195Y-25974523D01*
X32943195Y-24704523D01*
X33547957Y-24704523D01*
X34817957Y-25974523D02*
X34394623Y-25369761D01*
X34092242Y-25974523D02*
X34092242Y-24704523D01*
X34576052Y-24704523D01*
X34697004Y-24765000D01*
X34757480Y-24825476D01*
X34817957Y-24946428D01*
X34817957Y-25127857D01*
X34757480Y-25248809D01*
X34697004Y-25309285D01*
X34576052Y-25369761D01*
X34092242Y-25369761D01*
X36692719Y-26458333D02*
X36632242Y-26397857D01*
X36511290Y-26216428D01*
X36450814Y-26095476D01*
X36390338Y-25914047D01*
X36329861Y-25611666D01*
X36329861Y-25369761D01*
X36390338Y-25067380D01*
X36450814Y-24885952D01*
X36511290Y-24765000D01*
X36632242Y-24583571D01*
X36692719Y-24523095D01*
X37599861Y-25309285D02*
X37781290Y-25369761D01*
X37841766Y-25430238D01*
X37902242Y-25551190D01*
X37902242Y-25732619D01*
X37841766Y-25853571D01*
X37781290Y-25914047D01*
X37660338Y-25974523D01*
X37176528Y-25974523D01*
X37176528Y-24704523D01*
X37599861Y-24704523D01*
X37720814Y-24765000D01*
X37781290Y-24825476D01*
X37841766Y-24946428D01*
X37841766Y-25067380D01*
X37781290Y-25188333D01*
X37720814Y-25248809D01*
X37599861Y-25309285D01*
X37176528Y-25309285D01*
X38386052Y-25611666D02*
X38990814Y-25611666D01*
X38265100Y-25974523D02*
X38688433Y-24704523D01*
X39111766Y-25974523D01*
X40260814Y-25853571D02*
X40200338Y-25914047D01*
X40018909Y-25974523D01*
X39897957Y-25974523D01*
X39716528Y-25914047D01*
X39595576Y-25793095D01*
X39535100Y-25672142D01*
X39474623Y-25430238D01*
X39474623Y-25248809D01*
X39535100Y-25006904D01*
X39595576Y-24885952D01*
X39716528Y-24765000D01*
X39897957Y-24704523D01*
X40018909Y-24704523D01*
X40200338Y-24765000D01*
X40260814Y-24825476D01*
X40805100Y-25974523D02*
X40805100Y-24704523D01*
X41530814Y-25974523D02*
X40986528Y-25248809D01*
X41530814Y-24704523D02*
X40805100Y-25430238D01*
X42075100Y-25853571D02*
X42135576Y-25914047D01*
X42075100Y-25974523D01*
X42014623Y-25914047D01*
X42075100Y-25853571D01*
X42075100Y-25974523D01*
X43345100Y-24765000D02*
X43224147Y-24704523D01*
X43042719Y-24704523D01*
X42861290Y-24765000D01*
X42740338Y-24885952D01*
X42679861Y-25006904D01*
X42619385Y-25248809D01*
X42619385Y-25430238D01*
X42679861Y-25672142D01*
X42740338Y-25793095D01*
X42861290Y-25914047D01*
X43042719Y-25974523D01*
X43163671Y-25974523D01*
X43345100Y-25914047D01*
X43405576Y-25853571D01*
X43405576Y-25430238D01*
X43163671Y-25430238D01*
X44373195Y-25309285D02*
X44554623Y-25369761D01*
X44615100Y-25430238D01*
X44675576Y-25551190D01*
X44675576Y-25732619D01*
X44615100Y-25853571D01*
X44554623Y-25914047D01*
X44433671Y-25974523D01*
X43949861Y-25974523D01*
X43949861Y-24704523D01*
X44373195Y-24704523D01*
X44494147Y-24765000D01*
X44554623Y-24825476D01*
X44615100Y-24946428D01*
X44615100Y-25067380D01*
X44554623Y-25188333D01*
X44494147Y-25248809D01*
X44373195Y-25309285D01*
X43949861Y-25309285D01*
X45945576Y-25974523D02*
X45522242Y-25369761D01*
X45219861Y-25974523D02*
X45219861Y-24704523D01*
X45703671Y-24704523D01*
X45824623Y-24765000D01*
X45885100Y-24825476D01*
X45945576Y-24946428D01*
X45945576Y-25127857D01*
X45885100Y-25248809D01*
X45824623Y-25309285D01*
X45703671Y-25369761D01*
X45219861Y-25369761D01*
X46368909Y-26458333D02*
X46429385Y-26397857D01*
X46550338Y-26216428D01*
X46610814Y-26095476D01*
X46671290Y-25914047D01*
X46731766Y-25611666D01*
X46731766Y-25369761D01*
X46671290Y-25067380D01*
X46610814Y-24885952D01*
X46550338Y-24765000D01*
X46429385Y-24583571D01*
X46368909Y-24523095D01*
D11*
X54711600Y8991600D03*
D12*
X16510000Y34493200D03*
X16510000Y31953200D03*
X19050000Y34493200D03*
X19050000Y31953200D03*
X21590000Y34493200D03*
X21590000Y31953200D03*
X24130000Y34493200D03*
X24130000Y31953200D03*
X26670000Y34493200D03*
D13*
X26670000Y31953200D03*
D14*
X27940000Y18495000D03*
X25440000Y20995000D03*
X30440000Y20995000D03*
X27940000Y23495000D03*
X25440000Y25995000D03*
X30440000Y25995000D03*
D15*
X35560000Y35560000D03*
X40640000Y35560000D03*
X40640000Y30480000D03*
X35560000Y30480000D03*
X35560000Y25400000D03*
X40640000Y25400000D03*
X60960000Y10160000D03*
X60960000Y5080000D03*
X55880000Y5080000D03*
X50800000Y5080000D03*
X50800000Y15240000D03*
X50800000Y10160000D03*
X45720000Y10160000D03*
X45720000Y15240000D03*
X45720000Y5080000D03*
X40640000Y5080000D03*
X40640000Y10160000D03*
X40640000Y15240000D03*
X35560000Y15240000D03*
X35560000Y10160000D03*
X35560000Y5080000D03*
X30480000Y5080000D03*
X30480000Y10160000D03*
X30480000Y30480000D03*
X40640000Y40640000D03*
X35560000Y40640000D03*
X58293000Y16992600D03*
X61976000Y16992600D03*
D16*
X27940000Y16814800D02*
X27940000Y18491200D01*
X27940000Y18491200D02*
X29616400Y18491200D01*
X27940000Y23495000D02*
X29616400Y23495000D01*
X30454600Y25984200D02*
X32131000Y25984200D01*
X30454600Y24307800D02*
X30454600Y25984200D01*
X30454600Y25984200D02*
X30454600Y27660600D01*
X54711600Y8991600D02*
X57429400Y8991600D01*
X54711600Y6273800D02*
X54711600Y8991600D01*
X51993800Y8991600D02*
X54711600Y8991600D01*
X27940000Y18491200D02*
X27940000Y23495000D01*
X54711600Y8991600D02*
X54711600Y11684000D01*
D17*
X54711600Y8991600D02*
X54711600Y11684000D01*
D16*
X27940000Y23495000D02*
X27940000Y25019000D01*
X27940000Y25019000D02*
X28930600Y25984200D01*
X28930600Y25984200D02*
X30454600Y25984200D01*
D18*
X57277000Y8991600D02*
X57531000Y8991600D01*
D19*
X54711600Y8991600D02*
X57277000Y8991600D01*
X51892200Y8991600D02*
X54711600Y8991600D01*
X54711600Y6172200D02*
X54711600Y8991600D01*
X54711600Y8991600D02*
X54711600Y11684000D01*
D18*
X54711600Y11684000D02*
X54711600Y11811000D01*
X27940000Y18491200D02*
X29718000Y18491200D01*
X27940000Y16713200D02*
X27940000Y18491200D01*
X27940000Y23495000D02*
X29718000Y23495000D01*
X30454600Y25984200D02*
X32232600Y25984200D01*
X30454600Y25984200D02*
X30454600Y27762200D01*
X30454600Y24206200D02*
X30454600Y25984200D01*
D17*
X58293000Y16992600D02*
X61976000Y16992600D01*
D10*
G36*
X41659800Y41604496D02*
G01*
X41659800Y24100000D01*
X41661577Y24078831D01*
X41746677Y23575431D01*
X41753213Y23551408D01*
X41764310Y23529121D01*
X41779542Y23509428D01*
X41798323Y23493085D01*
X41819931Y23480720D01*
X41843537Y23472808D01*
X41871900Y23469600D01*
X63148272Y23469600D01*
X63839800Y22877732D01*
X63839800Y5272315D01*
X62466064Y4290000D01*
X28385091Y4290000D01*
X27003800Y5518025D01*
X27003800Y7040023D01*
X52939628Y7040023D01*
X53173325Y6658281D01*
X53658090Y6403012D01*
X54183341Y6247222D01*
X54728893Y6196896D01*
X55273780Y6253969D01*
X55797063Y6416247D01*
X56249875Y6658281D01*
X56483572Y7040023D01*
X54711600Y8811995D01*
X52939628Y7040023D01*
X27003800Y7040023D01*
X27003800Y8974307D01*
X51916896Y8974307D01*
X51973969Y8429420D01*
X52136247Y7906137D01*
X52378281Y7453325D01*
X52760023Y7219628D01*
X54531995Y8991600D01*
X54891205Y8991600D01*
X56663177Y7219628D01*
X57044919Y7453325D01*
X57300188Y7938090D01*
X57455978Y8463341D01*
X57506304Y9008893D01*
X57449231Y9553780D01*
X57286953Y10077063D01*
X57044919Y10529875D01*
X56663177Y10763572D01*
X54891205Y8991600D01*
X54531995Y8991600D01*
X52760023Y10763572D01*
X52378281Y10529875D01*
X52123012Y10045110D01*
X51967222Y9519859D01*
X51916896Y8974307D01*
X27003800Y8974307D01*
X27003800Y10943177D01*
X52939628Y10943177D01*
X54711600Y9171205D01*
X56483572Y10943177D01*
X56249875Y11324919D01*
X55765110Y11580188D01*
X55239859Y11735978D01*
X54694307Y11786304D01*
X54149420Y11729231D01*
X53626137Y11566953D01*
X53173325Y11324919D01*
X52939628Y10943177D01*
X27003800Y10943177D01*
X27003800Y17015668D01*
X27010304Y16999317D01*
X27319961Y16846682D01*
X27653446Y16757390D01*
X27997942Y16734875D01*
X28340213Y16779999D01*
X28667103Y16891029D01*
X28869696Y16999317D01*
X28911803Y17105176D01*
X57150000Y17105176D01*
X57150000Y16880024D01*
X57193925Y16659199D01*
X57280087Y16451187D01*
X57405174Y16263980D01*
X57564380Y16104774D01*
X57751587Y15979687D01*
X57959599Y15893525D01*
X58180424Y15849600D01*
X58405576Y15849600D01*
X58626401Y15893525D01*
X58834413Y15979687D01*
X59021620Y16104774D01*
X59122046Y16205200D01*
X61146954Y16205200D01*
X61247380Y16104774D01*
X61434587Y15979687D01*
X61642599Y15893525D01*
X61863424Y15849600D01*
X62088576Y15849600D01*
X62309401Y15893525D01*
X62517413Y15979687D01*
X62704620Y16104774D01*
X62863826Y16263980D01*
X62988913Y16451187D01*
X63075075Y16659199D01*
X63119000Y16880024D01*
X63119000Y17105176D01*
X63075075Y17326001D01*
X62988913Y17534013D01*
X62863826Y17721220D01*
X62704620Y17880426D01*
X62517413Y18005513D01*
X62309401Y18091675D01*
X62088576Y18135600D01*
X61863424Y18135600D01*
X61642599Y18091675D01*
X61434587Y18005513D01*
X61247380Y17880426D01*
X61146954Y17780000D01*
X59122046Y17780000D01*
X59021620Y17880426D01*
X58834413Y18005513D01*
X58626401Y18091675D01*
X58405576Y18135600D01*
X58180424Y18135600D01*
X57959599Y18091675D01*
X57751587Y18005513D01*
X57564380Y17880426D01*
X57405174Y17721220D01*
X57280087Y17534013D01*
X57193925Y17326001D01*
X57150000Y17105176D01*
X28911803Y17105176D01*
X28979651Y17275744D01*
X27940000Y18315395D01*
X27925858Y18301252D01*
X27746253Y18480857D01*
X27760395Y18495000D01*
X28119605Y18495000D01*
X29159256Y17455349D01*
X29435683Y17565304D01*
X29588318Y17874961D01*
X29677610Y18208446D01*
X29700125Y18552942D01*
X29655001Y18895213D01*
X29543971Y19222103D01*
X29435683Y19424696D01*
X29159256Y19534651D01*
X28119605Y18495000D01*
X27760395Y18495000D01*
X27746253Y18509142D01*
X27925858Y18688747D01*
X27940000Y18674605D01*
X28979651Y19714256D01*
X28869696Y19990683D01*
X28560039Y20143318D01*
X28226554Y20232610D01*
X27882058Y20255125D01*
X27813000Y20246021D01*
X27813000Y21167616D01*
X28687400Y21167616D01*
X28687400Y20822384D01*
X28754752Y20483785D01*
X28886866Y20164833D01*
X29078667Y19877783D01*
X29322783Y19633667D01*
X29609833Y19441866D01*
X29928785Y19309752D01*
X30267384Y19242400D01*
X30612616Y19242400D01*
X30951215Y19309752D01*
X31270167Y19441866D01*
X31557217Y19633667D01*
X31801333Y19877783D01*
X31993134Y20164833D01*
X32125248Y20483785D01*
X32192600Y20822384D01*
X32192600Y21167616D01*
X32125248Y21506215D01*
X31993134Y21825167D01*
X31801333Y22112217D01*
X31557217Y22356333D01*
X31270167Y22548134D01*
X30951215Y22680248D01*
X30612616Y22747600D01*
X30267384Y22747600D01*
X29928785Y22680248D01*
X29609833Y22548134D01*
X29322783Y22356333D01*
X29078667Y22112217D01*
X28886866Y21825167D01*
X28754752Y21506215D01*
X28687400Y21167616D01*
X27813000Y21167616D01*
X27813000Y21746962D01*
X27997942Y21734875D01*
X28340213Y21779999D01*
X28667103Y21891029D01*
X28869696Y21999317D01*
X28979651Y22275744D01*
X27940000Y23315395D01*
X27925858Y23301252D01*
X27813000Y23414110D01*
X27813000Y23495000D01*
X28119605Y23495000D01*
X29159256Y22455349D01*
X29435683Y22565304D01*
X29588318Y22874961D01*
X29677610Y23208446D01*
X29700125Y23552942D01*
X29655001Y23895213D01*
X29543971Y24222103D01*
X29435683Y24424696D01*
X29159256Y24534651D01*
X28119605Y23495000D01*
X27813000Y23495000D01*
X27813000Y23575890D01*
X27925858Y23688747D01*
X27940000Y23674605D01*
X28979651Y24714256D01*
X28955193Y24775744D01*
X29400349Y24775744D01*
X29510304Y24499317D01*
X29819961Y24346682D01*
X30153446Y24257390D01*
X30497942Y24234875D01*
X30840213Y24279999D01*
X31167103Y24391029D01*
X31369696Y24499317D01*
X31479651Y24775744D01*
X30440000Y25815395D01*
X29400349Y24775744D01*
X28955193Y24775744D01*
X28869696Y24990683D01*
X28560039Y25143318D01*
X28468973Y25167701D01*
X28799877Y25374334D01*
X28836029Y25267897D01*
X28944317Y25065304D01*
X29220744Y24955349D01*
X30260395Y25995000D01*
X30619605Y25995000D01*
X31659256Y24955349D01*
X31935683Y25065304D01*
X32088318Y25374961D01*
X32177610Y25708446D01*
X32200125Y26052942D01*
X32155001Y26395213D01*
X32043971Y26722103D01*
X31935683Y26924696D01*
X31659256Y27034651D01*
X30619605Y25995000D01*
X30260395Y25995000D01*
X30246253Y26009142D01*
X30425858Y26188747D01*
X30440000Y26174605D01*
X31479651Y27214256D01*
X31369696Y27490683D01*
X31060039Y27643318D01*
X30726554Y27732610D01*
X30382058Y27755125D01*
X30039787Y27710001D01*
X29712897Y27598971D01*
X29633800Y27556693D01*
X29633800Y41953668D01*
X30038936Y42545000D01*
X40559905Y42545000D01*
X41659800Y41604496D01*
G37*
X41659800Y41604496D02*
X41659800Y24100000D01*
X41661577Y24078831D01*
X41746677Y23575431D01*
X41753213Y23551408D01*
X41764310Y23529121D01*
X41779542Y23509428D01*
X41798323Y23493085D01*
X41819931Y23480720D01*
X41843537Y23472808D01*
X41871900Y23469600D01*
X63148272Y23469600D01*
X63839800Y22877732D01*
X63839800Y5272315D01*
X62466064Y4290000D01*
X28385091Y4290000D01*
X27003800Y5518025D01*
X27003800Y7040023D01*
X52939628Y7040023D01*
X53173325Y6658281D01*
X53658090Y6403012D01*
X54183341Y6247222D01*
X54728893Y6196896D01*
X55273780Y6253969D01*
X55797063Y6416247D01*
X56249875Y6658281D01*
X56483572Y7040023D01*
X54711600Y8811995D01*
X52939628Y7040023D01*
X27003800Y7040023D01*
X27003800Y8974307D01*
X51916896Y8974307D01*
X51973969Y8429420D01*
X52136247Y7906137D01*
X52378281Y7453325D01*
X52760023Y7219628D01*
X54531995Y8991600D01*
X54891205Y8991600D01*
X56663177Y7219628D01*
X57044919Y7453325D01*
X57300188Y7938090D01*
X57455978Y8463341D01*
X57506304Y9008893D01*
X57449231Y9553780D01*
X57286953Y10077063D01*
X57044919Y10529875D01*
X56663177Y10763572D01*
X54891205Y8991600D01*
X54531995Y8991600D01*
X52760023Y10763572D01*
X52378281Y10529875D01*
X52123012Y10045110D01*
X51967222Y9519859D01*
X51916896Y8974307D01*
X27003800Y8974307D01*
X27003800Y10943177D01*
X52939628Y10943177D01*
X54711600Y9171205D01*
X56483572Y10943177D01*
X56249875Y11324919D01*
X55765110Y11580188D01*
X55239859Y11735978D01*
X54694307Y11786304D01*
X54149420Y11729231D01*
X53626137Y11566953D01*
X53173325Y11324919D01*
X52939628Y10943177D01*
X27003800Y10943177D01*
X27003800Y17015668D01*
X27010304Y16999317D01*
X27319961Y16846682D01*
X27653446Y16757390D01*
X27997942Y16734875D01*
X28340213Y16779999D01*
X28667103Y16891029D01*
X28869696Y16999317D01*
X28911803Y17105176D01*
X57150000Y17105176D01*
X57150000Y16880024D01*
X57193925Y16659199D01*
X57280087Y16451187D01*
X57405174Y16263980D01*
X57564380Y16104774D01*
X57751587Y15979687D01*
X57959599Y15893525D01*
X58180424Y15849600D01*
X58405576Y15849600D01*
X58626401Y15893525D01*
X58834413Y15979687D01*
X59021620Y16104774D01*
X59122046Y16205200D01*
X61146954Y16205200D01*
X61247380Y16104774D01*
X61434587Y15979687D01*
X61642599Y15893525D01*
X61863424Y15849600D01*
X62088576Y15849600D01*
X62309401Y15893525D01*
X62517413Y15979687D01*
X62704620Y16104774D01*
X62863826Y16263980D01*
X62988913Y16451187D01*
X63075075Y16659199D01*
X63119000Y16880024D01*
X63119000Y17105176D01*
X63075075Y17326001D01*
X62988913Y17534013D01*
X62863826Y17721220D01*
X62704620Y17880426D01*
X62517413Y18005513D01*
X62309401Y18091675D01*
X62088576Y18135600D01*
X61863424Y18135600D01*
X61642599Y18091675D01*
X61434587Y18005513D01*
X61247380Y17880426D01*
X61146954Y17780000D01*
X59122046Y17780000D01*
X59021620Y17880426D01*
X58834413Y18005513D01*
X58626401Y18091675D01*
X58405576Y18135600D01*
X58180424Y18135600D01*
X57959599Y18091675D01*
X57751587Y18005513D01*
X57564380Y17880426D01*
X57405174Y17721220D01*
X57280087Y17534013D01*
X57193925Y17326001D01*
X57150000Y17105176D01*
X28911803Y17105176D01*
X28979651Y17275744D01*
X27940000Y18315395D01*
X27925858Y18301252D01*
X27746253Y18480857D01*
X27760395Y18495000D01*
X28119605Y18495000D01*
X29159256Y17455349D01*
X29435683Y17565304D01*
X29588318Y17874961D01*
X29677610Y18208446D01*
X29700125Y18552942D01*
X29655001Y18895213D01*
X29543971Y19222103D01*
X29435683Y19424696D01*
X29159256Y19534651D01*
X28119605Y18495000D01*
X27760395Y18495000D01*
X27746253Y18509142D01*
X27925858Y18688747D01*
X27940000Y18674605D01*
X28979651Y19714256D01*
X28869696Y19990683D01*
X28560039Y20143318D01*
X28226554Y20232610D01*
X27882058Y20255125D01*
X27813000Y20246021D01*
X27813000Y21167616D01*
X28687400Y21167616D01*
X28687400Y20822384D01*
X28754752Y20483785D01*
X28886866Y20164833D01*
X29078667Y19877783D01*
X29322783Y19633667D01*
X29609833Y19441866D01*
X29928785Y19309752D01*
X30267384Y19242400D01*
X30612616Y19242400D01*
X30951215Y19309752D01*
X31270167Y19441866D01*
X31557217Y19633667D01*
X31801333Y19877783D01*
X31993134Y20164833D01*
X32125248Y20483785D01*
X32192600Y20822384D01*
X32192600Y21167616D01*
X32125248Y21506215D01*
X31993134Y21825167D01*
X31801333Y22112217D01*
X31557217Y22356333D01*
X31270167Y22548134D01*
X30951215Y22680248D01*
X30612616Y22747600D01*
X30267384Y22747600D01*
X29928785Y22680248D01*
X29609833Y22548134D01*
X29322783Y22356333D01*
X29078667Y22112217D01*
X28886866Y21825167D01*
X28754752Y21506215D01*
X28687400Y21167616D01*
X27813000Y21167616D01*
X27813000Y21746962D01*
X27997942Y21734875D01*
X28340213Y21779999D01*
X28667103Y21891029D01*
X28869696Y21999317D01*
X28979651Y22275744D01*
X27940000Y23315395D01*
X27925858Y23301252D01*
X27813000Y23414110D01*
X27813000Y23495000D01*
X28119605Y23495000D01*
X29159256Y22455349D01*
X29435683Y22565304D01*
X29588318Y22874961D01*
X29677610Y23208446D01*
X29700125Y23552942D01*
X29655001Y23895213D01*
X29543971Y24222103D01*
X29435683Y24424696D01*
X29159256Y24534651D01*
X28119605Y23495000D01*
X27813000Y23495000D01*
X27813000Y23575890D01*
X27925858Y23688747D01*
X27940000Y23674605D01*
X28979651Y24714256D01*
X28955193Y24775744D01*
X29400349Y24775744D01*
X29510304Y24499317D01*
X29819961Y24346682D01*
X30153446Y24257390D01*
X30497942Y24234875D01*
X30840213Y24279999D01*
X31167103Y24391029D01*
X31369696Y24499317D01*
X31479651Y24775744D01*
X30440000Y25815395D01*
X29400349Y24775744D01*
X28955193Y24775744D01*
X28869696Y24990683D01*
X28560039Y25143318D01*
X28468973Y25167701D01*
X28799877Y25374334D01*
X28836029Y25267897D01*
X28944317Y25065304D01*
X29220744Y24955349D01*
X30260395Y25995000D01*
X30619605Y25995000D01*
X31659256Y24955349D01*
X31935683Y25065304D01*
X32088318Y25374961D01*
X32177610Y25708446D01*
X32200125Y26052942D01*
X32155001Y26395213D01*
X32043971Y26722103D01*
X31935683Y26924696D01*
X31659256Y27034651D01*
X30619605Y25995000D01*
X30260395Y25995000D01*
X30246253Y26009142D01*
X30425858Y26188747D01*
X30440000Y26174605D01*
X31479651Y27214256D01*
X31369696Y27490683D01*
X31060039Y27643318D01*
X30726554Y27732610D01*
X30382058Y27755125D01*
X30039787Y27710001D01*
X29712897Y27598971D01*
X29633800Y27556693D01*
X29633800Y41953668D01*
X30038936Y42545000D01*
X40559905Y42545000D01*
X41659800Y41604496D01*
M02*
