(module uSO08_1 (layer F.Cu) (tedit 5E952EB1)
  (attr smd)
  (fp_text reference IC9 (at 0.4572 0.8001 -90 unlocked) (layer F.SilkS)
    (effects (font (size 1.033069 1.086612) (thickness 0.1778)))
  )
  (fp_text value L-BC-MSOP08 (at 0.7874 4.3307 -90 unlocked) (layer F.SilkS) hide
    (effects (font (size 1.033069 1.086612) (thickness 0.1778)))
  )
  (fp_line (start 1.4986 1.4986) (end 1.4986 -1.4986) (layer F.Fab) (width 0.0762))
  (fp_line (start -1.4986 -1.4986) (end 1.4986 -1.4986) (layer F.Fab) (width 0.0762))
  (fp_line (start -1.4986 1.4986) (end -1.4986 -1.4986) (layer F.Fab) (width 0.0762))
  (fp_line (start -1.4986 1.1938) (end -1.4986 -1.1938) (layer F.SilkS) (width 0.1778))
  (fp_line (start -1.4986 1.1938) (end -1.4478 1.1938) (layer F.SilkS) (width 0.1778))
  (fp_line (start 1.4986 1.1938) (end 1.4986 -1.1938) (layer F.SilkS) (width 0.1778))
  (fp_line (start 1.4478 -1.1938) (end 1.4986 -1.1938) (layer F.SilkS) (width 0.1778))
  (fp_line (start -1.4986 -1.1938) (end -1.4478 -1.1938) (layer F.SilkS) (width 0.1778))
  (fp_line (start 1.4478 1.1938) (end 1.4986 1.1938) (layer F.SilkS) (width 0.1778))
  (fp_circle (center -0.889 0.889) (end -0.6604 0.889) (layer F.Fab) (width 0.1))
  (pad 1 smd rect (at -0.9652 2.1336) (size 0.4064 1.524) (layers F.Cu F.Paste F.Mask))
  (pad 2 smd rect (at -0.3048 2.1336) (size 0.4064 1.524) (layers F.Cu F.Paste F.Mask))
  (pad 3 smd rect (at 0.3048 2.1336) (size 0.4064 1.524) (layers F.Cu F.Paste F.Mask))
  (pad 4 smd rect (at 0.9652 2.1336) (size 0.4064 1.524) (layers F.Cu F.Paste F.Mask))
  (pad 5 smd rect (at 0.9652 -2.1336) (size 0.4064 1.524) (layers F.Cu F.Paste F.Mask))
  (pad 6 smd rect (at 0.3048 -2.1336) (size 0.4064 1.524) (layers F.Cu F.Paste F.Mask))
  (pad 7 smd rect (at -0.3048 -2.1336) (size 0.4064 1.524) (layers F.Cu F.Paste F.Mask))
  (pad 8 smd rect (at -0.9652 -2.1336) (size 0.4064 1.524) (layers F.Cu F.Paste F.Mask))
  (model ${KISYS3DMOD}/Package_SO.3dshapes/MSOP-8_3x3mm_P0.65mm.wrl
    (at (xyz 0 0 0))
    (scale (xyz 1 1 1))
    (rotate (xyz 0 0 -90))
  )
)
