(module C0603_1b (layer F.Cu) (tedit 5E98DB31)
  (attr smd)
  (fp_text reference C13 (at 4.04 -0.038 unlocked) (layer F.SilkS)
    (effects (font (size 1.0496 1.104) (thickness 0.18)))
  )
  (fp_text value C-BC-C0603 (at 4 -0.8 unlocked) (layer F.SilkS) hide
    (effects (font (size 1.0496 1.104) (thickness 0.18)))
  )
  (fp_line (start -1.42875 -0.56441) (end -1.42875 -0.635) (layer F.SilkS) (width 0.18))
  (fp_line (start 0.9 0.4) (end 0.9 -0.4) (layer F.SilkS) (width 0.1))
  (fp_line (start -0.9 -0.4) (end 0.9 -0.4) (layer F.SilkS) (width 0.1))
  (fp_line (start -1.42875 0.635) (end -1.3837 0.635) (layer F.SilkS) (width 0.18))
  (fp_line (start 1.42875 0.635) (end 1.42875 0.56441) (layer F.SilkS) (width 0.18))
  (fp_line (start -1.42875 0.635) (end -1.42875 0.56441) (layer F.SilkS) (width 0.18))
  (fp_line (start -1.42875 -0.635) (end -1.3837 -0.635) (layer F.SilkS) (width 0.18))
  (fp_line (start 1.3837 0.635) (end 1.42875 0.635) (layer F.SilkS) (width 0.18))
  (fp_line (start -0.1163 -0.635) (end 0.1163 -0.635) (layer F.SilkS) (width 0.18))
  (fp_line (start -0.9 0.4) (end 0.9 0.4) (layer F.SilkS) (width 0.1))
  (fp_line (start -0.1163 0.635) (end 0.1163 0.635) (layer F.SilkS) (width 0.18))
  (fp_line (start 1.3837 -0.635) (end 1.42875 -0.635) (layer F.SilkS) (width 0.18))
  (fp_line (start 1.42875 -0.56441) (end 1.42875 -0.635) (layer F.SilkS) (width 0.18))
  (fp_line (start -0.9 0.4) (end -0.9 -0.4) (layer F.SilkS) (width 0.1))
  (fp_line (start 0.9 0.4) (end 0.9 -0.4) (layer F.Fab) (width 0.1))
  (fp_line (start -0.9 -0.4) (end 0.9 -0.4) (layer F.Fab) (width 0.1))
  (fp_line (start -0.9 0.4) (end 0.9 0.4) (layer F.Fab) (width 0.1))
  (fp_line (start -0.9 0.4) (end -0.9 -0.4) (layer F.Fab) (width 0.1))
  (pad 2 smd rect (at 0.75 0) (size 0.8 0.8) (layers F.Cu F.Paste F.Mask))
  (pad 1 smd rect (at -0.75 0) (size 0.8 0.8) (layers F.Cu F.Paste F.Mask))
  (model ${KISYS3DMOD}/Capacitor_SMD.3dshapes/C_0603_1608Metric.wrl
    (at (xyz 0 0 0))
    (scale (xyz 1 1 1))
    (rotate (xyz 0 0 0))
  )
)
