(module CONN_GKS-913-Z (layer F.Cu) (tedit 5E9355D7)
  (descr "GKS-913 305 230 A 1502 S")
  (tags Connector)
  (attr smd)
  (fp_text reference J** (at -4.318 3.556) (layer F.SilkS)
    (effects (font (size 1.27 1.27) (thickness 0.254)))
  )
  (fp_text value GKS-913-Z (at 8.89 1.143) (layer F.SilkS) hide
    (effects (font (size 1.27 1.27) (thickness 0.254)))
  )
  (fp_text user %R (at 0 0.29) (layer F.Fab)
    (effects (font (size 1.27 1.27) (thickness 0.254)))
  )
  (fp_line (start 0 1.27) (end 0 -1.27) (layer F.Fab) (width 0.2))
  (fp_line (start -2.54 -2.54) (end 2.54 -2.54) (layer F.SilkS) (width 0.1))
  (fp_line (start 2.54 -2.54) (end 2.54 2.54) (layer F.SilkS) (width 0.1))
  (fp_line (start 2.54 2.54) (end -2.54 2.54) (layer F.SilkS) (width 0.1))
  (fp_line (start -2.54 2.54) (end -2.54 -2.54) (layer F.SilkS) (width 0.1))
  (pad 1 thru_hole circle (at 0 0) (size 4.2926 4.2926) (drill 2.8956) (layers *.Cu *.Mask))
  (model ${KIPRJMOD}/10096510_Battery_Connection.pretty/GKS-913-Z-recenter.stp
    (at (xyz 0 0 0))
    (scale (xyz 1 1 1))
    (rotate (xyz 0 0 0))
  )
)
