(module DFN10_1 (layer F.Cu) (tedit 5E98DD42)
  (attr smd)
  (fp_text reference IC8 (at 3.08199 -0.24705 unlocked) (layer F.SilkS)
    (effects (font (size 1.0496 1.104) (thickness 0.18)))
  )
  (fp_text value L-BC-DFN10 (at 4 -0.8 unlocked) (layer F.SilkS) hide
    (effects (font (size 1.0496 1.104) (thickness 0.18)))
  )
  (fp_line (start -1.5 1.5) (end 1.5 1.5) (layer F.Fab) (width 0.1))
  (fp_line (start -1.5 -1.5) (end 1.5 -1.5) (layer F.Fab) (width 0.1))
  (fp_line (start 1.5 1.5) (end 1.5 -1.5) (layer F.Fab) (width 0.1))
  (pad 11 smd rect (at 0 0 90) (size 1.65 2.38) (layers F.Cu F.Paste F.Mask))
  (pad 10 smd rect (at -1 -1.4125) (size 0.25 0.675) (layers F.Cu F.Paste F.Mask))
  (pad 9 smd rect (at -0.5 -1.4125) (size 0.25 0.675) (layers F.Cu F.Paste F.Mask))
  (pad 8 smd rect (at 0 -1.4125) (size 0.25 0.675) (layers F.Cu F.Paste F.Mask))
  (pad 7 smd rect (at 0.5 -1.4125) (size 0.25 0.675) (layers F.Cu F.Paste F.Mask))
  (pad 6 smd rect (at 1 -1.4125) (size 0.25 0.675) (layers F.Cu F.Paste F.Mask))
  (pad 5 smd rect (at 1 1.4125) (size 0.25 0.675) (layers F.Cu F.Paste F.Mask))
  (pad 4 smd rect (at 0.5 1.4125) (size 0.25 0.675) (layers F.Cu F.Paste F.Mask))
  (pad 3 smd rect (at 0 1.4125) (size 0.25 0.675) (layers F.Cu F.Paste F.Mask))
  (pad 2 smd rect (at -0.5 1.4125) (size 0.25 0.675) (layers F.Cu F.Paste F.Mask))
  (pad 1 smd rect (at -1 1.4125) (size 0.25 0.675) (layers F.Cu F.Paste F.Mask))
  (model ${KISYS3DMOD}/Package_DFN_QFN.3dshapes/DFN-10-1EP_3x3mm_P0.5mm_EP1.55x2.48mm.wrl
    (at (xyz 0 0 0))
    (scale (xyz 1 1 1))
    (rotate (xyz 0 0 -90))
  )
)
