(module MOL43650-02C (layer F.Cu) (tedit 5E93B08C)
  (attr smd)
  (fp_text reference REF** (at -0.5588 4.5466 -180 unlocked) (layer F.SilkS)
    (effects (font (size 1.033069 1.086612) (thickness 0.127)))
  )
  (fp_text value MOL43650-02C (at -8.2677 0.7874 -180 unlocked) (layer F.SilkS) hide
    (effects (font (size 1.033069 1.086612) (thickness 0.127)))
  )
  (fp_line (start -4.826 -0.1778) (end -2.413 -0.1778) (layer F.SilkS) (width 0.1778))
  (fp_line (start 4.826 9.8044) (end 4.826 6.2992) (layer F.SilkS) (width 0.1778))
  (fp_line (start -0.5588 -0.1778) (end 0.5588 -0.1778) (layer F.SilkS) (width 0.1778))
  (fp_line (start -4.826 9.8044) (end -4.826 6.2992) (layer F.SilkS) (width 0.1778))
  (fp_line (start -0.9906 9.6012) (end -0.9906 8.1026) (layer F.SilkS) (width 0.1778))
  (fp_line (start -0.9906 9.6012) (end 0.9906 9.6012) (layer F.SilkS) (width 0.1778))
  (fp_line (start -4.826 4.0386) (end -4.826 3.175) (layer F.SilkS) (width 0.1778))
  (fp_line (start -0.9906 8.509) (end 0.9906 8.509) (layer F.SilkS) (width 0.1778))
  (fp_line (start -0.9906 8.1026) (end 0.9906 8.1026) (layer F.SilkS) (width 0.1778))
  (fp_line (start 0.9906 9.6012) (end 0.9906 8.1026) (layer F.SilkS) (width 0.1778))
  (fp_line (start -4.826 9.8044) (end 4.826 9.8044) (layer F.SilkS) (width 0.1778))
  (fp_line (start 2.413 -0.1778) (end 4.826 -0.1778) (layer F.SilkS) (width 0.1778))
  (fp_line (start 4.826 4.0386) (end 4.826 -0.1778) (layer F.SilkS) (width 0.1778))
  (fp_line (start 3.9878 -0.1778) (end 4.826 0.635) (layer F.SilkS) (width 0.1778))
  (fp_line (start -4.826 1.7018) (end -4.826 -0.1778) (layer F.SilkS) (width 0.1778))
  (fp_line (start -0.9906 9.6012) (end -0.9906 8.1026) (layer Dwgs.User) (width 0.1778))
  (fp_line (start -0.9906 9.6012) (end 0.9906 9.6012) (layer Dwgs.User) (width 0.1778))
  (fp_line (start -0.9906 8.509) (end 0.9906 8.509) (layer Dwgs.User) (width 0.1778))
  (fp_line (start -0.9906 8.1026) (end 0.9906 8.1026) (layer Dwgs.User) (width 0.1778))
  (fp_line (start 0.9906 9.6012) (end 0.9906 8.1026) (layer Dwgs.User) (width 0.1778))
  (fp_line (start -4.826 9.8044) (end 4.826 9.8044) (layer Dwgs.User) (width 0.1778))
  (fp_line (start -4.826 9.8044) (end -4.826 -0.1778) (layer Dwgs.User) (width 0.1778))
  (fp_line (start 3.9878 -0.1778) (end 4.826 0.635) (layer Dwgs.User) (width 0.1778))
  (fp_line (start -4.826 -0.1778) (end 4.826 -0.1778) (layer Dwgs.User) (width 0.1778))
  (fp_line (start 4.826 9.8044) (end 4.826 -0.1778) (layer Dwgs.User) (width 0.1778))
  (fp_line (start -6.8834 5.8674) (end -6.8834 4.4704) (layer F.Fab) (width 0.0762))
  (fp_line (start -6.8834 5.8674) (end -4.826 5.8674) (layer F.Fab) (width 0.0762))
  (fp_line (start 4.826 5.8674) (end 6.8834 5.8674) (layer F.Fab) (width 0.0762))
  (fp_line (start -6.8834 4.4704) (end -4.826 4.4704) (layer F.Fab) (width 0.0762))
  (fp_line (start -4.826 5.8674) (end -4.826 4.4704) (layer F.Fab) (width 0.0762))
  (fp_line (start -0.9906 9.6012) (end -0.9906 8.1026) (layer F.Fab) (width 0.0762))
  (fp_line (start -0.9906 9.6012) (end 0.9906 9.6012) (layer F.Fab) (width 0.0762))
  (fp_line (start -0.9906 8.509) (end 0.9906 8.509) (layer F.Fab) (width 0.0762))
  (fp_line (start -0.9906 8.1026) (end 0.9906 8.1026) (layer F.Fab) (width 0.0762))
  (fp_line (start 0.9906 9.6012) (end 0.9906 8.1026) (layer F.Fab) (width 0.0762))
  (fp_line (start -1.8796 -1.4732) (end -1.0922 -1.4732) (layer F.Fab) (width 0.0762))
  (fp_line (start -1.0922 -0.1778) (end -1.0922 -1.4732) (layer F.Fab) (width 0.0762))
  (fp_line (start -4.826 9.8044) (end 4.826 9.8044) (layer F.Fab) (width 0.0762))
  (fp_line (start -4.826 9.8044) (end -4.826 -0.1778) (layer F.Fab) (width 0.0762))
  (fp_line (start 3.9878 -0.1778) (end 4.826 0.635) (layer F.Fab) (width 0.0762))
  (fp_line (start -4.826 -0.1778) (end 4.826 -0.1778) (layer F.Fab) (width 0.0762))
  (fp_line (start 4.826 9.8044) (end 4.826 -0.1778) (layer F.Fab) (width 0.0762))
  (fp_line (start 4.826 5.8674) (end 4.826 4.4704) (layer F.Fab) (width 0.0762))
  (fp_line (start 1.0922 -1.4732) (end 1.8796 -1.4732) (layer F.Fab) (width 0.0762))
  (fp_line (start 1.8796 -0.1778) (end 1.8796 -1.4732) (layer F.Fab) (width 0.0762))
  (fp_line (start 1.0922 -0.1778) (end 1.0922 -1.4732) (layer F.Fab) (width 0.0762))
  (fp_line (start 6.8834 5.8674) (end 6.8834 4.4704) (layer F.Fab) (width 0.0762))
  (fp_line (start 4.826 4.4704) (end 6.8834 4.4704) (layer F.Fab) (width 0.0762))
  (fp_line (start -1.8796 -0.1778) (end -1.8796 -1.4732) (layer F.Fab) (width 0.0762))
  (pad 4 smd rect (at 4.9276 5.1562 90) (size 1.6764 4.2926) (layers F.Cu F.Paste F.Mask))
  (pad 3 smd rect (at -4.9276 5.1562 90) (size 1.6764 4.2926) (layers F.Cu F.Paste F.Mask))
  (pad 2 smd rect (at -1.4986 0) (size 1.27 3.4798) (layers F.Cu F.Paste F.Mask))
  (pad 1 smd rect (at 1.4986 0) (size 1.27 3.4798) (layers F.Cu F.Paste F.Mask))
  (model "${KIPRJMOD}/10096315 Blower Driver.pretty/MOLEX_43650-0213.stp"
    (at (xyz 0 0 0))
    (scale (xyz 1 1 1))
    (rotate (xyz 0 0 0))
  )
)
