(module LQFP48-PAD0.28X1.2_1 (layer F.Cu) (tedit 5E952297)
  (attr smd)
  (fp_text reference IC4 (at -0.4714 -0.8079 -270 unlocked) (layer F.SilkS)
    (effects (font (size 1.0496 1.104) (thickness 0.18)))
  )
  (fp_text value L-BC-LQFP48 (at -0.8 -4.4 -270 unlocked) (layer F.SilkS) hide
    (effects (font (size 1.0496 1.104) (thickness 0.18)))
  )
  (fp_line (start -4.5 -1.25) (end -3.5 -1.25) (layer F.Fab) (width 0.1))
  (fp_line (start -2.75 -3.5) (end -2.75 -4.5) (layer F.Fab) (width 0.1))
  (fp_line (start 1.25 4.5) (end 1.25 3.5) (layer F.Fab) (width 0.1))
  (fp_line (start 3.5 2.25) (end 4.5 2.25) (layer F.Fab) (width 0.1))
  (fp_line (start -4.5 -0.75) (end -3.5 -0.75) (layer F.Fab) (width 0.1))
  (fp_line (start -2.25 -3.5) (end -2.25 -4.5) (layer F.Fab) (width 0.1))
  (fp_line (start 0.75 4.5) (end 0.75 3.5) (layer F.Fab) (width 0.1))
  (fp_line (start 3.5 1.75) (end 4.5 1.75) (layer F.Fab) (width 0.1))
  (fp_line (start -4.5 -0.25) (end -3.5 -0.25) (layer F.Fab) (width 0.1))
  (fp_line (start -1.75 -3.5) (end -1.75 -4.5) (layer F.Fab) (width 0.1))
  (fp_line (start 0.25 4.5) (end 0.25 3.5) (layer F.Fab) (width 0.1))
  (fp_line (start 3.5 1.25) (end 4.5 1.25) (layer F.Fab) (width 0.1))
  (fp_line (start -4.5 0.25) (end -3.5 0.25) (layer F.Fab) (width 0.1))
  (fp_line (start -1.25 -3.5) (end -1.25 -4.5) (layer F.Fab) (width 0.1))
  (fp_line (start -0.25 4.5) (end -0.25 3.5) (layer F.Fab) (width 0.1))
  (fp_line (start 3.5 0.75) (end 4.5 0.75) (layer F.Fab) (width 0.1))
  (fp_line (start -4.5 0.75) (end -3.5 0.75) (layer F.Fab) (width 0.1))
  (fp_line (start -0.75 -3.5) (end -0.75 -4.5) (layer F.Fab) (width 0.1))
  (fp_line (start -0.75 4.5) (end -0.75 3.5) (layer F.Fab) (width 0.1))
  (fp_line (start 3.25 3.5) (end 3.5 3.25) (layer F.Fab) (width 0.1))
  (fp_line (start -4.5 -2.75) (end -3.5 -2.75) (layer F.Fab) (width 0.1))
  (fp_line (start 3.5 0.25) (end 4.5 0.25) (layer F.Fab) (width 0.1))
  (fp_line (start -4.5 1.25) (end -3.5 1.25) (layer F.Fab) (width 0.1))
  (fp_line (start -0.25 -3.5) (end -0.25 -4.5) (layer F.Fab) (width 0.1))
  (fp_line (start -1.25 4.5) (end -1.25 3.5) (layer F.Fab) (width 0.1))
  (fp_line (start 3.5 -0.25) (end 4.5 -0.25) (layer F.Fab) (width 0.1))
  (fp_line (start -4.5 1.75) (end -3.5 1.75) (layer F.Fab) (width 0.1))
  (fp_line (start 0.25 -3.5) (end 0.25 -4.5) (layer F.Fab) (width 0.1))
  (fp_line (start -1.75 4.5) (end -1.75 3.5) (layer F.Fab) (width 0.1))
  (fp_line (start 3.5 -0.75) (end 4.5 -0.75) (layer F.Fab) (width 0.1))
  (fp_line (start -4.5 2.25) (end -3.5 2.25) (layer F.Fab) (width 0.1))
  (fp_line (start 0.75 -3.5) (end 0.75 -4.5) (layer F.Fab) (width 0.1))
  (fp_line (start -2.25 4.5) (end -2.25 3.5) (layer F.Fab) (width 0.1))
  (fp_line (start 3.5 -1.25) (end 4.5 -1.25) (layer F.Fab) (width 0.1))
  (fp_line (start 1.25 -3.5) (end 1.25 -4.5) (layer F.Fab) (width 0.1))
  (fp_line (start -4.5 2.75) (end -3.5 2.75) (layer F.Fab) (width 0.1))
  (fp_line (start -2.75 4.5) (end -2.75 3.5) (layer F.Fab) (width 0.1))
  (fp_line (start -3.5 3) (end -3 3.5) (layer F.Fab) (width 0.1))
  (fp_line (start -3.5 -3.25) (end -3.25 -3.5) (layer F.Fab) (width 0.1))
  (fp_line (start 3.5 3.25) (end 3.5 -3.25) (layer F.Fab) (width 0.1))
  (fp_line (start -3.5 3) (end -3.5 -3.25) (layer F.Fab) (width 0.1))
  (fp_line (start -3 3.5) (end 3.25 3.5) (layer F.Fab) (width 0.1))
  (fp_line (start 3.5 -1.75) (end 4.5 -1.75) (layer F.Fab) (width 0.1))
  (fp_line (start -3.25 -3.5) (end 3.25 -3.5) (layer F.Fab) (width 0.1))
  (fp_line (start 2.75 4.5) (end 2.75 3.5) (layer F.Fab) (width 0.1))
  (fp_line (start 1.75 -3.5) (end 1.75 -4.5) (layer F.Fab) (width 0.1))
  (fp_line (start 3.5 -2.25) (end 4.5 -2.25) (layer F.Fab) (width 0.1))
  (fp_line (start 2.25 -3.5) (end 2.25 -4.5) (layer F.Fab) (width 0.1))
  (fp_line (start 3.25 -3.5) (end 3.5 -3.25) (layer F.Fab) (width 0.1))
  (fp_line (start 3.5 -2.75) (end 4.5 -2.75) (layer F.Fab) (width 0.1))
  (fp_line (start 2.75 -3.5) (end 2.75 -4.5) (layer F.Fab) (width 0.1))
  (fp_line (start -4.5 -2.25) (end -3.5 -2.25) (layer F.Fab) (width 0.1))
  (fp_line (start 2.25 4.5) (end 2.25 3.5) (layer F.Fab) (width 0.1))
  (fp_line (start -4.5 -1.75) (end -3.5 -1.75) (layer F.Fab) (width 0.1))
  (fp_line (start 1.75 4.5) (end 1.75 3.5) (layer F.Fab) (width 0.1))
  (fp_line (start 3.5 2.75) (end 4.5 2.75) (layer F.Fab) (width 0.1))
  (fp_line (start 3.12077 3.5) (end 3.25 3.5) (layer F.SilkS) (width 0.18))
  (fp_line (start -3.5 -3.12077) (end -3.5 -3.25) (layer F.SilkS) (width 0.18))
  (fp_line (start -3.43305 3.06695) (end -3.06695 3.43305) (layer F.SilkS) (width 0.18))
  (fp_line (start 3.25 3.5) (end 3.5 3.25) (layer F.SilkS) (width 0.18))
  (fp_line (start 3.5 -3.12077) (end 3.5 -3.25) (layer F.SilkS) (width 0.18))
  (fp_line (start 3.12077 -3.5) (end 3.25 -3.5) (layer F.SilkS) (width 0.18))
  (fp_line (start 3.25 -3.5) (end 3.5 -3.25) (layer F.SilkS) (width 0.18))
  (fp_line (start 3.5 3.25) (end 3.5 3.12077) (layer F.SilkS) (width 0.18))
  (fp_line (start -3.5 -3.25) (end -3.25 -3.5) (layer F.SilkS) (width 0.18))
  (fp_line (start -3.25 -3.5) (end -3.12077 -3.5) (layer F.SilkS) (width 0.18))
  (fp_circle (center -2.49999 2.49999) (end -2 2.49999) (layer F.Fab) (width 0.1))
  (fp_arc (start -2.49999 2.49999) (end -2.448595 2.002649) (angle -255.8) (layer F.SilkS) (width 0.18))
  (pad 1 smd rect (at -2.75 4.25) (size 0.28 1.2) (layers F.Cu F.Paste F.Mask))
  (pad 2 smd rect (at -2.25 4.25) (size 0.28 1.2) (layers F.Cu F.Paste F.Mask))
  (pad 3 smd rect (at -1.75 4.25) (size 0.28 1.2) (layers F.Cu F.Paste F.Mask))
  (pad 4 smd rect (at -1.25 4.25) (size 0.28 1.2) (layers F.Cu F.Paste F.Mask))
  (pad 5 smd rect (at -0.75 4.25) (size 0.28 1.2) (layers F.Cu F.Paste F.Mask))
  (pad 6 smd rect (at -0.25 4.25) (size 0.28 1.2) (layers F.Cu F.Paste F.Mask))
  (pad 7 smd rect (at 0.25 4.25) (size 0.28 1.2) (layers F.Cu F.Paste F.Mask))
  (pad 8 smd rect (at 0.75 4.25) (size 0.28 1.2) (layers F.Cu F.Paste F.Mask))
  (pad 9 smd rect (at 1.25 4.25) (size 0.28 1.2) (layers F.Cu F.Paste F.Mask))
  (pad 10 smd rect (at 1.75 4.25) (size 0.28 1.2) (layers F.Cu F.Paste F.Mask))
  (pad 11 smd rect (at 2.25 4.25) (size 0.28 1.2) (layers F.Cu F.Paste F.Mask))
  (pad 12 smd rect (at 2.75 4.25) (size 0.28 1.2) (layers F.Cu F.Paste F.Mask))
  (pad 13 smd rect (at 4.25 2.75 90) (size 0.28 1.2) (layers F.Cu F.Paste F.Mask))
  (pad 14 smd rect (at 4.25 2.25 90) (size 0.28 1.2) (layers F.Cu F.Paste F.Mask))
  (pad 15 smd rect (at 4.25 1.75 90) (size 0.28 1.2) (layers F.Cu F.Paste F.Mask))
  (pad 16 smd rect (at 4.25 1.25 90) (size 0.28 1.2) (layers F.Cu F.Paste F.Mask))
  (pad 17 smd rect (at 4.25 0.75 90) (size 0.28 1.2) (layers F.Cu F.Paste F.Mask))
  (pad 18 smd rect (at 4.25 0.25 90) (size 0.28 1.2) (layers F.Cu F.Paste F.Mask))
  (pad 19 smd rect (at 4.25 -0.25 90) (size 0.28 1.2) (layers F.Cu F.Paste F.Mask))
  (pad 20 smd rect (at 4.25 -0.75 90) (size 0.28 1.2) (layers F.Cu F.Paste F.Mask))
  (pad 21 smd rect (at 4.25 -1.25 90) (size 0.28 1.2) (layers F.Cu F.Paste F.Mask))
  (pad 22 smd rect (at 4.25 -1.75 90) (size 0.28 1.2) (layers F.Cu F.Paste F.Mask))
  (pad 23 smd rect (at 4.25 -2.25 90) (size 0.28 1.2) (layers F.Cu F.Paste F.Mask))
  (pad 24 smd rect (at 4.25 -2.75 90) (size 0.28 1.2) (layers F.Cu F.Paste F.Mask))
  (pad 25 smd rect (at 2.75 -4.25) (size 0.28 1.2) (layers F.Cu F.Paste F.Mask))
  (pad 26 smd rect (at 2.25 -4.25) (size 0.28 1.2) (layers F.Cu F.Paste F.Mask))
  (pad 27 smd rect (at 1.75 -4.25) (size 0.28 1.2) (layers F.Cu F.Paste F.Mask))
  (pad 28 smd rect (at 1.25 -4.25) (size 0.28 1.2) (layers F.Cu F.Paste F.Mask))
  (pad 29 smd rect (at 0.75 -4.25) (size 0.28 1.2) (layers F.Cu F.Paste F.Mask))
  (pad 30 smd rect (at 0.25 -4.25) (size 0.28 1.2) (layers F.Cu F.Paste F.Mask))
  (pad 31 smd rect (at -0.25 -4.25) (size 0.28 1.2) (layers F.Cu F.Paste F.Mask))
  (pad 32 smd rect (at -0.75 -4.25) (size 0.28 1.2) (layers F.Cu F.Paste F.Mask))
  (pad 33 smd rect (at -1.25 -4.25) (size 0.28 1.2) (layers F.Cu F.Paste F.Mask))
  (pad 34 smd rect (at -1.75 -4.25) (size 0.28 1.2) (layers F.Cu F.Paste F.Mask))
  (pad 35 smd rect (at -2.25 -4.25) (size 0.28 1.2) (layers F.Cu F.Paste F.Mask))
  (pad 36 smd rect (at -2.75 -4.25) (size 0.28 1.2) (layers F.Cu F.Paste F.Mask))
  (pad 37 smd rect (at -4.25 -2.75 90) (size 0.28 1.2) (layers F.Cu F.Paste F.Mask))
  (pad 38 smd rect (at -4.25 -2.25 90) (size 0.28 1.2) (layers F.Cu F.Paste F.Mask))
  (pad 39 smd rect (at -4.25 -1.75 90) (size 0.28 1.2) (layers F.Cu F.Paste F.Mask))
  (pad 40 smd rect (at -4.25 -1.25 90) (size 0.28 1.2) (layers F.Cu F.Paste F.Mask))
  (pad 41 smd rect (at -4.25 -0.75 90) (size 0.28 1.2) (layers F.Cu F.Paste F.Mask))
  (pad 42 smd rect (at -4.25 -0.25 90) (size 0.28 1.2) (layers F.Cu F.Paste F.Mask))
  (pad 43 smd rect (at -4.25 0.25 90) (size 0.28 1.2) (layers F.Cu F.Paste F.Mask))
  (pad 44 smd rect (at -4.25 0.75 90) (size 0.28 1.2) (layers F.Cu F.Paste F.Mask))
  (pad 45 smd rect (at -4.25 1.25 90) (size 0.28 1.2) (layers F.Cu F.Paste F.Mask))
  (pad 46 smd rect (at -4.25 1.75 90) (size 0.28 1.2) (layers F.Cu F.Paste F.Mask))
  (pad 47 smd rect (at -4.25 2.25 90) (size 0.28 1.2) (layers F.Cu F.Paste F.Mask))
  (pad 48 smd rect (at -4.25 2.75 90) (size 0.28 1.2) (layers F.Cu F.Paste F.Mask))
  (model ${KISYS3DMOD}/Package_QFP.3dshapes/LQFP-48_7x7mm_P0.5mm.wrl
    (at (xyz 0 0 0))
    (scale (xyz 1 1 1))
    (rotate (xyz 0 0 -90))
  )
)
