EESchema Schematic File Version 4
EELAYER 30 0
EELAYER END
$Descr User 17335 11946
encoding utf-8
Sheet 7 8
Title "RB0505 CPU Board"
Date "2020-04-15"
Rev ""
Comp ""
Comment1 ""
Comment2 ""
Comment3 ""
Comment4 ""
$EndDescr
Wire Wire Line
	2925 10725 2925 10700
Wire Wire Line
	2925 10700 2825 10700
Wire Wire Line
	2825 10700 2625 10700
Wire Wire Line
	2925 10700 3025 10700
Wire Wire Line
	3025 10700 3225 10700
Wire Wire Line
	3225 10700 3475 10700
Wire Wire Line
	3475 10700 3675 10700
Wire Wire Line
	3675 10700 3875 10700
Wire Wire Line
	3875 10700 4075 10700
Connection ~ 2825 10700
Connection ~ 2925 10700
Connection ~ 3025 10700
Connection ~ 3225 10700
Connection ~ 3475 10700
Connection ~ 3675 10700
Connection ~ 3875 10700
Wire Wire Line
	6675 9700 6675 9725
Text HLabel 6675 3000 2    56   Input ~ 0
LED-O2
Text HLabel 6525 4025 2    56   Input ~ 0
LED-AL-R
Text HLabel 6525 4550 2    56   Input ~ 0
LED-AL-O
Text HLabel 3275 1825 2    56   Input ~ 0
COM1
Text HLabel 3275 2025 2    56   Input ~ 0
COM2
Text HLabel 3275 2425 2    56   Input ~ 0
COM3
Text HLabel 3275 2225 2    56   Output ~ 0
KEY-1
Text HLabel 3275 2625 2    56   Output ~ 0
KEY-2
Text HLabel 6525 3500 2    56   Input ~ 0
LED-VENTIL
Text HLabel 12000 2375 3    56   Output ~ 0
BUSY-AFF
Text HLabel 13600 2425 3    56   Input ~ 0
RD\
Text HLabel 14200 2375 3    56   Input ~ 0
WR\
Text HLabel 14400 2375 3    56   Input ~ 0
CS4\
Text HLabel 3275 5425 2    56   Output ~ 0
ALARM-INHIB
Text HLabel 3275 5625 2    56   Output ~ 0
INHIB-STOP-INV
Connection ~ 3675 8375
Text HLabel 7825 8200 2    56   Output ~ 0
RXD1
Text HLabel 8400 4350 0    50   Output ~ 0
RX-UART-ST
Text Label 8400 4550 2    50   ~ 0
LED-PRESENCE-DC
Text Label 3225 5025 0    56   ~ 0
LED-PRESENCE-DC
Text HLabel 8400 4850 0    50   Input ~ 0
CE-SPI-USB
Text HLabel 8400 4950 0    50   Input ~ 0
CE-SPI-PIC
Text HLabel 8400 4750 0    50   Output ~ 0
USB-BUSY
Text HLabel 14825 4750 2    56   Input ~ 0
RESET_USB
Text HLabel 14825 4550 2    56   Output ~ 0
LED_PRESENCE_AC
Text HLabel 6225 5150 2    56   Input ~ 0
LED_PRESENCE_AC
Text Label 6475 2100 0    56   ~ 0
LED_BAT
Text Label 14825 4450 0    56   ~ 0
LED_BAT
Text HLabel 14825 4350 2    56   Input ~ 0
TX_UART_ST
Text HLabel 14825 4250 2    56   Output ~ 0
RTS_UART_ST
Wire Wire Line
	3537 4825 4525 4825
Text HLabel 8400 4650 0    50   Output ~ 0
VBAT
Wire Wire Line
	4800 9775 2625 9775
Connection ~ 2625 9775
Text Label 3950 9775 0    50   ~ 0
PHOTO-DIODE-SIGNAL
Text Label 3950 8775 0    50   ~ 0
LED-DRIVE-LINE1
Connection ~ 3225 8975
Text Label 3950 8975 0    50   ~ 0
LED-DRIVE-LINE2
Connection ~ 3025 9175
Text Label 3950 9175 0    50   ~ 0
SENSOR-TYPE-LINE
Wire Wire Line
	2825 9375 4800 9375
Connection ~ 2825 9375
Text Label 3950 9375 0    50   ~ 0
PHOTO-DIODE-BIAS
Text Label 3950 9575 0    50   ~ 0
SIGNAL-SHIELD
Wire Wire Line
	5925 7475 6675 7475
Connection ~ 5925 7475
Wire Wire Line
	3875 7475 4800 7475
Wire Wire Line
	3875 7775 3875 7475
Connection ~ 3875 7775
Text Label 3950 9975 0    50   ~ 0
CABLE-SHIELD
Text HLabel 14825 4650 2    56   Output ~ 0
+5VSUPPLY-BOARD
Text HLabel 3287 4625 2    56   Input ~ 0
+5VSUPPLY-BOARD
Text HLabel 3275 3225 2    56   Input ~ 0
+5VSUPPLY-BOARD
Text HLabel 8400 4250 0    50   Input ~ 0
MTSR-SPI-1
Text HLabel 8400 4450 0    50   Output ~ 0
MRST-SPI-1
Text HLabel 14825 4850 2    56   Output ~ 0
MRST_SPI_0
Text HLabel 14825 4950 2    56   Input ~ 0
MTSR-SPI-0
Text HLabel 14825 5050 2    56   Input ~ 0
SCLK_SPI_1
Text HLabel 8400 5050 0    50   Input ~ 0
SCLK-SPI-0
$Comp
L cpu-board:R0805 R13
U 1 1 486842E0
P 3350 4025
F 0 "R13" H 3075 4112 64  0000 L BNN
F 1 "620" H 3075 4037 42  0000 L BNN
F 2 "AllModules:R0805_1" H 3350 4025 50  0001 C CNN
F 3 "" H 3350 4025 50  0001 C CNN
F 4 "RESISTOR, 620 OHM, 0.125W,+/-5%,0805" H 3350 4025 50  0001 C CNN "Description"
F 5 "10023190" H 3350 4025 50  0001 C CNN "Item Number"
F 6 "MULTICOMP                       (920630)" H 3350 4025 50  0001 C CNN "Manufacturer"
F 7 "MC 0.1W 0805 5% 620R" H 3350 4025 50  0001 C CNN "Manufacturer_No"
F 8 "THICK FILM CHIP RESISTOR" H 3350 4025 50  0001 C CNN "Manufacturer_Desc"
	1    3350 4025
	1    0    0    -1  
$EndComp
$Comp
L cpu-board:R1206 R16
U 1 1 BF9499E8
P 3350 3625
F 0 "R16" H 3250 3712 64  0000 R BNN
F 1 "150" H 3075 3637 42  0000 L BNN
F 2 "AllModules:R0805_1" H 3350 3625 50  0001 C CNN
F 3 "" H 3350 3625 50  0001 C CNN
F 4 "RESISTOR, 150 OHM, 0805, +/-5%" H 3350 3625 50  0001 C CNN "Description"
F 5 "10023237" H 3350 3625 50  0001 C CNN "Item Number"
F 6 "YAGEO_RMS1" H 3350 3625 50  0001 C CNN "Manufacturer"
F 7 "232273061151" H 3350 3625 50  0001 C CNN "Manufacturer_No"
F 8 "RESISTOR, METAL GLAZE/THICK FILM, 0.125 W, 5 %, 100 PPM, 150 OHM, SURFACE MOUNT, 0805" H 3350 3625 50  0001 C CNN "Manufacturer_Desc"
F 9 "YAGEO_RMS1" H 3350 3625 50  0001 C CNN "Manufacturer2"
F 10 "232273061151L" H 3350 3625 50  0001 C CNN "Manufacturer_No2"
F 11 "RESISTOR, METAL GLAZE/THICK FILM, 0.125 W, 5 %, 100 PPM, 150 OHM, SURFACE MOUNT, 0805" H 3350 3625 50  0001 C CNN "Manufacturer_Desc2"
F 12 "ASJ" H 3350 3625 50  0001 C CNN "Manufacturer3"
F 13 "CR21-151JL" H 3350 3625 50  0001 C CNN "Manufacturer_No3"
F 14 "THICK FILM CHIP RESISTOR" H 3350 3625 50  0001 C CNN "Manufacturer_Desc3"
F 15 "YAGEO_RMS1" H 3350 3625 50  0001 C CNN "Manufacturer4"
F 16 "RC0805JR-07150RL" H 3350 3625 50  0001 C CNN "Manufacturer_No4"
F 17 "RESISTOR, METAL GLAZE/THICK FILM, 0.125 W, 5 %, 100 PPM, 150 OHM, SURFACE MOUNT, 0805" H 3350 3625 50  0001 C CNN "Manufacturer_Desc4"
	1    3350 3625
	1    0    0    -1  
$EndComp
$Comp
L cpu-board:IRLML2803 T4
U 1 1 4AEDAEDD
P 5700 2950
F 0 "T4" H 5625 3200 64  0000 L BNN
F 1 "2N7002" H 5400 3125 59  0000 L BNN
F 2 "AllModules:SOT23-GSD_1" H 5700 2950 50  0001 C CNN
F 3 "" H 5700 2950 50  0001 C CNN
F 4 "TRANSISTOR MOSFET N CHANNEL 60V, 0.18A" H 5700 2950 50  0001 C CNN "Description"
F 5 "10097274" H 5700 2950 50  0001 C CNN "Item Number"
F 6 "ON SEMICONDUCTOR_RMS1" H 5700 2950 50  0001 C CNN "Manufacturer"
F 7 "2N7002LT1G" H 5700 2950 50  0001 C CNN "Manufacturer_No"
F 8 "SMALL SIGNAL MOSFET" H 5700 2950 50  0001 C CNN "Manufacturer_Desc"
F 9 "NXP SEMICONDUCTORS_RMS1" H 5700 2950 50  0001 C CNN "Manufacturer2"
F 10 "2N7002,215" H 5700 2950 50  0001 C CNN "Manufacturer_No2"
F 11 "" H 5700 2950 50  0001 C CNN "Manufacturer_Desc2"
F 12 "NXP SEMICONDUCTORS_RMS1" H 5700 2950 50  0001 C CNN "Manufacturer3"
F 13 "2N7002" H 5700 2950 50  0001 C CNN "Manufacturer_No3"
F 14 "N-CHANNEL TRENCHMOS FET" H 5700 2950 50  0001 C CNN "Manufacturer_Desc3"
	1    5700 2950
	-1   0    0    -1  
$EndComp
$Comp
L cpu-board:GND #U$035
U 1 1 B9D1E2C2
P 5600 3350
F 0 "#U$035" H 5600 3350 50  0001 C CNN
F 1 "GND" H 5513 3263 59  0000 L BNN
F 2 "" H 5600 3350 50  0001 C CNN
F 3 "" H 5600 3350 50  0001 C CNN
	1    5600 3350
	1    0    0    -1  
$EndComp
$Comp
L cpu-board:R0805 R20
U 1 1 9FEA229A
P 5875 3200
F 0 "R20" H 5950 3338 64  0000 R TNN
F 1 "100k" H 5975 3425 42  0000 R TNN
F 2 "AllModules:R0603_1" H 5875 3200 50  0001 C CNN
F 3 "" H 5875 3200 50  0001 C CNN
F 4 "RESISTOR,100 K OHM, 0.063W +/-5%" H 5875 3200 50  0001 C CNN "Description"
F 5 "10022732" H 5875 3200 50  0001 C CNN "Item Number"
F 6 "YAGEO_RMS1" H 5875 3200 50  0001 C CNN "Manufacturer"
F 7 "232270260104L" H 5875 3200 50  0001 C CNN "Manufacturer_No"
F 8 "RESISTOR, METAL GLAZE/THICK FILM, 0.1 W, 5 %, 100 PPM, 100000 OHM, SURFACE MOUNT, 0603" H 5875 3200 50  0001 C CNN "Manufacturer_Desc"
F 9 "YAGEO_RMS1" H 5875 3200 50  0001 C CNN "Manufacturer2"
F 10 "232270260104" H 5875 3200 50  0001 C CNN "Manufacturer_No2"
F 11 "RESISTOR, METAL GLAZE/THICK FILM, 0.1 W, 5 %, 100 PPM, 100000 OHM, SURFACE MOUNT, 0603" H 5875 3200 50  0001 C CNN "Manufacturer_Desc2"
F 12 "YAGEO_RMS1" H 5875 3200 50  0001 C CNN "Manufacturer3"
F 13 "RC0603JR-07100KL" H 5875 3200 50  0001 C CNN "Manufacturer_No3"
F 14 "RESISTOR, METAL GLAZE/THICK FILM, 0.1 W, 5 %, 100 PPM, 100000 OHM, SURFACE MOUNT, 0603" H 5875 3200 50  0001 C CNN "Manufacturer_Desc3"
F 15 "PANASONIC_RMS1" H 5875 3200 50  0001 C CNN "Manufacturer4"
F 16 "ERJ3GEYJ104V" H 5875 3200 50  0001 C CNN "Manufacturer_No4"
F 17 "THICK FILM CHIP RESISTOR" H 5875 3200 50  0001 C CNN "Manufacturer_Desc4"
	1    5875 3200
	-1   0    0    1   
$EndComp
$Comp
L cpu-board:IRLML2803 T5
U 1 1 58A3FA22
P 5975 3975
F 0 "T5" H 5925 4225 64  0000 L BNN
F 1 "2N7002" H 5700 4150 59  0000 L BNN
F 2 "AllModules:SOT23-GSD_1" H 5975 3975 50  0001 C CNN
F 3 "" H 5975 3975 50  0001 C CNN
F 4 "TRANSISTOR MOSFET N CHANNEL 60V, 0.18A" H 5975 3975 50  0001 C CNN "Description"
F 5 "10097274" H 5975 3975 50  0001 C CNN "Item Number"
F 6 "ON SEMICONDUCTOR_RMS1" H 5975 3975 50  0001 C CNN "Manufacturer"
F 7 "2N7002LT1G" H 5975 3975 50  0001 C CNN "Manufacturer_No"
F 8 "SMALL SIGNAL MOSFET" H 5975 3975 50  0001 C CNN "Manufacturer_Desc"
F 9 "NXP SEMICONDUCTORS_RMS1" H 5975 3975 50  0001 C CNN "Manufacturer2"
F 10 "2N7002,215" H 5975 3975 50  0001 C CNN "Manufacturer_No2"
F 11 "" H 5975 3975 50  0001 C CNN "Manufacturer_Desc2"
F 12 "NXP SEMICONDUCTORS_RMS1" H 5975 3975 50  0001 C CNN "Manufacturer3"
F 13 "2N7002" H 5975 3975 50  0001 C CNN "Manufacturer_No3"
F 14 "N-CHANNEL TRENCHMOS FET" H 5975 3975 50  0001 C CNN "Manufacturer_Desc3"
	1    5975 3975
	-1   0    0    -1  
$EndComp
$Comp
L cpu-board:GND #U$087
U 1 1 EC139480
P 5875 4375
F 0 "#U$087" H 5875 4375 50  0001 C CNN
F 1 "GND" H 5787 4287 59  0000 L BNN
F 2 "" H 5875 4375 50  0001 C CNN
F 3 "" H 5875 4375 50  0001 C CNN
	1    5875 4375
	1    0    0    -1  
$EndComp
$Comp
L cpu-board:R0805 R21
U 1 1 F84F2443
P 6150 4225
F 0 "R21" H 6050 4300 64  0000 L BNN
F 1 "100k" H 6050 4387 42  0000 L BNN
F 2 "AllModules:R0603_1" H 6150 4225 50  0001 C CNN
F 3 "" H 6150 4225 50  0001 C CNN
F 4 "RESISTOR,100 K OHM, 0.063W +/-5%" H 6150 4225 50  0001 C CNN "Description"
F 5 "10022732" H 6150 4225 50  0001 C CNN "Item Number"
F 6 "YAGEO_RMS1" H 6150 4225 50  0001 C CNN "Manufacturer"
F 7 "232270260104L" H 6150 4225 50  0001 C CNN "Manufacturer_No"
F 8 "RESISTOR, METAL GLAZE/THICK FILM, 0.1 W, 5 %, 100 PPM, 100000 OHM, SURFACE MOUNT, 0603" H 6150 4225 50  0001 C CNN "Manufacturer_Desc"
F 9 "YAGEO_RMS1" H 6150 4225 50  0001 C CNN "Manufacturer2"
F 10 "232270260104" H 6150 4225 50  0001 C CNN "Manufacturer_No2"
F 11 "RESISTOR, METAL GLAZE/THICK FILM, 0.1 W, 5 %, 100 PPM, 100000 OHM, SURFACE MOUNT, 0603" H 6150 4225 50  0001 C CNN "Manufacturer_Desc2"
F 12 "YAGEO_RMS1" H 6150 4225 50  0001 C CNN "Manufacturer3"
F 13 "RC0603JR-07100KL" H 6150 4225 50  0001 C CNN "Manufacturer_No3"
F 14 "RESISTOR, METAL GLAZE/THICK FILM, 0.1 W, 5 %, 100 PPM, 100000 OHM, SURFACE MOUNT, 0603" H 6150 4225 50  0001 C CNN "Manufacturer_Desc3"
F 15 "PANASONIC_RMS1" H 6150 4225 50  0001 C CNN "Manufacturer4"
F 16 "ERJ3GEYJ104V" H 6150 4225 50  0001 C CNN "Manufacturer_No4"
F 17 "THICK FILM CHIP RESISTOR" H 6150 4225 50  0001 C CNN "Manufacturer_Desc4"
	1    6150 4225
	-1   0    0    1   
$EndComp
$Comp
L cpu-board:IRLML2803@2 T8
U 1 1 39E804CC
P 5200 4500
F 0 "T8" H 5150 4750 64  0000 L BNN
F 1 "2N7002" H 4925 4675 59  0000 L BNN
F 2 "AllModules:SOT23-GSD_1" H 5200 4500 50  0001 C CNN
F 3 "" H 5200 4500 50  0001 C CNN
F 4 "TRANSISTOR MOSFET N CHANNEL 60V, 0.18A" H 5200 4500 50  0001 C CNN "Description"
F 5 "10097274" H 5200 4500 50  0001 C CNN "Item Number"
F 6 "ON SEMICONDUCTOR_RMS1" H 5200 4500 50  0001 C CNN "Manufacturer"
F 7 "2N7002LT1G" H 5200 4500 50  0001 C CNN "Manufacturer_No"
F 8 "SMALL SIGNAL MOSFET" H 5200 4500 50  0001 C CNN "Manufacturer_Desc"
F 9 "NXP SEMICONDUCTORS_RMS1" H 5200 4500 50  0001 C CNN "Manufacturer2"
F 10 "2N7002,215" H 5200 4500 50  0001 C CNN "Manufacturer_No2"
F 11 "" H 5200 4500 50  0001 C CNN "Manufacturer_Desc2"
F 12 "NXP SEMICONDUCTORS_RMS1" H 5200 4500 50  0001 C CNN "Manufacturer3"
F 13 "2N7002" H 5200 4500 50  0001 C CNN "Manufacturer_No3"
F 14 "N-CHANNEL TRENCHMOS FET" H 5200 4500 50  0001 C CNN "Manufacturer_Desc3"
	1    5200 4500
	-1   0    0    -1  
$EndComp
$Comp
L cpu-board:R0805 R24
U 1 1 84932BAC
P 5375 4750
F 0 "R24" H 5275 4837 64  0000 L BNN
F 1 "100k" H 5275 4925 42  0000 L BNN
F 2 "AllModules:R0603_1" H 5375 4750 50  0001 C CNN
F 3 "" H 5375 4750 50  0001 C CNN
F 4 "RESISTOR,100 K OHM, 0.063W +/-5%" H 5375 4750 50  0001 C CNN "Description"
F 5 "10022732" H 5375 4750 50  0001 C CNN "Item Number"
F 6 "YAGEO_RMS1" H 5375 4750 50  0001 C CNN "Manufacturer"
F 7 "232270260104L" H 5375 4750 50  0001 C CNN "Manufacturer_No"
F 8 "RESISTOR, METAL GLAZE/THICK FILM, 0.1 W, 5 %, 100 PPM, 100000 OHM, SURFACE MOUNT, 0603" H 5375 4750 50  0001 C CNN "Manufacturer_Desc"
F 9 "YAGEO_RMS1" H 5375 4750 50  0001 C CNN "Manufacturer2"
F 10 "232270260104" H 5375 4750 50  0001 C CNN "Manufacturer_No2"
F 11 "RESISTOR, METAL GLAZE/THICK FILM, 0.1 W, 5 %, 100 PPM, 100000 OHM, SURFACE MOUNT, 0603" H 5375 4750 50  0001 C CNN "Manufacturer_Desc2"
F 12 "YAGEO_RMS1" H 5375 4750 50  0001 C CNN "Manufacturer3"
F 13 "RC0603JR-07100KL" H 5375 4750 50  0001 C CNN "Manufacturer_No3"
F 14 "RESISTOR, METAL GLAZE/THICK FILM, 0.1 W, 5 %, 100 PPM, 100000 OHM, SURFACE MOUNT, 0603" H 5375 4750 50  0001 C CNN "Manufacturer_Desc3"
F 15 "PANASONIC_RMS1" H 5375 4750 50  0001 C CNN "Manufacturer4"
F 16 "ERJ3GEYJ104V" H 5375 4750 50  0001 C CNN "Manufacturer_No4"
F 17 "THICK FILM CHIP RESISTOR" H 5375 4750 50  0001 C CNN "Manufacturer_Desc4"
	1    5375 4750
	-1   0    0    1   
$EndComp
$Comp
L cpu-board:GND #U$0126
U 1 1 3570AE0B
P 5100 4900
F 0 "#U$0126" H 5100 4900 50  0001 C CNN
F 1 "GND" H 5012 4813 59  0000 L BNN
F 2 "" H 5100 4900 50  0001 C CNN
F 3 "" H 5100 4900 50  0001 C CNN
	1    5100 4900
	1    0    0    -1  
$EndComp
$Comp
L cpu-board:R0805 R25
U 1 1 D4C34F44
P 3350 3425
F 0 "R25" H 3088 3512 64  0000 L BNN
F 1 "620" H 3088 3437 42  0000 L BNN
F 2 "AllModules:R0805_1" H 3350 3425 50  0001 C CNN
F 3 "" H 3350 3425 50  0001 C CNN
F 4 "RESISTOR, 620 OHM, 0.125W,+/-5%,0805" H 3350 3425 50  0001 C CNN "Description"
F 5 "10023190" H 3350 3425 50  0001 C CNN "Item Number"
F 6 "MULTICOMP                       (920630)" H 3350 3425 50  0001 C CNN "Manufacturer"
F 7 "MC 0.1W 0805 5% 620R" H 3350 3425 50  0001 C CNN "Manufacturer_No"
F 8 "THICK FILM CHIP RESISTOR" H 3350 3425 50  0001 C CNN "Manufacturer_Desc"
	1    3350 3425
	1    0    0    -1  
$EndComp
$Comp
L cpu-board:GND #U$0216
U 1 1 B370812A
P 3400 1625
F 0 "#U$0216" H 3400 1625 50  0001 C CNN
F 1 "GND" H 3325 1550 59  0000 L BNN
F 2 "" H 3400 1625 50  0001 C CNN
F 3 "" H 3400 1625 50  0001 C CNN
	1    3400 1625
	0    -1   -1   0   
$EndComp
$Comp
L cpu-board:+5V #U$0218
U 1 1 DA379590
P 3400 4425
F 0 "#U$0218" H 3400 4425 50  0001 C CNN
F 1 "+5V" V 3475 4263 59  0000 L BNN
F 2 "" H 3400 4425 50  0001 C CNN
F 3 "" H 3400 4425 50  0001 C CNN
	1    3400 4425
	0    -1   -1   0   
$EndComp
$Comp
L cpu-board:+5V #U$0220
U 1 1 2F8C19EB
P 3400 3825
F 0 "#U$0220" H 3400 3825 50  0001 C CNN
F 1 "+5V" V 3475 3650 59  0000 L BNN
F 2 "" H 3400 3825 50  0001 C CNN
F 3 "" H 3400 3825 50  0001 C CNN
	1    3400 3825
	0    -1   -1   0   
$EndComp
$Comp
L cpu-board:IRLML2803@2 T9
U 1 1 7B8E4CC8
P 5200 3450
F 0 "T9" H 5150 3725 64  0000 L BNN
F 1 "2N7002" H 4925 3625 59  0000 L BNN
F 2 "AllModules:SOT23-GSD_1" H 5200 3450 50  0001 C CNN
F 3 "" H 5200 3450 50  0001 C CNN
F 4 "TRANSISTOR MOSFET N CHANNEL 60V, 0.18A" H 5200 3450 50  0001 C CNN "Description"
F 5 "10097274" H 5200 3450 50  0001 C CNN "Item Number"
F 6 "ON SEMICONDUCTOR_RMS1" H 5200 3450 50  0001 C CNN "Manufacturer"
F 7 "2N7002LT1G" H 5200 3450 50  0001 C CNN "Manufacturer_No"
F 8 "SMALL SIGNAL MOSFET" H 5200 3450 50  0001 C CNN "Manufacturer_Desc"
F 9 "NXP SEMICONDUCTORS_RMS1" H 5200 3450 50  0001 C CNN "Manufacturer2"
F 10 "2N7002,215" H 5200 3450 50  0001 C CNN "Manufacturer_No2"
F 11 "" H 5200 3450 50  0001 C CNN "Manufacturer_Desc2"
F 12 "NXP SEMICONDUCTORS_RMS1" H 5200 3450 50  0001 C CNN "Manufacturer3"
F 13 "2N7002" H 5200 3450 50  0001 C CNN "Manufacturer_No3"
F 14 "N-CHANNEL TRENCHMOS FET" H 5200 3450 50  0001 C CNN "Manufacturer_Desc3"
	1    5200 3450
	-1   0    0    -1  
$EndComp
$Comp
L cpu-board:R0805 R26
U 1 1 AD264776
P 5375 3700
F 0 "R26" H 5288 3775 64  0000 L BNN
F 1 "100k" H 5275 3863 42  0000 L BNN
F 2 "AllModules:R0603_1" H 5375 3700 50  0001 C CNN
F 3 "" H 5375 3700 50  0001 C CNN
F 4 "RESISTOR,100 K OHM, 0.063W +/-5%" H 5375 3700 50  0001 C CNN "Description"
F 5 "10022732" H 5375 3700 50  0001 C CNN "Item Number"
F 6 "YAGEO_RMS1" H 5375 3700 50  0001 C CNN "Manufacturer"
F 7 "232270260104L" H 5375 3700 50  0001 C CNN "Manufacturer_No"
F 8 "RESISTOR, METAL GLAZE/THICK FILM, 0.1 W, 5 %, 100 PPM, 100000 OHM, SURFACE MOUNT, 0603" H 5375 3700 50  0001 C CNN "Manufacturer_Desc"
F 9 "YAGEO_RMS1" H 5375 3700 50  0001 C CNN "Manufacturer2"
F 10 "232270260104" H 5375 3700 50  0001 C CNN "Manufacturer_No2"
F 11 "RESISTOR, METAL GLAZE/THICK FILM, 0.1 W, 5 %, 100 PPM, 100000 OHM, SURFACE MOUNT, 0603" H 5375 3700 50  0001 C CNN "Manufacturer_Desc2"
F 12 "YAGEO_RMS1" H 5375 3700 50  0001 C CNN "Manufacturer3"
F 13 "RC0603JR-07100KL" H 5375 3700 50  0001 C CNN "Manufacturer_No3"
F 14 "RESISTOR, METAL GLAZE/THICK FILM, 0.1 W, 5 %, 100 PPM, 100000 OHM, SURFACE MOUNT, 0603" H 5375 3700 50  0001 C CNN "Manufacturer_Desc3"
F 15 "PANASONIC_RMS1" H 5375 3700 50  0001 C CNN "Manufacturer4"
F 16 "ERJ3GEYJ104V" H 5375 3700 50  0001 C CNN "Manufacturer_No4"
F 17 "THICK FILM CHIP RESISTOR" H 5375 3700 50  0001 C CNN "Manufacturer_Desc4"
	1    5375 3700
	-1   0    0    1   
$EndComp
$Comp
L cpu-board:GND #U$0230
U 1 1 3125B463
P 5100 3850
F 0 "#U$0230" H 5100 3850 50  0001 C CNN
F 1 "GND" H 5013 3762 59  0000 L BNN
F 2 "" H 5100 3850 50  0001 C CNN
F 3 "" H 5100 3850 50  0001 C CNN
	1    5100 3850
	1    0    0    -1  
$EndComp
$Comp
L cpu-board:GND #U$0232
U 1 1 10CAE392
P 10450 3025
F 0 "#U$0232" H 10450 3025 50  0001 C CNN
F 1 "GND" H 10363 2937 59  0000 L BNN
F 2 "" H 10450 3025 50  0001 C CNN
F 3 "" H 10450 3025 50  0001 C CNN
	1    10450 3025
	1    0    0    -1  
$EndComp
$Comp
L cpu-board:GND #U$0234
U 1 1 D70CEC43
P 10450 950
F 0 "#U$0234" H 10450 950 50  0001 C CNN
F 1 "GND" H 10363 863 59  0000 L BNN
F 2 "" H 10450 950 50  0001 C CNN
F 3 "" H 10450 950 50  0001 C CNN
	1    10450 950 
	-1   0    0    1   
$EndComp
$Comp
L cpu-board:+5V #U$0236
U 1 1 F484FC7A
P 14200 925
F 0 "#U$0236" H 14200 925 50  0001 C CNN
F 1 "+5V" H 14112 838 59  0000 L BNN
F 2 "" H 14200 925 50  0001 C CNN
F 3 "" H 14200 925 50  0001 C CNN
	1    14200 925 
	-1   0    0    1   
$EndComp
$Comp
L cpu-board:GND #U$0261
U 1 1 C1A8A136
P 14675 1300
F 0 "#U$0261" H 14675 1300 50  0001 C CNN
F 1 "GND" H 14587 1212 59  0000 L BNN
F 2 "" H 14675 1300 50  0001 C CNN
F 3 "" H 14675 1300 50  0001 C CNN
	1    14675 1300
	0    -1   -1   0   
$EndComp
$Comp
L cpu-board:+5V #U$0285
U 1 1 A0DF6488
P 10800 3075
F 0 "#U$0285" H 10800 3075 50  0001 C CNN
F 1 "+5V" H 10713 2987 59  0000 L BNN
F 2 "" H 10800 3075 50  0001 C CNN
F 3 "" H 10800 3075 50  0001 C CNN
	1    10800 3075
	1    0    0    -1  
$EndComp
$Comp
L cpu-board:+5V #U$0287
U 1 1 603F22EA
P 10800 925
F 0 "#U$0287" H 10800 925 50  0001 C CNN
F 1 "+5V" H 10712 837 59  0000 L BNN
F 2 "" H 10800 925 50  0001 C CNN
F 3 "" H 10800 925 50  0001 C CNN
	1    10800 925 
	-1   0    0    1   
$EndComp
$Comp
L cpu-board:TANTALB C31
U 1 1 0C4556A5
P 10600 2800
F 0 "C31" V 10432 2750 56  0000 L BNN
F 1 "1uF" V 10444 2888 42  0000 R TNN
F 2 "AllModules:C3216_1" H 10600 2800 50  0001 C CNN
F 3 "" H 10600 2800 50  0001 C CNN
F 4 "CAPACITOR TANTALUM, 1UF,35V, +/-10%" H 10600 2800 50  0001 C CNN "Description"
F 5 "10022959" H 10600 2800 50  0001 C CNN "Item Number"
F 6 "KEMET" H 10600 2800 50  0001 C CNN "Manufacturer"
F 7 "T491A105M035AT" H 10600 2800 50  0001 C CNN "Manufacturer_No"
F 8 "Cap, Tantalum, Polarized, 35V, 20% +/-Tol, 1uF, Surface Mount, 1206 (Case A), EIA Metric 3216" H 10600 2800 50  0001 C CNN "Manufacturer_Desc"
F 9 "KEMET" H 10600 2800 50  0001 C CNN "Manufacturer2"
F 10 "T495A105K035ATE3K0" H 10600 2800 50  0001 C CNN "Manufacturer_No2"
F 11 "Cap, Tantalum, Polarized, 35V, 10% +/-Tol, 1uF, Surface Mount, 1206 (Case A), EIA Metric 3216" H 10600 2800 50  0001 C CNN "Manufacturer_Desc2"
	1    10600 2800
	0    1    1    0   
$EndComp
$Comp
L cpu-board:TANTALB C32
U 1 1 FD532AD7
P 10600 1300
F 0 "C32" V 10406 1250 56  0000 L BNN
F 1 "1uF" V 10494 1250 42  0000 L BNN
F 2 "AllModules:C3216_1" H 10600 1300 50  0001 C CNN
F 3 "" H 10600 1300 50  0001 C CNN
F 4 "CAPACITOR TANTALUM, 1UF,35V, +/-10%" H 10600 1300 50  0001 C CNN "Description"
F 5 "10022959" H 10600 1300 50  0001 C CNN "Item Number"
F 6 "KEMET" H 10600 1300 50  0001 C CNN "Manufacturer"
F 7 "T491A105M035AT" H 10600 1300 50  0001 C CNN "Manufacturer_No"
F 8 "Cap, Tantalum, Polarized, 35V, 20% +/-Tol, 1uF, Surface Mount, 1206 (Case A), EIA Metric 3216" H 10600 1300 50  0001 C CNN "Manufacturer_Desc"
F 9 "KEMET" H 10600 1300 50  0001 C CNN "Manufacturer2"
F 10 "T495A105K035ATE3K0" H 10600 1300 50  0001 C CNN "Manufacturer_No2"
F 11 "Cap, Tantalum, Polarized, 35V, 10% +/-Tol, 1uF, Surface Mount, 1206 (Case A), EIA Metric 3216" H 10600 1300 50  0001 C CNN "Manufacturer_Desc2"
	1    10600 1300
	0    1    1    0   
$EndComp
$Comp
L cpu-board:+24V #U$0532
U 1 1 BA196D3F
P 11000 1375
F 0 "#U$0532" H 11000 1375 50  0001 C CNN
F 1 "+24V" H 10887 1238 59  0000 L BNN
F 2 "" H 11000 1375 50  0001 C CNN
F 3 "" H 11000 1375 50  0001 C CNN
	1    11000 1375
	-1   0    0    1   
$EndComp
$Comp
L cpu-board:GND #U$0534
U 1 1 524CC2B7
P 3200 5825
F 0 "#U$0534" H 3200 5825 50  0001 C CNN
F 1 "GND" H 3100 5750 59  0000 L BNN
F 2 "" H 3200 5825 50  0001 C CNN
F 3 "" H 3200 5825 50  0001 C CNN
	1    3200 5825
	0    -1   -1   0   
$EndComp
$Comp
L cpu-board:GND #U$0539
U 1 1 26F7E790
P 6200 9775
F 0 "#U$0539" H 6200 9775 50  0001 C CNN
F 1 "GND" H 6100 9687 59  0000 L BNN
F 2 "" H 6200 9775 50  0001 C CNN
F 3 "" H 6200 9775 50  0001 C CNN
	1    6200 9775
	0    -1   -1   0   
$EndComp
$Comp
L cpu-board:+3,3V #U$0540
U 1 1 EB8893E1
P 6075 9975
F 0 "#U$0540" H 6075 9975 50  0001 C CNN
F 1 "+3,3V" V 6200 10063 59  0000 L BNN
F 2 "" H 6075 9975 50  0001 C CNN
F 3 "" H 6075 9975 50  0001 C CNN
	1    6075 9975
	0    1    1    0   
$EndComp
$Comp
L cpu-board:R0805 R30
U 1 1 A2E2AA66
P 6050 8575
F 0 "R30" H 6137 8738 64  0000 R TNN
F 1 "0" H 6137 8825 42  0000 R TNN
F 2 "AllModules:R0603_1" H 6050 8575 50  0001 C CNN
F 3 "" H 6050 8575 50  0001 C CNN
	1    6050 8575
	-1   0    0    1   
$EndComp
$Comp
L cpu-board:GND #U$0541
U 1 1 E7081248
P 6400 8575
F 0 "#U$0541" H 6400 8575 50  0001 C CNN
F 1 "GND" H 6312 8487 59  0000 L BNN
F 2 "" H 6400 8575 50  0001 C CNN
F 3 "" H 6400 8575 50  0001 C CNN
	1    6400 8575
	0    -1   -1   0   
$EndComp
$Comp
L cpu-board:C0805 C35
U 1 1 31890B0B
P 5950 9875
F 0 "C35" H 5900 9675 64  0000 L CNN
F 1 "100nF" H 5900 9600 42  0000 L CNN
F 2 "AllModules:C0402_1" H 5950 9875 50  0001 C CNN
F 3 "" H 5950 9875 50  0001 C CNN
	1    5950 9875
	1    0    0    -1  
$EndComp
$Comp
L cpu-board:GND #U$0547
U 1 1 7F698F3F
P 7025 7600
F 0 "#U$0547" H 7025 7600 50  0001 C CNN
F 1 "GND" H 6937 7513 59  0000 L BNN
F 2 "" H 7025 7600 50  0001 C CNN
F 3 "" H 7025 7600 50  0001 C CNN
	1    7025 7600
	-1   0    0    1   
$EndComp
$Comp
L cpu-board:+3,3V #U$0550
U 1 1 D00D651F
P 7350 9100
F 0 "#U$0550" H 7350 9100 50  0001 C CNN
F 1 "+3,3V" H 7250 9337 59  0000 L BNN
F 2 "" H 7350 9100 50  0001 C CNN
F 3 "" H 7350 9100 50  0001 C CNN
	1    7350 9100
	1    0    0    -1  
$EndComp
$Comp
L cpu-board:R0805 R32
U 1 1 2A092FBD
P 7750 7925
F 0 "R32" V 7788 7825 64  0000 R TNN
F 1 "10k" V 7713 7825 42  0000 R TNN
F 2 "AllModules:R0603_1" H 7750 7925 50  0001 C CNN
F 3 "" H 7750 7925 50  0001 C CNN
F 4 "RESISTOR,10K OHM, 0.063W,+/-5%,0603" H 7750 7925 50  0001 C CNN "Description"
F 5 "10097266" H 7750 7925 50  0001 C CNN "Item Number"
F 6 "YAGEO_RMS1" H 7750 7925 50  0001 C CNN "Manufacturer"
F 7 "232270260103L" H 7750 7925 50  0001 C CNN "Manufacturer_No"
F 8 "RESISTOR, METAL GLAZE/THICK FILM, 0.1 W, 5 %, 100 PPM, 10000 OHM, SURFACE MOUNT, 0603" H 7750 7925 50  0001 C CNN "Manufacturer_Desc"
F 9 "YAGEO_RMS1" H 7750 7925 50  0001 C CNN "Manufacturer2"
F 10 "232270260103" H 7750 7925 50  0001 C CNN "Manufacturer_No2"
F 11 "RESISTOR, METAL GLAZE/THICK FILM, 0.1 W, 5 %, 100 PPM, 10000 OHM, SURFACE MOUNT, 0603" H 7750 7925 50  0001 C CNN "Manufacturer_Desc2"
F 12 "VISHAY_RMS1" H 7750 7925 50  0001 C CNN "Manufacturer3"
F 13 "CRCW060310K0JNEA" H 7750 7925 50  0001 C CNN "Manufacturer_No3"
F 14 "THICK FILM RECTANGULAR CHIP RESISTOR" H 7750 7925 50  0001 C CNN "Manufacturer_Desc3"
F 15 "ASJ" H 7750 7925 50  0001 C CNN "Manufacturer4"
F 16 "CR16-103JL" H 7750 7925 50  0001 C CNN "Manufacturer_No4"
F 17 "THICK FILM CHIP RESISTOR" H 7750 7925 50  0001 C CNN "Manufacturer_Desc4"
F 18 "YAGEO_RMS1" H 7750 7925 50  0001 C CNN "Manufacturer5"
F 19 "RC0603JR-0710KL" H 7750 7925 50  0001 C CNN "Manufacturer_No5"
F 20 "RESISTOR, METAL GLAZE/THICK FILM, 0.1 W, 5 %, 100 PPM, 10000 OHM, SURFACE MOUNT, 0603" H 7750 7925 50  0001 C CNN "Manufacturer_Desc5"
	1    7750 7925
	0    -1   -1   0   
$EndComp
$Comp
L cpu-board:+5V #U$0555
U 1 1 EA4574B7
P 7750 7625
F 0 "#U$0555" H 7750 7625 50  0001 C CNN
F 1 "+5V" H 7825 7588 59  0000 R TNN
F 2 "" H 7750 7625 50  0001 C CNN
F 3 "" H 7750 7625 50  0001 C CNN
	1    7750 7625
	-1   0    0    1   
$EndComp
$Comp
L cpu-board:GND #U$0142
U 1 1 7A98F0EE
P 4525 5500
F 0 "#U$0142" H 4525 5500 50  0001 C CNN
F 1 "GND" H 4437 5413 59  0000 L BNN
F 2 "" H 4525 5500 50  0001 C CNN
F 3 "" H 4525 5500 50  0001 C CNN
	1    4525 5500
	1    0    0    -1  
$EndComp
$Comp
L cpu-board:R0805 R7
U 1 1 184A3E63
P 4800 5350
F 0 "R7" H 4862 5500 64  0000 R TNN
F 1 "100k" H 4862 5575 42  0000 R TNN
F 2 "AllModules:R0603_1" H 4800 5350 50  0001 C CNN
F 3 "" H 4800 5350 50  0001 C CNN
F 4 "RESISTOR,100 K OHM, 0.063W +/-5%" H 4800 5350 50  0001 C CNN "Description"
F 5 "10022732" H 4800 5350 50  0001 C CNN "Item Number"
F 6 "YAGEO_RMS1" H 4800 5350 50  0001 C CNN "Manufacturer"
F 7 "232270260104L" H 4800 5350 50  0001 C CNN "Manufacturer_No"
F 8 "RESISTOR, METAL GLAZE/THICK FILM, 0.1 W, 5 %, 100 PPM, 100000 OHM, SURFACE MOUNT, 0603" H 4800 5350 50  0001 C CNN "Manufacturer_Desc"
F 9 "YAGEO_RMS1" H 4800 5350 50  0001 C CNN "Manufacturer2"
F 10 "232270260104" H 4800 5350 50  0001 C CNN "Manufacturer_No2"
F 11 "RESISTOR, METAL GLAZE/THICK FILM, 0.1 W, 5 %, 100 PPM, 100000 OHM, SURFACE MOUNT, 0603" H 4800 5350 50  0001 C CNN "Manufacturer_Desc2"
F 12 "YAGEO_RMS1" H 4800 5350 50  0001 C CNN "Manufacturer3"
F 13 "RC0603JR-07100KL" H 4800 5350 50  0001 C CNN "Manufacturer_No3"
F 14 "RESISTOR, METAL GLAZE/THICK FILM, 0.1 W, 5 %, 100 PPM, 100000 OHM, SURFACE MOUNT, 0603" H 4800 5350 50  0001 C CNN "Manufacturer_Desc3"
F 15 "PANASONIC_RMS1" H 4800 5350 50  0001 C CNN "Manufacturer4"
F 16 "ERJ3GEYJ104V" H 4800 5350 50  0001 C CNN "Manufacturer_No4"
F 17 "THICK FILM CHIP RESISTOR" H 4800 5350 50  0001 C CNN "Manufacturer_Desc4"
	1    4800 5350
	-1   0    0    1   
$EndComp
$Comp
L cpu-board:IRLML2803 T2
U 1 1 4E5B5821
P 5750 2050
F 0 "T2" H 5625 2325 64  0000 L BNN
F 1 "2N7002" H 5400 2250 59  0000 L BNN
F 2 "AllModules:SOT23-GSD_1" H 5750 2050 50  0001 C CNN
F 3 "" H 5750 2050 50  0001 C CNN
F 4 "TRANSISTOR MOSFET N CHANNEL 60V, 0.18A" H 5750 2050 50  0001 C CNN "Description"
F 5 "10097274" H 5750 2050 50  0001 C CNN "Item Number"
F 6 "ON SEMICONDUCTOR_RMS1" H 5750 2050 50  0001 C CNN "Manufacturer"
F 7 "2N7002LT1G" H 5750 2050 50  0001 C CNN "Manufacturer_No"
F 8 "SMALL SIGNAL MOSFET" H 5750 2050 50  0001 C CNN "Manufacturer_Desc"
F 9 "NXP SEMICONDUCTORS_RMS1" H 5750 2050 50  0001 C CNN "Manufacturer2"
F 10 "2N7002,215" H 5750 2050 50  0001 C CNN "Manufacturer_No2"
F 11 "" H 5750 2050 50  0001 C CNN "Manufacturer_Desc2"
F 12 "NXP SEMICONDUCTORS_RMS1" H 5750 2050 50  0001 C CNN "Manufacturer3"
F 13 "2N7002" H 5750 2050 50  0001 C CNN "Manufacturer_No3"
F 14 "N-CHANNEL TRENCHMOS FET" H 5750 2050 50  0001 C CNN "Manufacturer_Desc3"
	1    5750 2050
	-1   0    0    -1  
$EndComp
$Comp
L cpu-board:GND #U$0146
U 1 1 1CE3BB42
P 5650 2450
F 0 "#U$0146" H 5650 2450 50  0001 C CNN
F 1 "GND" H 5562 2362 59  0000 L BNN
F 2 "" H 5650 2450 50  0001 C CNN
F 3 "" H 5650 2450 50  0001 C CNN
	1    5650 2450
	1    0    0    -1  
$EndComp
$Comp
L cpu-board:R0805 R12
U 1 1 0C5252B0
P 5925 2300
F 0 "R12" H 6000 2462 64  0000 R TNN
F 1 "100k" H 6012 2537 42  0000 R TNN
F 2 "AllModules:R0603_1" H 5925 2300 50  0001 C CNN
F 3 "" H 5925 2300 50  0001 C CNN
F 4 "RESISTOR,100 K OHM, 0.063W +/-5%" H 5925 2300 50  0001 C CNN "Description"
F 5 "10022732" H 5925 2300 50  0001 C CNN "Item Number"
F 6 "YAGEO_RMS1" H 5925 2300 50  0001 C CNN "Manufacturer"
F 7 "232270260104L" H 5925 2300 50  0001 C CNN "Manufacturer_No"
F 8 "RESISTOR, METAL GLAZE/THICK FILM, 0.1 W, 5 %, 100 PPM, 100000 OHM, SURFACE MOUNT, 0603" H 5925 2300 50  0001 C CNN "Manufacturer_Desc"
F 9 "YAGEO_RMS1" H 5925 2300 50  0001 C CNN "Manufacturer2"
F 10 "232270260104" H 5925 2300 50  0001 C CNN "Manufacturer_No2"
F 11 "RESISTOR, METAL GLAZE/THICK FILM, 0.1 W, 5 %, 100 PPM, 100000 OHM, SURFACE MOUNT, 0603" H 5925 2300 50  0001 C CNN "Manufacturer_Desc2"
F 12 "YAGEO_RMS1" H 5925 2300 50  0001 C CNN "Manufacturer3"
F 13 "RC0603JR-07100KL" H 5925 2300 50  0001 C CNN "Manufacturer_No3"
F 14 "RESISTOR, METAL GLAZE/THICK FILM, 0.1 W, 5 %, 100 PPM, 100000 OHM, SURFACE MOUNT, 0603" H 5925 2300 50  0001 C CNN "Manufacturer_Desc3"
F 15 "PANASONIC_RMS1" H 5925 2300 50  0001 C CNN "Manufacturer4"
F 16 "ERJ3GEYJ104V" H 5925 2300 50  0001 C CNN "Manufacturer_No4"
F 17 "THICK FILM CHIP RESISTOR" H 5925 2300 50  0001 C CNN "Manufacturer_Desc4"
	1    5925 2300
	-1   0    0    1   
$EndComp
$Comp
L cpu-board:GND #U$0147
U 1 1 197E97CB
P 3700 5225
F 0 "#U$0147" H 3700 5225 50  0001 C CNN
F 1 "GND" H 3612 5150 59  0000 L BNN
F 2 "" H 3700 5225 50  0001 C CNN
F 3 "" H 3700 5225 50  0001 C CNN
	1    3700 5225
	0    -1   -1   0   
$EndComp
$Comp
L cpu-board:R1206 R22
U 1 1 50E1B837
P 3337 4825
F 0 "R22" H 3050 4912 64  0000 L BNN
F 1 "180" H 3062 4837 42  0000 L BNN
F 2 "AllModules:R0805_1" H 3337 4825 50  0001 C CNN
F 3 "" H 3337 4825 50  0001 C CNN
F 4 "RESISTOR, 180 OHM, 0805, +/-5%" H 3337 4825 50  0001 C CNN "Description"
F 5 "10023240" H 3337 4825 50  0001 C CNN "Item Number"
F 6 "YAGEO_RMS1" H 3337 4825 50  0001 C CNN "Manufacturer"
F 7 "232273061181" H 3337 4825 50  0001 C CNN "Manufacturer_No"
F 8 "RESISTOR, METAL GLAZE/THICK FILM, 0.125 W, 5 %, 100 PPM, 180 OHM, SURFACE MOUNT, 0805" H 3337 4825 50  0001 C CNN "Manufacturer_Desc"
F 9 "KOA SPEER" H 3337 4825 50  0001 C CNN "Manufacturer2"
F 10 "RK73B2ATTD181J" H 3337 4825 50  0001 C CNN "Manufacturer_No2"
F 11 "THICK FILM CHIP RESISTOR" H 3337 4825 50  0001 C CNN "Manufacturer_Desc2"
F 12 "YAGEO_RMS1" H 3337 4825 50  0001 C CNN "Manufacturer3"
F 13 "232273061181L" H 3337 4825 50  0001 C CNN "Manufacturer_No3"
F 14 "RESISTOR, METAL GLAZE/THICK FILM, 0.125 W, 5 %, 100 PPM, 180 OHM, SURFACE MOUNT, 0805" H 3337 4825 50  0001 C CNN "Manufacturer_Desc3"
F 15 "YAGEO_RMS1" H 3337 4825 50  0001 C CNN "Manufacturer4"
F 16 "RC0805JR-07180RL" H 3337 4825 50  0001 C CNN "Manufacturer_No4"
F 17 "RESISTOR, METAL GLAZE/THICK FILM, 0.125 W, 5 %, 100 PPM, 180 OHM, SURFACE MOUNT, 0805" H 3337 4825 50  0001 C CNN "Manufacturer_Desc4"
	1    3337 4825
	1    0    0    -1  
$EndComp
$Comp
L cpu-board:R1206 R23
U 1 1 AE8C3E2E
P 3350 3025
F 0 "R23" H 3088 3125 64  0000 L BNN
F 1 "180" H 3075 3037 42  0000 L BNN
F 2 "AllModules:R0805_1" H 3350 3025 50  0001 C CNN
F 3 "" H 3350 3025 50  0001 C CNN
F 4 "RESISTOR, 180 OHM, 0805, +/-5%" H 3350 3025 50  0001 C CNN "Description"
F 5 "10023240" H 3350 3025 50  0001 C CNN "Item Number"
F 6 "YAGEO_RMS1" H 3350 3025 50  0001 C CNN "Manufacturer"
F 7 "232273061181" H 3350 3025 50  0001 C CNN "Manufacturer_No"
F 8 "RESISTOR, METAL GLAZE/THICK FILM, 0.125 W, 5 %, 100 PPM, 180 OHM, SURFACE MOUNT, 0805" H 3350 3025 50  0001 C CNN "Manufacturer_Desc"
F 9 "KOA SPEER" H 3350 3025 50  0001 C CNN "Manufacturer2"
F 10 "RK73B2ATTD181J" H 3350 3025 50  0001 C CNN "Manufacturer_No2"
F 11 "THICK FILM CHIP RESISTOR" H 3350 3025 50  0001 C CNN "Manufacturer_Desc2"
F 12 "YAGEO_RMS1" H 3350 3025 50  0001 C CNN "Manufacturer3"
F 13 "232273061181L" H 3350 3025 50  0001 C CNN "Manufacturer_No3"
F 14 "RESISTOR, METAL GLAZE/THICK FILM, 0.125 W, 5 %, 100 PPM, 180 OHM, SURFACE MOUNT, 0805" H 3350 3025 50  0001 C CNN "Manufacturer_Desc3"
F 15 "YAGEO_RMS1" H 3350 3025 50  0001 C CNN "Manufacturer4"
F 16 "RC0805JR-07180RL" H 3350 3025 50  0001 C CNN "Manufacturer_No4"
F 17 "RESISTOR, METAL GLAZE/THICK FILM, 0.125 W, 5 %, 100 PPM, 180 OHM, SURFACE MOUNT, 0805" H 3350 3025 50  0001 C CNN "Manufacturer_Desc4"
	1    3350 3025
	1    0    0    -1  
$EndComp
$Comp
L cpu-board:+24VUTIL #U$0371
U 1 1 DC4F3C73
P 15050 3900
F 0 "#U$0371" H 15050 3900 50  0001 C CNN
F 1 "+24VUTIL" H 14937 3762 59  0000 L BNN
F 2 "" H 15050 3900 50  0001 C CNN
F 3 "" H 15050 3900 50  0001 C CNN
	1    15050 3900
	-1   0    0    1   
$EndComp
$Comp
L cpu-board:0VANA #U$0374
U 1 1 FB537956
P 10900 4000
F 0 "#U$0374" H 10900 4000 50  0001 C CNN
F 1 "0VANA" H 10788 3825 59  0000 L BNN
F 2 "" H 10900 4000 50  0001 C CNN
F 3 "" H 10900 4000 50  0001 C CNN
	1    10900 4000
	-1   0    0    1   
$EndComp
$Comp
L cpu-board:RESEAU_4C C41
U 1 1 25C7D5B9
P 13175 6325
F 0 "C41" H 13025 5963 64  0000 L BNN
F 1 "47pF" H 13038 5888 42  0000 L BNN
F 2 "AllModules:C0612-4_1" H 13175 6325 50  0001 C CNN
F 3 "" H 13175 6325 50  0001 C CNN
F 4 "CAPACITOR ARRAY, 47PF, 50V, +/-10%,NPO,0612" H 13175 6325 50  0001 C CNN "Description"
F 5 "10095973" H 13175 6325 50  0001 C CNN "Item Number"
F 6 "YAGEO_RMS1" H 13175 6325 50  0001 C CNN "Manufacturer"
F 7 "225514611532" H 13175 6325 50  0001 C CNN "Manufacturer_No"
F 8 "ISOLATED C NETWORK, 50V, C0G, 0.000047UF, SURFACE MOUNT, CHIP-8" H 13175 6325 50  0001 C CNN "Manufacturer_Desc"
	1    13175 6325
	1    0    0    -1  
$EndComp
$Comp
L cpu-board:RESEAU_4C C52
U 1 1 D9AC599B
P 9225 6325
F 0 "C52" H 9050 5975 64  0000 L BNN
F 1 "47pF" H 9050 5887 42  0000 L BNN
F 2 "AllModules:C0612-4_1" H 9225 6325 50  0001 C CNN
F 3 "" H 9225 6325 50  0001 C CNN
F 4 "CAPACITOR ARRAY, 47PF, 50V, +/-10%,NPO,0612" H 9225 6325 50  0001 C CNN "Description"
F 5 "10095973" H 9225 6325 50  0001 C CNN "Item Number"
F 6 "YAGEO_RMS1" H 9225 6325 50  0001 C CNN "Manufacturer"
F 7 "225514611532" H 9225 6325 50  0001 C CNN "Manufacturer_No"
F 8 "ISOLATED C NETWORK, 50V, C0G, 0.000047UF, SURFACE MOUNT, CHIP-8" H 9225 6325 50  0001 C CNN "Manufacturer_Desc"
	1    9225 6325
	1    0    0    -1  
$EndComp
$Comp
L cpu-board:74279263 L16
U 1 1 3E1ECFE2
P 8650 4350
AR Path="/3E1ECFE2" Ref="L16"  Part="1" 
AR Path="/5E926050/3E1ECFE2" Ref="L16"  Part="1" 
F 0 "L16" H 8588 4325 42  0000 L BNN
F 1 "Ferrite 200mA" H 8550 4400 34  0001 L BNN
F 2 "AllModules:C0603_1" H 8650 4350 50  0001 C CNN
F 3 "" H 8650 4350 50  0001 C CNN
F 4 "SMD FERRITE 200MA" H 8650 4350 50  0001 C CNN "Description"
F 5 "10022907" H 8650 4350 50  0001 C CNN "Item Number"
F 6 "WURTH ELEKTRONIK GMBH" H 8650 4350 50  0001 C CNN "Manufacturer"
F 7 "74279266" H 8650 4350 50  0001 C CNN "Manufacturer_No"
F 8 "MULTILAYER-SMD-FERRITE" H 8650 4350 50  0001 C CNN "Manufacturer_Desc"
	1    8650 4350
	1    0    0    -1  
$EndComp
$Comp
L cpu-board:74279263 L18
U 1 1 C853FF9C
P 8650 4550
AR Path="/C853FF9C" Ref="L18"  Part="1" 
AR Path="/5E926050/C853FF9C" Ref="L18"  Part="1" 
F 0 "L18" H 8588 4525 42  0000 L BNN
F 1 "Ferrite 200mA" H 8550 4600 34  0001 L BNN
F 2 "AllModules:C0603_1" H 8650 4550 50  0001 C CNN
F 3 "" H 8650 4550 50  0001 C CNN
F 4 "SMD FERRITE 200MA" H 8650 4550 50  0001 C CNN "Description"
F 5 "10022907" H 8650 4550 50  0001 C CNN "Item Number"
F 6 "WURTH ELEKTRONIK GMBH" H 8650 4550 50  0001 C CNN "Manufacturer"
F 7 "74279266" H 8650 4550 50  0001 C CNN "Manufacturer_No"
F 8 "MULTILAYER-SMD-FERRITE" H 8650 4550 50  0001 C CNN "Manufacturer_Desc"
	1    8650 4550
	1    0    0    -1  
$EndComp
$Comp
L cpu-board:74279263 L1
U 1 1 63106439
P 8650 4650
AR Path="/63106439" Ref="L1"  Part="1" 
AR Path="/5E926050/63106439" Ref="L1"  Part="1" 
F 0 "L1" H 8588 4625 42  0000 L BNN
F 1 "Ferrite 200mA" H 8550 4700 34  0001 L BNN
F 2 "AllModules:C0603_1" H 8650 4650 50  0001 C CNN
F 3 "" H 8650 4650 50  0001 C CNN
F 4 "SMD FERRITE 200MA" H 8650 4650 50  0001 C CNN "Description"
F 5 "10022907" H 8650 4650 50  0001 C CNN "Item Number"
F 6 "WURTH ELEKTRONIK GMBH" H 8650 4650 50  0001 C CNN "Manufacturer"
F 7 "74279266" H 8650 4650 50  0001 C CNN "Manufacturer_No"
F 8 "MULTILAYER-SMD-FERRITE" H 8650 4650 50  0001 C CNN "Manufacturer_Desc"
	1    8650 4650
	1    0    0    -1  
$EndComp
$Comp
L cpu-board:74279263 L3
U 1 1 5E88F353
P 8650 4750
AR Path="/5E88F353" Ref="L3"  Part="1" 
AR Path="/5E926050/5E88F353" Ref="L3"  Part="1" 
F 0 "L3" H 8588 4725 42  0000 L BNN
F 1 "Ferrite 200mA" H 8550 4800 34  0001 L BNN
F 2 "AllModules:C0603_1" H 8650 4750 50  0001 C CNN
F 3 "" H 8650 4750 50  0001 C CNN
F 4 "SMD FERRITE 200MA" H 8650 4750 50  0001 C CNN "Description"
F 5 "10022907" H 8650 4750 50  0001 C CNN "Item Number"
F 6 "WURTH ELEKTRONIK GMBH" H 8650 4750 50  0001 C CNN "Manufacturer"
F 7 "74279266" H 8650 4750 50  0001 C CNN "Manufacturer_No"
F 8 "MULTILAYER-SMD-FERRITE" H 8650 4750 50  0001 C CNN "Manufacturer_Desc"
	1    8650 4750
	1    0    0    -1  
$EndComp
$Comp
L cpu-board:74279263 L4
U 1 1 AC576572
P 8650 4850
AR Path="/AC576572" Ref="L4"  Part="1" 
AR Path="/5E926050/AC576572" Ref="L4"  Part="1" 
F 0 "L4" H 8588 4825 42  0000 L BNN
F 1 "Ferrite 200mA" H 8550 4900 34  0001 L BNN
F 2 "AllModules:C0603_1" H 8650 4850 50  0001 C CNN
F 3 "" H 8650 4850 50  0001 C CNN
F 4 "SMD FERRITE 200MA" H 8650 4850 50  0001 C CNN "Description"
F 5 "10022907" H 8650 4850 50  0001 C CNN "Item Number"
F 6 "WURTH ELEKTRONIK GMBH" H 8650 4850 50  0001 C CNN "Manufacturer"
F 7 "74279266" H 8650 4850 50  0001 C CNN "Manufacturer_No"
F 8 "MULTILAYER-SMD-FERRITE" H 8650 4850 50  0001 C CNN "Manufacturer_Desc"
	1    8650 4850
	1    0    0    -1  
$EndComp
$Comp
L cpu-board:74279263 L6
U 1 1 76104BF1
P 8650 5050
AR Path="/76104BF1" Ref="L6"  Part="1" 
AR Path="/5E926050/76104BF1" Ref="L6"  Part="1" 
F 0 "L6" H 8588 5025 42  0000 L BNN
F 1 "Ferrite 200mA" H 8550 5100 34  0001 L BNN
F 2 "AllModules:C0603_1" H 8650 5050 50  0001 C CNN
F 3 "" H 8650 5050 50  0001 C CNN
F 4 "SMD FERRITE 200MA" H 8650 5050 50  0001 C CNN "Description"
F 5 "10022907" H 8650 5050 50  0001 C CNN "Item Number"
F 6 "WURTH ELEKTRONIK GMBH" H 8650 5050 50  0001 C CNN "Manufacturer"
F 7 "74279266" H 8650 5050 50  0001 C CNN "Manufacturer_No"
F 8 "MULTILAYER-SMD-FERRITE" H 8650 5050 50  0001 C CNN "Manufacturer_Desc"
	1    8650 5050
	1    0    0    -1  
$EndComp
$Comp
L cpu-board:74279263 L43
U 1 1 B8451C4A
P 14525 4950
AR Path="/B8451C4A" Ref="L43"  Part="1" 
AR Path="/5E926050/B8451C4A" Ref="L43"  Part="1" 
F 0 "L43" H 14462 4925 42  0000 L BNN
F 1 "Ferrite 200mA" H 14425 5000 34  0001 L BNN
F 2 "AllModules:C0603_1" H 14525 4950 50  0001 C CNN
F 3 "" H 14525 4950 50  0001 C CNN
F 4 "SMD FERRITE 200MA" H 14525 4950 50  0001 C CNN "Description"
F 5 "10022907" H 14525 4950 50  0001 C CNN "Item Number"
F 6 "WURTH ELEKTRONIK GMBH" H 14525 4950 50  0001 C CNN "Manufacturer"
F 7 "74279266" H 14525 4950 50  0001 C CNN "Manufacturer_No"
F 8 "MULTILAYER-SMD-FERRITE" H 14525 4950 50  0001 C CNN "Manufacturer_Desc"
	1    14525 4950
	1    0    0    -1  
$EndComp
$Comp
L cpu-board:74279263 L44
U 1 1 C8827D52
P 14525 4850
AR Path="/C8827D52" Ref="L44"  Part="1" 
AR Path="/5E926050/C8827D52" Ref="L44"  Part="1" 
F 0 "L44" H 14462 4825 42  0000 L BNN
F 1 "Ferrite 200mA" H 14425 4900 34  0001 L BNN
F 2 "AllModules:C0603_1" H 14525 4850 50  0001 C CNN
F 3 "" H 14525 4850 50  0001 C CNN
F 4 "SMD FERRITE 200MA" H 14525 4850 50  0001 C CNN "Description"
F 5 "10022907" H 14525 4850 50  0001 C CNN "Item Number"
F 6 "WURTH ELEKTRONIK GMBH" H 14525 4850 50  0001 C CNN "Manufacturer"
F 7 "74279266" H 14525 4850 50  0001 C CNN "Manufacturer_No"
F 8 "MULTILAYER-SMD-FERRITE" H 14525 4850 50  0001 C CNN "Manufacturer_Desc"
	1    14525 4850
	1    0    0    -1  
$EndComp
$Comp
L cpu-board:74279263 L45
U 1 1 27E57B0C
P 14525 4750
AR Path="/27E57B0C" Ref="L45"  Part="1" 
AR Path="/5E926050/27E57B0C" Ref="L45"  Part="1" 
F 0 "L45" H 14462 4725 42  0000 L BNN
F 1 "Ferrite 200mA" H 14425 4800 34  0001 L BNN
F 2 "AllModules:C0603_1" H 14525 4750 50  0001 C CNN
F 3 "" H 14525 4750 50  0001 C CNN
F 4 "SMD FERRITE 200MA" H 14525 4750 50  0001 C CNN "Description"
F 5 "10022907" H 14525 4750 50  0001 C CNN "Item Number"
F 6 "WURTH ELEKTRONIK GMBH" H 14525 4750 50  0001 C CNN "Manufacturer"
F 7 "74279266" H 14525 4750 50  0001 C CNN "Manufacturer_No"
F 8 "MULTILAYER-SMD-FERRITE" H 14525 4750 50  0001 C CNN "Manufacturer_Desc"
	1    14525 4750
	1    0    0    -1  
$EndComp
$Comp
L cpu-board:74279263 L47
U 1 1 58FFAA19
P 14525 4550
AR Path="/58FFAA19" Ref="L47"  Part="1" 
AR Path="/5E926050/58FFAA19" Ref="L47"  Part="1" 
F 0 "L47" H 14462 4525 42  0000 L BNN
F 1 "Ferrite 200mA" H 14425 4600 34  0001 L BNN
F 2 "AllModules:C0603_1" H 14525 4550 50  0001 C CNN
F 3 "" H 14525 4550 50  0001 C CNN
F 4 "SMD FERRITE 200MA" H 14525 4550 50  0001 C CNN "Description"
F 5 "10022907" H 14525 4550 50  0001 C CNN "Item Number"
F 6 "WURTH ELEKTRONIK GMBH" H 14525 4550 50  0001 C CNN "Manufacturer"
F 7 "74279266" H 14525 4550 50  0001 C CNN "Manufacturer_No"
F 8 "MULTILAYER-SMD-FERRITE" H 14525 4550 50  0001 C CNN "Manufacturer_Desc"
	1    14525 4550
	1    0    0    -1  
$EndComp
$Comp
L cpu-board:74279263 L48
U 1 1 7A9C51D5
P 14525 4450
AR Path="/7A9C51D5" Ref="L48"  Part="1" 
AR Path="/5E926050/7A9C51D5" Ref="L48"  Part="1" 
F 0 "L48" H 14462 4425 42  0000 L BNN
F 1 "Ferrite 200mA" H 14425 4500 34  0001 L BNN
F 2 "AllModules:C0603_1" H 14525 4450 50  0001 C CNN
F 3 "" H 14525 4450 50  0001 C CNN
F 4 "SMD FERRITE 200MA" H 14525 4450 50  0001 C CNN "Description"
F 5 "10022907" H 14525 4450 50  0001 C CNN "Item Number"
F 6 "WURTH ELEKTRONIK GMBH" H 14525 4450 50  0001 C CNN "Manufacturer"
F 7 "74279266" H 14525 4450 50  0001 C CNN "Manufacturer_No"
F 8 "MULTILAYER-SMD-FERRITE" H 14525 4450 50  0001 C CNN "Manufacturer_Desc"
	1    14525 4450
	1    0    0    -1  
$EndComp
$Comp
L cpu-board:74279263 L49
U 1 1 B59E7860
P 14525 4350
AR Path="/B59E7860" Ref="L49"  Part="1" 
AR Path="/5E926050/B59E7860" Ref="L49"  Part="1" 
F 0 "L49" H 14462 4325 42  0000 L BNN
F 1 "Ferrite 200mA" H 14425 4400 34  0001 L BNN
F 2 "AllModules:C0603_1" H 14525 4350 50  0001 C CNN
F 3 "" H 14525 4350 50  0001 C CNN
F 4 "SMD FERRITE 200MA" H 14525 4350 50  0001 C CNN "Description"
F 5 "10022907" H 14525 4350 50  0001 C CNN "Item Number"
F 6 "WURTH ELEKTRONIK GMBH" H 14525 4350 50  0001 C CNN "Manufacturer"
F 7 "74279266" H 14525 4350 50  0001 C CNN "Manufacturer_No"
F 8 "MULTILAYER-SMD-FERRITE" H 14525 4350 50  0001 C CNN "Manufacturer_Desc"
	1    14525 4350
	1    0    0    -1  
$EndComp
$Comp
L cpu-board:74279263 L50
U 1 1 39D83C75
P 14525 4250
AR Path="/39D83C75" Ref="L50"  Part="1" 
AR Path="/5E926050/39D83C75" Ref="L50"  Part="1" 
F 0 "L50" H 14462 4225 42  0000 L BNN
F 1 "Ferrite 200mA" H 14425 4300 34  0001 L BNN
F 2 "AllModules:C0603_1" H 14525 4250 50  0001 C CNN
F 3 "" H 14525 4250 50  0001 C CNN
F 4 "SMD FERRITE 200MA" H 14525 4250 50  0001 C CNN "Description"
F 5 "10022907" H 14525 4250 50  0001 C CNN "Item Number"
F 6 "WURTH ELEKTRONIK GMBH" H 14525 4250 50  0001 C CNN "Manufacturer"
F 7 "74279266" H 14525 4250 50  0001 C CNN "Manufacturer_No"
F 8 "MULTILAYER-SMD-FERRITE" H 14525 4250 50  0001 C CNN "Manufacturer_Desc"
	1    14525 4250
	1    0    0    -1  
$EndComp
$Comp
L cpu-board:7427504 L61
U 1 1 D3E71165
P 14525 4150
AR Path="/D3E71165" Ref="L61"  Part="1" 
AR Path="/5E926050/D3E71165" Ref="L61"  Part="1" 
F 0 "L61" H 14462 4125 42  0000 L BNN
F 1 "Ferrite 1A" H 14412 4213 34  0000 L BNN
F 2 "AllModules:RC1206_1" H 14525 4150 50  0001 C CNN
F 3 "" H 14525 4150 50  0001 C CNN
F 4 "SMD FERRITE, 1A,1206" H 14525 4150 50  0001 C CNN "Description"
F 5 "10022911" H 14525 4150 50  0001 C CNN "Item Number"
F 6 "WURTH ELEKTRONIK GMBH" H 14525 4150 50  0001 C CNN "Manufacturer"
F 7 "74279218" H 14525 4150 50  0001 C CNN "Manufacturer_No"
F 8 "MULTILAYER-SMD-FERRITE" H 14525 4150 50  0001 C CNN "Manufacturer_Desc"
	1    14525 4150
	1    0    0    -1  
$EndComp
$Comp
L cpu-board:26BR-HE10 J7
U 1 1 916830BC
P 11275 4650
F 0 "J7" H 11125 5385 59  0000 L BNN
F 1 "26BR-HE10" H 11125 3875 45  0000 L BNN
F 2 "AllModules:BP2X13C_1" H 11275 4650 50  0001 C CNN
F 3 "" H 11275 4650 50  0001 C CNN
F 4 "HEADER CONNECTOR, RIGHT ANGLE, 26 PINS" H 11275 4650 50  0001 C CNN "Description"
F 5 "10052331" H 11275 4650 50  0001 C CNN "Item Number"
F 6 "FCI/BERG" H 11275 4650 50  0001 C CNN "Manufacturer"
F 7 "75867-105LF" H 11275 4650 50  0001 C CNN "Manufacturer_No"
F 8 "" H 11275 4650 50  0001 C CNN "Manufacturer_Desc"
F 9 "FCI/BERG" H 11275 4650 50  0001 C CNN "Manufacturer2"
F 10 "88874-026LF" H 11275 4650 50  0001 C CNN "Manufacturer_No2"
F 11 "" H 11275 4650 50  0001 C CNN "Manufacturer_Desc2"
	1    11275 4650
	1    0    0    -1  
$EndComp
$Comp
L cpu-board:+24VUTIL #U$0378
U 1 1 E2B064DA
P 15075 5400
F 0 "#U$0378" H 15075 5400 50  0001 C CNN
F 1 "+24VUTIL" H 15293 5308 59  0000 R TNN
F 2 "" H 15075 5400 50  0001 C CNN
F 3 "" H 15075 5400 50  0001 C CNN
	1    15075 5400
	-1   0    0    -1  
$EndComp
$Comp
L cpu-board:0VANA #U$0379
U 1 1 A6CF7D7B
P 10950 5475
F 0 "#U$0379" H 10950 5475 50  0001 C CNN
F 1 "0VANA" H 10837 5288 59  0000 L BNN
F 2 "" H 10950 5475 50  0001 C CNN
F 3 "" H 10950 5475 50  0001 C CNN
	1    10950 5475
	1    0    0    -1  
$EndComp
$Comp
L cpu-board:RESEAU_4C C55
U 1 1 BAACCAAE
P 14075 6325
F 0 "C55" H 13925 5963 64  0000 L BNN
F 1 "47pF" H 13937 5888 42  0000 L BNN
F 2 "AllModules:C0612-4_1" H 14075 6325 50  0001 C CNN
F 3 "" H 14075 6325 50  0001 C CNN
F 4 "CAPACITOR ARRAY, 47PF, 50V, +/-10%,NPO,0612" H 14075 6325 50  0001 C CNN "Description"
F 5 "10095973" H 14075 6325 50  0001 C CNN "Item Number"
F 6 "YAGEO_RMS1" H 14075 6325 50  0001 C CNN "Manufacturer"
F 7 "225514611532" H 14075 6325 50  0001 C CNN "Manufacturer_No"
F 8 "ISOLATED C NETWORK, 50V, C0G, 0.000047UF, SURFACE MOUNT, CHIP-8" H 14075 6325 50  0001 C CNN "Manufacturer_Desc"
	1    14075 6325
	1    0    0    -1  
$EndComp
$Comp
L cpu-board:RESEAU_4C C58
U 1 1 6DB6649E
P 10150 6325
F 0 "C58" H 10000 5975 64  0000 L BNN
F 1 "47pF" H 10000 5900 42  0000 L BNN
F 2 "AllModules:C0612-4_1" H 10150 6325 50  0001 C CNN
F 3 "" H 10150 6325 50  0001 C CNN
F 4 "CAPACITOR ARRAY, 47PF, 50V, +/-10%,NPO,0612" H 10150 6325 50  0001 C CNN "Description"
F 5 "10095973" H 10150 6325 50  0001 C CNN "Item Number"
F 6 "YAGEO_RMS1" H 10150 6325 50  0001 C CNN "Manufacturer"
F 7 "225514611532" H 10150 6325 50  0001 C CNN "Manufacturer_No"
F 8 "ISOLATED C NETWORK, 50V, C0G, 0.000047UF, SURFACE MOUNT, CHIP-8" H 10150 6325 50  0001 C CNN "Manufacturer_Desc"
	1    10150 6325
	1    0    0    -1  
$EndComp
$Comp
L cpu-board:GND #U$0388
U 1 1 5F813E21
P 11250 6750
F 0 "#U$0388" H 11250 6750 50  0001 C CNN
F 1 "GND" H 11163 6662 59  0000 L BNN
F 2 "" H 11250 6750 50  0001 C CNN
F 3 "" H 11250 6750 50  0001 C CNN
	1    11250 6750
	1    0    0    -1  
$EndComp
$Comp
L cpu-board:7427504 L8
U 1 1 8A653321
P 14525 5150
AR Path="/8A653321" Ref="L8"  Part="1" 
AR Path="/5E926050/8A653321" Ref="L8"  Part="1" 
F 0 "L8" H 14487 5125 42  0000 L BNN
F 1 "Ferrite 1A" H 14400 5050 34  0000 L BNN
F 2 "AllModules:RC1206_1" H 14525 5150 50  0001 C CNN
F 3 "" H 14525 5150 50  0001 C CNN
F 4 "SMD FERRITE, 1A,1206" H 14525 5150 50  0001 C CNN "Description"
F 5 "10022911" H 14525 5150 50  0001 C CNN "Item Number"
F 6 "WURTH ELEKTRONIK GMBH" H 14525 5150 50  0001 C CNN "Manufacturer"
F 7 "74279218" H 14525 5150 50  0001 C CNN "Manufacturer_No"
F 8 "MULTILAYER-SMD-FERRITE" H 14525 5150 50  0001 C CNN "Manufacturer_Desc"
	1    14525 5150
	1    0    0    -1  
$EndComp
$Comp
L cpu-board:GND #U$0372
U 1 1 C1E0916E
P 11700 5575
F 0 "#U$0372" H 11700 5575 50  0001 C CNN
F 1 "GND" H 11612 5488 59  0000 L BNN
F 2 "" H 11700 5575 50  0001 C CNN
F 3 "" H 11700 5575 50  0001 C CNN
	1    11700 5575
	1    0    0    -1  
$EndComp
$Comp
L cpu-board:GND #U$0390
U 1 1 EC60E719
P 11700 3900
F 0 "#U$0390" H 11700 3900 50  0001 C CNN
F 1 "GND" H 11613 3825 59  0000 L BNN
F 2 "" H 11700 3900 50  0001 C CNN
F 3 "" H 11700 3900 50  0001 C CNN
	1    11700 3900
	-1   0    0    1   
$EndComp
$Comp
L cpu-board:74279263 L36
U 1 1 99D0EAD2
P 4950 9775
AR Path="/99D0EAD2" Ref="L36"  Part="1" 
AR Path="/5E926050/99D0EAD2" Ref="L36"  Part="1" 
F 0 "L36" H 4913 9850 42  0000 L BNN
F 1 "Ferrite 200mA" H 4850 9825 34  0001 L BNN
F 2 "AllModules:C0603_1" H 4950 9775 50  0001 C CNN
F 3 "" H 4950 9775 50  0001 C CNN
	1    4950 9775
	1    0    0    -1  
$EndComp
$Comp
L cpu-board:74279263 L38
U 1 1 FD4FC626
P 4950 9375
AR Path="/FD4FC626" Ref="L38"  Part="1" 
AR Path="/5E926050/FD4FC626" Ref="L38"  Part="1" 
F 0 "L38" H 4888 9425 42  0000 L BNN
F 1 "Ferrite 200mA" H 4850 9425 34  0001 L BNN
F 2 "AllModules:C0603_1" H 4950 9375 50  0001 C CNN
F 3 "" H 4950 9375 50  0001 C CNN
	1    4950 9375
	1    0    0    -1  
$EndComp
$Comp
L cpu-board:74279263 L39
U 1 1 37C2E7A2
P 4950 9175
AR Path="/37C2E7A2" Ref="L39"  Part="1" 
AR Path="/5E926050/37C2E7A2" Ref="L39"  Part="1" 
F 0 "L39" H 4887 9225 42  0000 L BNN
F 1 "Ferrite 200mA" H 4850 9225 34  0001 L BNN
F 2 "AllModules:C0603_1" H 4950 9175 50  0001 C CNN
F 3 "" H 4950 9175 50  0001 C CNN
	1    4950 9175
	1    0    0    -1  
$EndComp
$Comp
L cpu-board:74279263 L40
U 1 1 D8418348
P 4950 8975
AR Path="/D8418348" Ref="L40"  Part="1" 
AR Path="/5E926050/D8418348" Ref="L40"  Part="1" 
F 0 "L40" H 4887 9025 42  0000 L BNN
F 1 "Ferrite 200mA" H 4850 9025 34  0001 L BNN
F 2 "AllModules:C0603_1" H 4950 8975 50  0001 C CNN
F 3 "" H 4950 8975 50  0001 C CNN
	1    4950 8975
	1    0    0    -1  
$EndComp
$Comp
L cpu-board:74279263 L41
U 1 1 D7B52F8F
P 4950 8775
AR Path="/D7B52F8F" Ref="L41"  Part="1" 
AR Path="/5E926050/D7B52F8F" Ref="L41"  Part="1" 
F 0 "L41" H 4887 8825 42  0000 L BNN
F 1 "Ferrite 200mA" H 4850 8825 34  0001 L BNN
F 2 "AllModules:C0603_1" H 4950 8775 50  0001 C CNN
F 3 "" H 4950 8775 50  0001 C CNN
	1    4950 8775
	1    0    0    -1  
$EndComp
$Comp
L cpu-board:RESEAU_4C C17
U 1 1 D8976320
P 2975 10475
F 0 "C17" H 2300 10475 64  0000 L BNN
F 1 "47pF" H 2312 10375 42  0000 L BNN
F 2 "AllModules:C0612-4_1" H 2975 10475 50  0001 C CNN
F 3 "" H 2975 10475 50  0001 C CNN
F 4 "CAPACITOR ARRAY, 47PF, 50V, +/-10%,NPO,0612" H 2975 10475 50  0001 C CNN "Description"
F 5 "10095973" H 2975 10475 50  0001 C CNN "Item Number"
F 6 "YAGEO_RMS1" H 2975 10475 50  0001 C CNN "Manufacturer"
F 7 "225514611532" H 2975 10475 50  0001 C CNN "Manufacturer_No"
F 8 "ISOLATED C NETWORK, 50V, C0G, 0.000047UF, SURFACE MOUNT, CHIP-8" H 2975 10475 50  0001 C CNN "Manufacturer_Desc"
	1    2975 10475
	1    0    0    -1  
$EndComp
$Comp
L cpu-board:GND #U$0269
U 1 1 2392FE28
P 2925 10825
F 0 "#U$0269" H 2925 10825 50  0001 C CNN
F 1 "GND" H 2837 10737 59  0000 L BNN
F 2 "" H 2925 10825 50  0001 C CNN
F 3 "" H 2925 10825 50  0001 C CNN
	1    2925 10825
	1    0    0    -1  
$EndComp
$Comp
L cpu-board:GND #U$0270
U 1 1 CD82BA79
P 3275 8675
F 0 "#U$0270" H 3275 8675 50  0001 C CNN
F 1 "GND" H 3187 8587 59  0000 L BNN
F 2 "" H 3275 8675 50  0001 C CNN
F 3 "" H 3275 8675 50  0001 C CNN
	1    3275 8675
	1    0    0    -1  
$EndComp
$Comp
L cpu-board:RESEAU_4C C18
U 1 1 03290900
P 3825 10475
F 0 "C18" H 4237 10500 64  0000 L BNN
F 1 "47pF" H 4250 10400 42  0000 L BNN
F 2 "AllModules:C0612-4_1" H 3825 10475 50  0001 C CNN
F 3 "" H 3825 10475 50  0001 C CNN
F 4 "CAPACITOR ARRAY, 47PF, 50V, +/-10%,NPO,0612" H 3825 10475 50  0001 C CNN "Description"
F 5 "10095973" H 3825 10475 50  0001 C CNN "Item Number"
F 6 "YAGEO_RMS1" H 3825 10475 50  0001 C CNN "Manufacturer"
F 7 "225514611532" H 3825 10475 50  0001 C CNN "Manufacturer_No"
F 8 "ISOLATED C NETWORK, 50V, C0G, 0.000047UF, SURFACE MOUNT, CHIP-8" H 3825 10475 50  0001 C CNN "Manufacturer_Desc"
	1    3825 10475
	1    0    0    -1  
$EndComp
$Comp
L cpu-board:+3,3V #U$0363
U 1 1 769C1ACA
P 3225 8075
F 0 "#U$0363" H 3225 8075 50  0001 C CNN
F 1 "+3,3V" H 3200 8288 59  0000 L BNN
F 2 "" H 3225 8075 50  0001 C CNN
F 3 "" H 3225 8075 50  0001 C CNN
	1    3225 8075
	1    0    0    -1  
$EndComp
$Comp
L cpu-board:TANTALB C19
U 1 1 9CA42FFB
P 3225 8425
F 0 "C19" H 3338 8406 56  0000 L BNN
F 1 "47uF" H 3338 8343 42  0000 L BNN
F 2 "AllModules:C3528_1" H 3225 8425 50  0001 C CNN
F 3 "" H 3225 8425 50  0001 C CNN
F 4 "CAPACITOR TANALUM, 47UF, 10V +/-10%" H 3225 8425 50  0001 C CNN "Description"
F 5 "10022962" H 3225 8425 50  0001 C CNN "Item Number"
F 6 "KEMET" H 3225 8425 50  0001 C CNN "Manufacturer"
F 7 "T495B476K010ATE500" H 3225 8425 50  0001 C CNN "Manufacturer_No"
F 8 "Cap, Tantalum, Polarized, 10V, 10% +/-Tol, 47uF, Surface Mount, Case B, EIA Metric 3528" H 3225 8425 50  0001 C CNN "Manufacturer_Desc"
	1    3225 8425
	1    0    0    -1  
$EndComp
$Comp
L cpu-board:B12B-ZR J3
U 1 1 7D94D0D3
P 2275 10075
F 0 "J3" H 2200 9975 59  0000 L BNN
F 1 " " H 2200 9887 59  0000 L BNN
F 2 "AllModules:B12BZR-SM3TF_1" H 2275 10075 50  0001 C CNN
F 3 "" H 2275 10075 50  0001 C CNN
F 4 "CONNECTOR, SPO2, 12 CONTACTS" H 2275 10075 50  0001 C CNN "Description"
F 5 "10097259" H 2275 10075 50  0001 C CNN "Item Number"
F 6 "J.S.T. CORPORATION" H 2275 10075 50  0001 C CNN "Manufacturer"
F 7 "B12B-ZR-SM4-TF (LF)(SN)" H 2275 10075 50  0001 C CNN "Manufacturer_No"
F 8 "CONNECTOR" H 2275 10075 50  0001 C CNN "Manufacturer_Desc"
	1    2275 10075
	1    0    0    -1  
$EndComp
$Comp
L cpu-board:GND #U$0408
U 1 1 CEE6CBD5
P 4725 10550
F 0 "#U$0408" H 4725 10550 50  0001 C CNN
F 1 "GND" H 4637 10462 59  0000 L BNN
F 2 "" H 4725 10550 50  0001 C CNN
F 3 "" H 4725 10550 50  0001 C CNN
	1    4725 10550
	1    0    0    -1  
$EndComp
$Comp
L cpu-board:IRLML5103 T16
U 1 1 0F564599
P 7250 9300
F 0 "T16" H 6815 8962 59  0000 L BNN
F 1 "IRLML5103" H 6840 9055 56  0000 L BNN
F 2 "AllModules:SOT23-GSD_1" H 7250 9300 50  0001 C CNN
F 3 "" H 7250 9300 50  0001 C CNN
	1    7250 9300
	1    0    0    1   
$EndComp
$Comp
L cpu-board:R0805 R47
U 1 1 65CD8F11
P 6675 9500
F 0 "R47" V 6787 9400 64  0000 R TNN
F 1 "10k" V 6700 9400 42  0000 R TNN
F 2 "AllModules:R0603_1" H 6675 9500 50  0001 C CNN
F 3 "" H 6675 9500 50  0001 C CNN
	1    6675 9500
	0    -1   -1   0   
$EndComp
$Comp
L cpu-board:74279263 L35
U 1 1 3EE6CC19
P 4950 8200
AR Path="/3EE6CC19" Ref="L35"  Part="1" 
AR Path="/5E926050/3EE6CC19" Ref="L35"  Part="1" 
F 0 "L35" H 4888 8250 42  0000 L BNN
F 1 "Ferrite 200mA" H 4850 8250 34  0001 L BNN
F 2 "AllModules:C0603_1" H 4950 8200 50  0001 C CNN
F 3 "" H 4950 8200 50  0001 C CNN
F 4 "SMD FERRITE 200MA" H 4950 8200 50  0001 C CNN "Description"
F 5 "10022907" H 4950 8200 50  0001 C CNN "Item Number"
F 6 "WURTH ELEKTRONIK GMBH" H 4950 8200 50  0001 C CNN "Manufacturer"
F 7 "74279266" H 4950 8200 50  0001 C CNN "Manufacturer_No"
F 8 "MULTILAYER-SMD-FERRITE" H 4950 8200 50  0001 C CNN "Manufacturer_Desc"
	1    4950 8200
	1    0    0    -1  
$EndComp
$Comp
L cpu-board:74279263 L42
U 1 1 68BA90A5
P 4950 7475
AR Path="/68BA90A5" Ref="L42"  Part="1" 
AR Path="/5E926050/68BA90A5" Ref="L42"  Part="1" 
F 0 "L42" H 4888 7525 42  0000 L BNN
F 1 "Ferrite 200mA" H 4850 7525 34  0001 L BNN
F 2 "AllModules:C0603_1" H 4950 7475 50  0001 C CNN
F 3 "" H 4950 7475 50  0001 C CNN
F 4 "SMD FERRITE 200MA" H 4950 7475 50  0001 C CNN "Description"
F 5 "10022907" H 4950 7475 50  0001 C CNN "Item Number"
F 6 "WURTH ELEKTRONIK GMBH" H 4950 7475 50  0001 C CNN "Manufacturer"
F 7 "74279266" H 4950 7475 50  0001 C CNN "Manufacturer_No"
F 8 "MULTILAYER-SMD-FERRITE" H 4950 7475 50  0001 C CNN "Manufacturer_Desc"
	1    4950 7475
	1    0    0    -1  
$EndComp
$Comp
L cpu-board:C0603 C87
U 1 1 DE7D17FD
P 5925 7725
F 0 "C87" H 6006 7775 64  0000 L BNN
F 1 "100nF" H 6012 7694 42  0000 L BNN
F 2 "AllModules:C0402_1" H 5925 7725 50  0001 C CNN
F 3 "" H 5925 7725 50  0001 C CNN
	1    5925 7725
	1    0    0    -1  
$EndComp
$Comp
L cpu-board:GND #U$045
U 1 1 1641756A
P 6675 9825
F 0 "#U$045" H 6675 9825 50  0001 C CNN
F 1 "GND" H 6587 9737 59  0000 L BNN
F 2 "" H 6675 9825 50  0001 C CNN
F 3 "" H 6675 9825 50  0001 C CNN
	1    6675 9825
	1    0    0    -1  
$EndComp
$Comp
L cpu-board:GND #U$0410
U 1 1 B9730BBC
P 5925 7975
F 0 "#U$0410" H 5925 7975 50  0001 C CNN
F 1 "GND" H 5837 7887 59  0000 L BNN
F 2 "" H 5925 7975 50  0001 C CNN
F 3 "" H 5925 7975 50  0001 C CNN
	1    5925 7975
	1    0    0    -1  
$EndComp
$Comp
L cpu-board:JUMP_0U JP1
U 1 1 0B60073D
P 4725 10225
F 0 "JP1" V 4813 10288 51  0000 L BNN
F 1 "JUMP_0U" H 4513 10075 51  0001 L BNN
F 2 "AllModules:R0603_1" H 4725 10225 50  0001 C CNN
F 3 "" H 4725 10225 50  0001 C CNN
F 4 "RESISTANCE, 0 OHM,0603" H 4725 10225 50  0001 C CNN "Description"
F 5 "10023185" H 4725 10225 50  0001 C CNN "Item Number"
F 6 "YAGEO_RMS1" H 4725 10225 50  0001 C CNN "Manufacturer"
F 7 "RC0603JR-070RL" H 4725 10225 50  0001 C CNN "Manufacturer_No"
F 8 "RES 0.0 OHM 1/10W 0603 SMD" H 4725 10225 50  0001 C CNN "Manufacturer_Desc"
F 9 "YAGEO_RMS1" H 4725 10225 50  0001 C CNN "Manufacturer2"
F 10 "232270296001" H 4725 10225 50  0001 C CNN "Manufacturer_No2"
F 11 "JUMPER, METAL GLAZE/THICK FILM, 0.1 W, 0 OHM, SURFACE MOUNT, 0603" H 4725 10225 50  0001 C CNN "Manufacturer_Desc2"
F 12 "YAGEO_RMS1" H 4725 10225 50  0001 C CNN "Manufacturer3"
F 13 "232270296001L" H 4725 10225 50  0001 C CNN "Manufacturer_No3"
F 14 "JUMPER, METAL GLAZE/THICK FILM, 0.1 W, 0 OHM, SURFACE MOUNT, 0603" H 4725 10225 50  0001 C CNN "Manufacturer_Desc3"
F 15 "ASJ" H 4725 10225 50  0001 C CNN "Manufacturer4"
F 16 "CR16000ZL" H 4725 10225 50  0001 C CNN "Manufacturer_No4"
F 17 "THICK FILM CHIP RESISTOR" H 4725 10225 50  0001 C CNN "Manufacturer_Desc4"
F 18 "KAMAYA                          (049580)" H 4725 10225 50  0001 C CNN "Manufacturer5"
F 19 "RMC1/16JPTP" H 4725 10225 50  0001 C CNN "Manufacturer_No5"
F 20 "JUMPER" H 4725 10225 50  0001 C CNN "Manufacturer_Desc5"
	1    4725 10225
	0    -1   -1   0   
$EndComp
$Comp
L cpu-board:74279263 L46
U 1 1 17AB747C
P 14525 4650
AR Path="/17AB747C" Ref="L46"  Part="1" 
AR Path="/5E926050/17AB747C" Ref="L46"  Part="1" 
F 0 "L46" H 14462 4625 42  0000 L BNN
F 1 "Ferrite 200mA" H 14425 4700 34  0001 L BNN
F 2 "AllModules:C0603_1" H 14525 4650 50  0001 C CNN
F 3 "" H 14525 4650 50  0001 C CNN
F 4 "SMD FERRITE 200MA" H 14525 4650 50  0001 C CNN "Description"
F 5 "10022907" H 14525 4650 50  0001 C CNN "Item Number"
F 6 "WURTH ELEKTRONIK GMBH" H 14525 4650 50  0001 C CNN "Manufacturer"
F 7 "74279266" H 14525 4650 50  0001 C CNN "Manufacturer_No"
F 8 "MULTILAYER-SMD-FERRITE" H 14525 4650 50  0001 C CNN "Manufacturer_Desc"
	1    14525 4650
	1    0    0    -1  
$EndComp
$Comp
L cpu-board:74279263 L51
U 1 1 49C38A30
P 8650 4250
AR Path="/49C38A30" Ref="L51"  Part="1" 
AR Path="/5E926050/49C38A30" Ref="L51"  Part="1" 
F 0 "L51" H 8588 4225 42  0000 L BNN
F 1 "Ferrite 200mA" H 8550 4300 34  0001 L BNN
F 2 "AllModules:C0603_1" H 8650 4250 50  0001 C CNN
F 3 "" H 8650 4250 50  0001 C CNN
F 4 "SMD FERRITE 200MA" H 8650 4250 50  0001 C CNN "Description"
F 5 "10022907" H 8650 4250 50  0001 C CNN "Item Number"
F 6 "WURTH ELEKTRONIK GMBH" H 8650 4250 50  0001 C CNN "Manufacturer"
F 7 "74279266" H 8650 4250 50  0001 C CNN "Manufacturer_No"
F 8 "MULTILAYER-SMD-FERRITE" H 8650 4250 50  0001 C CNN "Manufacturer_Desc"
	1    8650 4250
	1    0    0    -1  
$EndComp
$Comp
L cpu-board:74279263 L52
U 1 1 5D3B4218
P 8650 4450
AR Path="/5D3B4218" Ref="L52"  Part="1" 
AR Path="/5E926050/5D3B4218" Ref="L52"  Part="1" 
F 0 "L52" H 8588 4425 42  0000 L BNN
F 1 "Ferrite 200mA" H 8550 4500 34  0001 L BNN
F 2 "AllModules:C0603_1" H 8650 4450 50  0001 C CNN
F 3 "" H 8650 4450 50  0001 C CNN
F 4 "SMD FERRITE 200MA" H 8650 4450 50  0001 C CNN "Description"
F 5 "10022907" H 8650 4450 50  0001 C CNN "Item Number"
F 6 "WURTH ELEKTRONIK GMBH" H 8650 4450 50  0001 C CNN "Manufacturer"
F 7 "74279266" H 8650 4450 50  0001 C CNN "Manufacturer_No"
F 8 "MULTILAYER-SMD-FERRITE" H 8650 4450 50  0001 C CNN "Manufacturer_Desc"
	1    8650 4450
	1    0    0    -1  
$EndComp
$Comp
L cpu-board:RESEAU_4C C111
U 1 1 C2212B5B
P 12300 6325
F 0 "C111" H 12150 5963 64  0000 L BNN
F 1 "47pF" H 12162 5888 42  0000 L BNN
F 2 "AllModules:C0612-4_1" H 12300 6325 50  0001 C CNN
F 3 "" H 12300 6325 50  0001 C CNN
F 4 "CAPACITOR ARRAY, 47PF, 50V, +/-10%,NPO,0612" H 12300 6325 50  0001 C CNN "Description"
F 5 "10095973" H 12300 6325 50  0001 C CNN "Item Number"
F 6 "YAGEO_RMS1" H 12300 6325 50  0001 C CNN "Manufacturer"
F 7 "225514611532" H 12300 6325 50  0001 C CNN "Manufacturer_No"
F 8 "ISOLATED C NETWORK, 50V, C0G, 0.000047UF, SURFACE MOUNT, CHIP-8" H 12300 6325 50  0001 C CNN "Manufacturer_Desc"
	1    12300 6325
	1    0    0    -1  
$EndComp
$Comp
L cpu-board:74279263 L53
U 1 1 983C8A5F
P 14525 5050
AR Path="/983C8A5F" Ref="L53"  Part="1" 
AR Path="/5E926050/983C8A5F" Ref="L53"  Part="1" 
F 0 "L53" H 14462 5025 42  0000 L BNN
F 1 "Ferrite 200mA" H 14425 5100 34  0001 L BNN
F 2 "AllModules:C0603_1" H 14525 5050 50  0001 C CNN
F 3 "" H 14525 5050 50  0001 C CNN
F 4 "SMD FERRITE 200MA" H 14525 5050 50  0001 C CNN "Description"
F 5 "10022907" H 14525 5050 50  0001 C CNN "Item Number"
F 6 "WURTH ELEKTRONIK GMBH" H 14525 5050 50  0001 C CNN "Manufacturer"
F 7 "74279266" H 14525 5050 50  0001 C CNN "Manufacturer_No"
F 8 "MULTILAYER-SMD-FERRITE" H 14525 5050 50  0001 C CNN "Manufacturer_Desc"
	1    14525 5050
	1    0    0    -1  
$EndComp
$Comp
L cpu-board:R0805 L5
U 1 1 E13C76CE
P 8650 4950
F 0 "L5" H 8775 4963 64  0000 L BNN
F 1 "470" H 8775 4888 42  0000 L BNN
F 2 "AllModules:C0603_1" H 8650 4950 50  0001 C CNN
F 3 "" H 8650 4950 50  0001 C CNN
F 4 "RESISTOR, 470 OHM, 0.063W, +/-5%" H 8650 4950 50  0001 C CNN "Description"
F 5 "10022544" H 8650 4950 50  0001 C CNN "Item Number"
F 6 "YAGEO_RMS1" H 8650 4950 50  0001 C CNN "Manufacturer"
F 7 "232270260471" H 8650 4950 50  0001 C CNN "Manufacturer_No"
F 8 "RESISTOR, METAL GLAZE/THICK FILM, 0.1 W, 5 %, 100 PPM, 470 OHM, SURFACE MOUNT, 0603" H 8650 4950 50  0001 C CNN "Manufacturer_Desc"
F 9 "VISHAY_RMS1" H 8650 4950 50  0001 C CNN "Manufacturer2"
F 10 "CRCW0603470RJNEA" H 8650 4950 50  0001 C CNN "Manufacturer_No2"
F 11 "RESISTOR" H 8650 4950 50  0001 C CNN "Manufacturer_Desc2"
F 12 "YAGEO_RMS1" H 8650 4950 50  0001 C CNN "Manufacturer3"
F 13 "232270260471L" H 8650 4950 50  0001 C CNN "Manufacturer_No3"
F 14 "RESISTOR, METAL GLAZE/THICK FILM, 0.1 W, 5 %, 100 PPM, 470 OHM, SURFACE MOUNT, 0603" H 8650 4950 50  0001 C CNN "Manufacturer_Desc3"
F 15 "ASJ" H 8650 4950 50  0001 C CNN "Manufacturer4"
F 16 "CR16-471JL" H 8650 4950 50  0001 C CNN "Manufacturer_No4"
F 17 "THICK FILM CHIP RESISTOR" H 8650 4950 50  0001 C CNN "Manufacturer_Desc4"
F 18 "YAGEO_RMS1" H 8650 4950 50  0001 C CNN "Manufacturer5"
F 19 "RC0603JR-07470RL" H 8650 4950 50  0001 C CNN "Manufacturer_No5"
F 20 "RESISTOR, METAL GLAZE/THICK FILM, 0.1 W, 5 %, 100 PPM, 470 OHM, SURFACE MOUNT, 0603" H 8650 4950 50  0001 C CNN "Manufacturer_Desc5"
	1    8650 4950
	1    0    0    -1  
$EndComp
Wire Notes Line
	862  763  7137 763 
Wire Notes Line
	862  763  862  7250
Wire Notes Line
	7137 763  7137 7250
Wire Notes Line
	2550 4075 2637 4025
Wire Notes Line
	2637 4025 2550 3975
Wire Notes Line
	2562 3950 2600 3913
Wire Notes Line
	2600 3913 2600 3950
Wire Notes Line
	2600 3950 2650 3913
Wire Notes Line
	2650 3913 2625 3913
Wire Notes Line
	2650 3913 2637 3938
Wire Notes Line
	2550 3675 2637 3625
Wire Notes Line
	2637 3625 2550 3575
Wire Notes Line
	2550 3563 2587 3525
Wire Notes Line
	2587 3525 2587 3563
Wire Notes Line
	2587 3563 2637 3525
Wire Notes Line
	2637 3525 2612 3525
Wire Notes Line
	2637 3525 2625 3550
Wire Notes Line
	2550 3088 2550 3050
Wire Notes Line
	2550 3038 2550 2988
Wire Notes Line
	2550 2988 2637 3038
Wire Notes Line
	2637 3038 2550 3088
Wire Notes Line
	2562 2963 2600 2925
Wire Notes Line
	2600 2925 2600 2963
Wire Notes Line
	2600 2963 2650 2925
Wire Notes Line
	2650 2925 2625 2925
Wire Notes Line
	2650 2925 2637 2950
Wire Notes Line
	2537 4775 2625 4825
Wire Notes Line
	2625 4825 2537 4875
Wire Notes Line
	2550 4750 2587 4713
Wire Notes Line
	2587 4713 2587 4750
Wire Notes Line
	2587 4750 2637 4713
Wire Notes Line
	2637 4713 2625 4738
Wire Notes Line
	2550 4275 2637 4225
Wire Notes Line
	2637 4225 2550 4175
Wire Notes Line
	2550 4163 2587 4125
Wire Notes Line
	2587 4125 2587 4163
Wire Notes Line
	2587 4163 2637 4125
Wire Notes Line
	2637 4125 2612 4125
Wire Notes Line
	2637 4125 2625 4150
Wire Notes Line
	2812 1825 925  1825
Wire Notes Line
	2812 2025 1400 2025
Wire Notes Line
	1125 2225 1125 2288
Wire Notes Line
	1600 2225 1600 2288
Wire Notes Line
	2187 2225 2187 2288
Wire Notes Line
	925  2500 975  2500
Wire Notes Line
	1400 2500 1450 2500
Wire Notes Line
	1987 2500 2037 2500
Wire Notes Line
	1012 2525 1150 2325
Wire Notes Line
	1487 2525 1625 2325
Wire Notes Line
	2075 2525 2212 2325
Wire Notes Line
	1125 2625 1125 2688
Wire Notes Line
	1600 2625 1600 2688
Wire Notes Line
	925  2900 975  2900
Wire Notes Line
	1400 2900 1450 2900
Wire Notes Line
	1012 2925 1150 2725
Wire Notes Line
	1487 2925 1625 2725
Wire Notes Line
	1137 5425 1137 5488
Wire Notes Line
	937  5700 987  5700
Wire Notes Line
	1025 5725 1162 5525
Wire Notes Line
	2812 5425 1137 5425
Wire Notes Line
	862  7250 7137 7250
Wire Notes Line
	2550 3388 2550 3488
Wire Notes Line
	2550 3488 2637 3438
Wire Notes Line
	2637 3438 2550 3388
Wire Notes Line
	2550 3375 2587 3338
Wire Notes Line
	2587 3338 2587 3375
Wire Notes Line
	2587 3375 2637 3338
Wire Notes Line
	2637 3338 2612 3338
Wire Notes Line
	2637 3338 2625 3363
Wire Notes Line
	8300 763  8300 3225
Wire Notes Line
	8300 763  16062 763 
Wire Notes Line
	16062 3225 16062 763 
Wire Notes Line
	16062 3225 8300 3225
Wire Notes Line
	2187 2625 2187 2688
Wire Notes Line
	1987 2900 2037 2900
Wire Notes Line
	2075 2925 2212 2725
Wire Notes Line
	1150 5775 1150 5838
Wire Notes Line
	937  6050 1000 6050
Wire Notes Line
	1037 6075 1175 5875
Wire Notes Line
	2037 5775 1150 5775
Wire Notes Line
	850  10950 862  7313
Wire Notes Line
	8262 10950 8262 7313
Wire Notes Line
	1087 5638 1087 6000
Wire Notes Line
	2537 5175 2625 5225
Wire Notes Line
	2625 5225 2537 5275
Wire Notes Line
	2550 5150 2587 5113
Wire Notes Line
	2587 5113 2587 5150
Wire Notes Line
	2587 5150 2637 5113
Wire Notes Line
	2637 5113 2612 5113
Wire Notes Line
	2637 5113 2625 5138
Wire Notes Line
	2362 3438 2550 3438
Wire Notes Line
	2550 3625 2362 3625
Wire Notes Line
	2550 3038 2375 3038
Wire Notes Line
	2375 5225 2537 5225
Wire Notes Line
	2787 1625 937  1625
Wire Notes Line
	16050 7013 7237 7013
Wire Notes Line
	7237 3313 7237 7013
Wire Notes Line
	16050 3313 16050 7013
Wire Notes Line
	1262 8663 1250 8663
Wire Notes Line
	1250 8663 1225 8688
Wire Notes Line
	1225 8688 1225 9363
Wire Notes Line
	1225 9363 1200 9388
Wire Notes Line
	1200 9388 1225 9413
Wire Notes Line
	1225 9413 1225 10013
Wire Notes Line
	1225 10013 1250 10038
Wire Notes Line
	1250 10038 1275 10038
Wire Notes Line
	1262 8613 1250 8613
Wire Notes Line
	1250 8613 1225 8588
Wire Notes Line
	1225 8588 1225 8300
Wire Notes Line
	1225 8300 1200 8275
Wire Notes Line
	1200 8275 1225 8250
Wire Notes Line
	1225 8250 1225 7938
Wire Notes Line
	1225 7938 1250 7913
Wire Notes Line
	1250 7913 1262 7913
Wire Notes Line
	2287 9775 1825 9775
Wire Notes Line
	2287 9388 1825 9388
Wire Notes Line
	1987 9363 1987 9813
Wire Notes Line
	1987 9363 2087 9363
Wire Notes Line
	1987 9813 2087 9813
Wire Notes Line
	2287 9575 2087 9575
Wire Notes Line
	2275 9975 1887 9975
Wire Notes Line
	2275 9175 1812 9175
Wire Notes Line
	2275 8975 1812 8975
Wire Notes Line
	2275 8775 1812 8775
Wire Notes Line
	2275 8575 1812 8575
Wire Notes Line
	2275 8375 1812 8375
Wire Notes Line
	2275 8175 1812 8175
Wire Notes Line
	1837 7675 1837 9838
Wire Notes Line
	1937 7675 1937 9838
Wire Notes Line
	1837 7675 1937 7675
Wire Notes Line
	1837 9838 1887 9888
Wire Notes Line
	1887 9888 1937 9838
Wire Notes Line
	1887 9888 1887 9975
Wire Notes Line
	862  7313 8262 7313
Wire Notes Line
	850  10950 8262 10950
Wire Notes Line
	5075 10450 5075 8438
Wire Notes Line
	5825 10450 5825 8438
Wire Notes Line
	5075 8438 5825 8438
Wire Notes Line
	5075 10450 5825 10450
Wire Notes Line
	2275 7963 1812 7963
Wire Notes Line
	2275 7775 1812 7775
Wire Notes Line
	1350 7775 1350 7963
Wire Notes Line
	1350 7963 1475 7963
Wire Notes Line
	1350 7775 1475 7775
Wire Notes Line
	2587 2425 2812 2425
Wire Notes Line
	2587 2425 2587 2100
Wire Notes Line
	2587 2100 1987 2100
Wire Notes Line
	2812 3038 2637 3038
Wire Notes Line
	2812 3225 2375 3225
Wire Notes Line
	2375 3038 2375 3225
Wire Notes Line
	2812 3438 2637 3438
Wire Notes Line
	2812 3625 2637 3625
Wire Notes Line
	2812 3825 2362 3825
Wire Notes Line
	2812 4025 2637 4025
Wire Notes Line
	2812 4225 2637 4225
Wire Notes Line
	2550 4025 2375 4025
Wire Notes Line
	2550 4225 2375 4225
Wire Notes Line
	2812 4425 2375 4425
Wire Notes Line
	2812 4625 2375 4625
Wire Notes Line
	2812 4825 2625 4825
Wire Notes Line
	2537 4825 2375 4825
Wire Notes Line
	2375 4625 2375 4825
Wire Notes Line
	2812 5225 2625 5225
Wire Notes Line
	2812 5025 2375 5025
Wire Notes Line
	2375 5025 2375 5225
Wire Notes Line
	2812 5625 2037 5625
Wire Notes Line
	2800 5825 2362 5825
Wire Notes Line
	2362 5825 2362 6225
Wire Notes Line
	937  6225 2362 6225
Wire Notes Line
	2037 5625 2037 5775
Text Notes 1487 4050 0    59   ~ 0
Red Alarme LED
Text Notes 1512 4800 0    59   ~ 0
AC LED
Text Notes 1487 3638 0    59   ~ 0
VENTILATION LED
Text Notes 1512 5225 0    59   ~ 0
DC LED
Text Notes 1487 4250 0    59   ~ 0
Orange Alarm LED
Text Notes 1462 2200 0    56   ~ 0
VALID
Text Notes 2012 2200 0    56   ~ 0
NAVIG
Text Notes 937  2613 0    56   ~ 0
100%O2
Text Notes 1437 2613 0    56   ~ 0
VENTIL(O/I)
Text Notes 2012 2613 0    56   ~ 0
TOP(+)
Text Notes 950  913  0    59   ~ 0
KEYBOARD CONNECTOR
Text Notes 1162 5388 0    56   ~ 0
INHIB ALARM
Text Notes 1500 3450 0    59   ~ 0
100% O² LED
Text Notes 11025 2725 1    47   ~ 0
RESERVED
Text Notes 11225 2725 1    47   ~ 0
RESERVED
Text Notes 1137 5750 0    56   ~ 0
INHIB-STOP-INV
Text Notes 962  7463 0    59   ~ 0
SpO2 FONCTION
Text Notes 1050 9975 1    73   ~ 0
Vers Sub-D 9Br
Text Notes 1275 10013 0    47   ~ 0
Pin 7 Sub-D
Text Notes 1275 9813 0    47   ~ 0
Pin 5 Sub-D
Text Notes 1275 9413 0    47   ~ 0
Pin 9 Sub-D
Text Notes 1275 9213 0    47   ~ 0
Pin 6 Sub-D
Text Notes 1275 9013 0    47   ~ 0
Pin 2 Sub-D
Text Notes 1275 8813 0    47   ~ 0
Pin 3 Sub-D
Text Notes 1287 9613 0    47   ~ 0
Signal Shield
Text Notes 1437 1550 0    59   ~ 0
Keyboard Shielding
Text Notes 1500 3100 0    59   ~ 0
Battery Charge LED
Text Notes 8362 925  0    59   ~ 0
DISPLAY BOARD CONNECTOR
Text Notes 7350 3500 0    59   ~ 0
POWER SUPPLY MANAGEMENT CONNECTOR
Text Notes 950  2200 0    56   ~ 0
BOTTOM(-)
Text Notes 15825 10788 0    59   ~ 0
A
Text Notes 16100 10788 0    59   ~ 0
05/03/14
Text Notes 16600 10800 0    59   ~ 0
JR
Text Notes 1350 8188 0    47   ~ 0
3V3
Text Notes 1275 8400 0    47   ~ 0
Serial Output
Text Notes 1275 8600 0    47   ~ 0
Ground
Text Notes 1175 9800 1    64   ~ 0
Capteur SPO2
Text Notes 1050 8600 1    64   ~ 0
Capteur SPO2
Text Notes 1175 8375 1    64   ~ 0
XPOD
Text Notes 5225 10400 0    59   ~ 0
Carte SPO2
Text Notes 12075 1625 0    59   ~ 0
DISPLAY BOARD
Wire Notes Line
	2550 3975 2550 4075
Wire Notes Line
	2637 3975 2637 4075
Wire Notes Line
	2550 3575 2550 3675
Wire Notes Line
	2637 3575 2637 3675
Wire Notes Line
	2637 2988 2637 3088
Wire Notes Line
	2537 4775 2537 4875
Wire Notes Line
	2625 4775 2625 4875
Wire Notes Line
	2550 4175 2550 4275
Wire Notes Line
	2637 4175 2637 4275
Wire Notes Line
	1400 2025 1400 2900
Wire Notes Line
	1987 2100 1987 2900
Wire Notes Line
	925  1825 925  2900
Wire Notes Line
	1125 2625 2812 2625
Wire Notes Line
	2637 3388 2637 3488
Wire Notes Line
	937  5700 937  6225
Wire Notes Line
	2537 5175 2537 5275
Wire Notes Line
	2625 5175 2625 5275
Wire Notes Line
	7237 3313 16062 3313
Wire Notes Line
	2087 9363 2087 9813
Wire Notes Line
	1125 2225 2812 2225
Wire Notes Line
	2362 3438 2362 3825
Wire Notes Line
	2375 4025 2375 4425
Wire Wire Line
	3550 3025 4400 3025
Wire Wire Line
	3000 5825 3100 5825
$Comp
L cpu-board:R1206 R31
U 1 1 63ABC06C
P 3350 5225
F 0 "R31" H 3088 5312 64  0000 L BNN
F 1 "180" H 3075 5237 42  0000 L BNN
F 2 "AllModules:R0805_1" H 3350 5225 50  0001 C CNN
F 3 "" H 3350 5225 50  0001 C CNN
F 4 "RESISTOR, 180 OHM, 0805, +/-5%" H 3350 5225 50  0001 C CNN "Description"
F 5 "10023240" H 3350 5225 50  0001 C CNN "Item Number"
F 6 "YAGEO_RMS1" H 3350 5225 50  0001 C CNN "Manufacturer"
F 7 "232273061181" H 3350 5225 50  0001 C CNN "Manufacturer_No"
F 8 "RESISTOR, METAL GLAZE/THICK FILM, 0.125 W, 5 %, 100 PPM, 180 OHM, SURFACE MOUNT, 0805" H 3350 5225 50  0001 C CNN "Manufacturer_Desc"
F 9 "KOA SPEER" H 3350 5225 50  0001 C CNN "Manufacturer2"
F 10 "RK73B2ATTD181J" H 3350 5225 50  0001 C CNN "Manufacturer_No2"
F 11 "THICK FILM CHIP RESISTOR" H 3350 5225 50  0001 C CNN "Manufacturer_Desc2"
F 12 "YAGEO_RMS1" H 3350 5225 50  0001 C CNN "Manufacturer3"
F 13 "232273061181L" H 3350 5225 50  0001 C CNN "Manufacturer_No3"
F 14 "RESISTOR, METAL GLAZE/THICK FILM, 0.125 W, 5 %, 100 PPM, 180 OHM, SURFACE MOUNT, 0805" H 3350 5225 50  0001 C CNN "Manufacturer_Desc3"
F 15 "YAGEO_RMS1" H 3350 5225 50  0001 C CNN "Manufacturer4"
F 16 "RC0805JR-07180RL" H 3350 5225 50  0001 C CNN "Manufacturer_No4"
F 17 "RESISTOR, METAL GLAZE/THICK FILM, 0.125 W, 5 %, 100 PPM, 180 OHM, SURFACE MOUNT, 0805" H 3350 5225 50  0001 C CNN "Manufacturer_Desc4"
	1    3350 5225
	1    0    0    -1  
$EndComp
Wire Wire Line
	3600 5225 3550 5225
Wire Wire Line
	3000 5225 3150 5225
NoConn ~ 2800 2825
Wire Wire Line
	3000 4825 3137 4825
NoConn ~ 3000 2825
Wire Wire Line
	3000 3025 3150 3025
Wire Wire Line
	3550 4025 5700 4025
Wire Wire Line
	3550 4225 5100 4225
$Comp
L cpu-board:R0805 R27
U 1 1 4A61E0AF
P 3350 4225
F 0 "R27" H 3075 4312 64  0000 L BNN
F 1 "620" H 3075 4237 42  0000 L BNN
F 2 "AllModules:R0805_1" H 3350 4225 50  0001 C CNN
F 3 "" H 3350 4225 50  0001 C CNN
F 4 "RESISTOR, 620 OHM, 0.125W,+/-5%,0805" H 3350 4225 50  0001 C CNN "Description"
F 5 "10023190" H 3350 4225 50  0001 C CNN "Item Number"
F 6 "MULTICOMP                       (920630)" H 3350 4225 50  0001 C CNN "Manufacturer"
F 7 "MC 0.1W 0805 5% 620R" H 3350 4225 50  0001 C CNN "Manufacturer_No"
F 8 "THICK FILM CHIP RESISTOR" H 3350 4225 50  0001 C CNN "Manufacturer_Desc"
	1    3350 4225
	1    0    0    -1  
$EndComp
Wire Wire Line
	3000 4225 3150 4225
Wire Wire Line
	3000 4025 3150 4025
Wire Wire Line
	3000 3625 3150 3625
Wire Wire Line
	3000 3425 3150 3425
Wire Wire Line
	4525 5300 4525 5350
$Comp
L cpu-board:IRLML2803 T1
U 1 1 C746FFC6
P 4625 5100
F 0 "T1" H 4675 5400 64  0000 R TNN
F 1 "2N7002" H 4675 5325 59  0000 R TNN
F 2 "AllModules:SOT23-GSD_1" H 4625 5100 50  0001 C CNN
F 3 "" H 4625 5100 50  0001 C CNN
F 4 "TRANSISTOR MOSFET N CHANNEL 60V, 0.18A" H 4625 5100 50  0001 C CNN "Description"
F 5 "10097274" H 4625 5100 50  0001 C CNN "Item Number"
F 6 "ON SEMICONDUCTOR_RMS1" H 4625 5100 50  0001 C CNN "Manufacturer"
F 7 "2N7002LT1G" H 4625 5100 50  0001 C CNN "Manufacturer_No"
F 8 "SMALL SIGNAL MOSFET" H 4625 5100 50  0001 C CNN "Manufacturer_Desc"
F 9 "NXP SEMICONDUCTORS_RMS1" H 4625 5100 50  0001 C CNN "Manufacturer2"
F 10 "2N7002,215" H 4625 5100 50  0001 C CNN "Manufacturer_No2"
F 11 "" H 4625 5100 50  0001 C CNN "Manufacturer_Desc2"
F 12 "NXP SEMICONDUCTORS_RMS1" H 4625 5100 50  0001 C CNN "Manufacturer3"
F 13 "2N7002" H 4625 5100 50  0001 C CNN "Manufacturer_No3"
F 14 "N-CHANNEL TRENCHMOS FET" H 4625 5100 50  0001 C CNN "Manufacturer_Desc3"
	1    4625 5100
	-1   0    0    -1  
$EndComp
Wire Wire Line
	4525 4825 4525 4900
Wire Wire Line
	4600 5350 4525 5350
Connection ~ 4525 5350
Wire Wire Line
	4525 5350 4525 5400
Wire Wire Line
	4825 5150 5050 5150
Wire Wire Line
	5050 5150 5050 5350
Wire Wire Line
	5050 5350 5000 5350
Wire Wire Line
	5050 5150 6225 5150
Connection ~ 5050 5150
Wire Wire Line
	5100 4700 5100 4750
Wire Wire Line
	5100 4225 5100 4300
Wire Wire Line
	5175 4750 5100 4750
Connection ~ 5100 4750
Wire Wire Line
	5100 4750 5100 4800
Wire Wire Line
	5400 4550 5625 4550
Wire Wire Line
	5625 4550 5625 4750
Wire Wire Line
	5625 4750 5575 4750
Wire Wire Line
	5625 4550 6525 4550
Connection ~ 5625 4550
Wire Wire Line
	5875 4175 5875 4225
Wire Wire Line
	5950 4225 5875 4225
Connection ~ 5875 4225
Wire Wire Line
	5875 4225 5875 4275
Wire Wire Line
	6175 4025 6400 4025
Wire Wire Line
	6400 4025 6400 4225
Wire Wire Line
	6400 4225 6350 4225
Wire Wire Line
	6525 4025 6400 4025
Connection ~ 6400 4025
Wire Wire Line
	5100 3650 5100 3700
Wire Wire Line
	5175 3700 5100 3700
Connection ~ 5100 3700
Wire Wire Line
	5100 3700 5100 3750
Wire Wire Line
	5400 3500 5625 3500
Wire Wire Line
	5625 3500 5625 3700
Wire Wire Line
	5625 3700 5575 3700
Wire Wire Line
	5625 3500 6525 3500
Connection ~ 5625 3500
Wire Wire Line
	5700 3700 5700 4025
Wire Wire Line
	5700 3700 5875 3700
Wire Wire Line
	5875 3700 5875 3775
Wire Wire Line
	3550 3625 4825 3625
Wire Wire Line
	4825 3625 4825 3125
Wire Wire Line
	4825 3125 5100 3125
Wire Wire Line
	5100 3125 5100 3250
Wire Wire Line
	5600 3150 5600 3200
Wire Wire Line
	5675 3200 5600 3200
Connection ~ 5600 3200
Wire Wire Line
	5600 3200 5600 3250
Wire Wire Line
	5900 3000 6125 3000
Wire Wire Line
	6125 3000 6125 3200
Wire Wire Line
	6125 3200 6075 3200
Wire Wire Line
	6125 3000 6675 3000
Connection ~ 6125 3000
Wire Wire Line
	3550 3425 4625 3425
Wire Wire Line
	4625 3425 4625 2625
Wire Wire Line
	5600 2625 5600 2750
Wire Wire Line
	4625 2625 5600 2625
Wire Wire Line
	5650 2250 5650 2300
Wire Wire Line
	5725 2300 5650 2300
Connection ~ 5650 2300
Wire Wire Line
	5650 2300 5650 2350
Wire Wire Line
	5950 2100 6175 2100
Wire Wire Line
	6175 2100 6175 2300
Wire Wire Line
	6175 2300 6125 2300
Wire Wire Line
	6175 2100 6475 2100
Connection ~ 6175 2100
Wire Wire Line
	4400 1725 5650 1725
Wire Wire Line
	4400 1725 4400 3025
Wire Wire Line
	5650 1725 5650 1850
Wire Wire Line
	2900 8175 2900 7975
Wire Wire Line
	2900 8175 3225 8175
Wire Wire Line
	3225 8175 3225 7975
Connection ~ 2900 8175
Wire Wire Line
	3225 8175 3225 8325
Connection ~ 3225 8175
Wire Wire Line
	2575 7775 3875 7775
Wire Wire Line
	2575 7975 2900 7975
Wire Wire Line
	2575 8175 2900 8175
Wire Wire Line
	2575 8375 3675 8375
Wire Wire Line
	2575 8975 3225 8975
Wire Wire Line
	2575 9175 3025 9175
Wire Wire Line
	2575 9375 2825 9375
Wire Wire Line
	2575 9575 5225 9575
Wire Wire Line
	2575 9775 2625 9775
Wire Wire Line
	2575 8575 3225 8575
Wire Wire Line
	3225 8575 3225 8525
Wire Wire Line
	3275 8575 3225 8575
Connection ~ 3225 8575
Wire Wire Line
	2575 8775 3475 8775
Wire Wire Line
	3475 8775 3475 10325
Connection ~ 3475 8775
Wire Wire Line
	2625 9775 2625 10325
Wire Wire Line
	3225 8975 3225 10325
Wire Wire Line
	3025 9175 3025 10325
Wire Wire Line
	2825 9375 2825 10325
Wire Wire Line
	2625 10625 2625 10700
Wire Wire Line
	2825 10625 2825 10700
Wire Wire Line
	3025 10625 3025 10700
Wire Wire Line
	3225 10625 3225 10700
Wire Wire Line
	3675 8375 3675 10325
Wire Wire Line
	3875 7775 3875 10325
Wire Wire Line
	3475 10625 3475 10700
Wire Wire Line
	3675 10625 3675 10700
Wire Wire Line
	3875 10625 3875 10700
Wire Wire Line
	4075 10625 4075 10700
NoConn ~ 4075 10325
Wire Wire Line
	5100 9775 5225 9775
Wire Wire Line
	5100 9375 5225 9375
Wire Wire Line
	3025 9175 4800 9175
Wire Wire Line
	5100 9175 5225 9175
Wire Wire Line
	3225 8975 4800 8975
Wire Wire Line
	5100 8975 5225 8975
Wire Wire Line
	5100 8775 5225 8775
Wire Wire Line
	3475 8775 4800 8775
Wire Wire Line
	3675 8200 4800 8200
Wire Wire Line
	3675 8200 3675 8375
Wire Wire Line
	6725 8200 5100 8200
Wire Wire Line
	5100 7475 5925 7475
Wire Wire Line
	5925 7825 5925 7875
Wire Wire Line
	5925 7475 5925 7625
$Comp
L cpu-board:LVC1G07DBVT IC6
U 1 1 BE050152
P 7050 10325
F 0 "IC6" H 7025 9913 64  0000 R TNN
F 1 "SN74LVC1G07DBVT" H 7588 9813 59  0000 R TNN
F 2 "AllModules:SOT23-5_1" H 7050 10325 50  0001 C CNN
F 3 "" H 7050 10325 50  0001 C CNN
	1    7050 10325
	1    0    0    -1  
$EndComp
Wire Wire Line
	7650 10325 7750 10325
Wire Wire Line
	7750 8125 7750 8200
Wire Wire Line
	7825 8200 7750 8200
Connection ~ 7750 8200
Wire Wire Line
	7750 8200 7750 10325
Wire Wire Line
	7750 8200 7625 8200
$Comp
L cpu-board:LVC1G07DBVT IC20
U 1 1 7427DFBC
P 7025 8200
F 0 "IC20" H 7050 7850 64  0000 R TNN
F 1 "SN74LVC1G07DBVT" H 7550 7738 59  0000 R TNN
F 2 "AllModules:SOT23-5_1" H 7025 8200 50  0001 C CNN
F 3 "" H 7025 8200 50  0001 C CNN
F 4 "BUFFER WITH OPEN DRAIN OUTPUT,SOT23" H 7025 8200 50  0001 C CNN "Description"
F 5 "10022964" H 7025 8200 50  0001 C CNN "Item Number"
F 6 "TEXAS INSTRUMENTS_RMS1" H 7025 8200 50  0001 C CNN "Manufacturer"
F 7 "SN74LVC1G07DBVT" H 7025 8200 50  0001 C CNN "Manufacturer_No"
F 8 "SINGLE BUFFER DRIVER" H 7025 8200 50  0001 C CNN "Manufacturer_Desc"
F 9 "NXP SEMICONDUCTORS_RMS1" H 7025 8200 50  0001 C CNN "Manufacturer2"
F 10 "74LVC1G07GV,125" H 7025 8200 50  0001 C CNN "Manufacturer_No2"
F 11 "" H 7025 8200 50  0001 C CNN "Manufacturer_Desc2"
F 12 "NXP SEMICONDUCTORS_RMS1" H 7025 8200 50  0001 C CNN "Manufacturer3"
F 13 "74LVC1G07GV" H 7025 8200 50  0001 C CNN "Manufacturer_No3"
F 14 "BUFFER WITH OPEN DRAIN OUTPUT" H 7025 8200 50  0001 C CNN "Manufacturer_Desc3"
	1    7025 8200
	1    0    0    -1  
$EndComp
Wire Wire Line
	7025 7700 7025 7750
Wire Wire Line
	6675 7475 7325 7475
Wire Wire Line
	7325 7475 7325 7750
Connection ~ 6675 7475
Wire Wire Line
	7350 9000 7350 9050
Wire Wire Line
	6675 7475 6675 9250
Wire Wire Line
	7050 9250 6675 9250
Connection ~ 6675 9250
Wire Wire Line
	6675 9250 6675 9300
$Comp
L cpu-board:GND #U$0364
U 1 1 5A12D295
P 7050 9700
F 0 "#U$0364" H 7050 9700 50  0001 C CNN
F 1 "GND" H 6962 9612 59  0000 L BNN
F 2 "" H 7050 9700 50  0001 C CNN
F 3 "" H 7050 9700 50  0001 C CNN
	1    7050 9700
	-1   0    0    1   
$EndComp
Wire Wire Line
	5725 8975 6450 8975
Wire Wire Line
	6450 8975 6450 10325
Wire Wire Line
	6450 10325 6750 10325
Wire Wire Line
	7350 9875 7350 9550
Wire Wire Line
	7050 9800 7050 9875
Wire Wire Line
	5950 9775 6100 9775
$Comp
L cpu-board:87606-408 J6
U 1 1 C649B669
P 5225 10075
F 0 "J6" H 5287 9950 73  0000 L BNN
F 1 "87606-408" H 5225 10075 50  0001 C CNN
F 2 "AllModules:SPO2-16_1" H 5225 10075 50  0001 C CNN
F 3 "" H 5225 10075 50  0001 C CNN
	1    5225 10075
	1    0    0    -1  
$EndComp
Wire Wire Line
	5725 8575 5850 8575
Wire Wire Line
	6300 8575 6250 8575
NoConn ~ 5725 8775
NoConn ~ 5725 9175
NoConn ~ 5725 9375
NoConn ~ 5725 9575
Wire Wire Line
	5725 9775 5950 9775
Connection ~ 5950 9775
Wire Wire Line
	5950 9975 5725 9975
Connection ~ 5950 9975
Wire Wire Line
	5950 9975 6175 9975
Wire Wire Line
	2575 9975 4725 9975
Wire Wire Line
	4725 10450 4725 10425
Wire Wire Line
	4725 10025 4725 9975
Connection ~ 4725 9975
Wire Wire Line
	4725 9975 5225 9975
NoConn ~ 5225 8575
Wire Wire Line
	8400 4250 8500 4250
Wire Wire Line
	8400 4350 8500 4350
Wire Wire Line
	8400 4450 8500 4450
Wire Wire Line
	8400 4550 8500 4550
Wire Wire Line
	8400 4650 8500 4650
Wire Wire Line
	8400 4750 8500 4750
Wire Wire Line
	8400 4850 8500 4850
Wire Wire Line
	8400 4950 8450 4950
Wire Wire Line
	8400 5050 8500 5050
Wire Wire Line
	14325 6475 14325 6550
Wire Wire Line
	14325 6550 14125 6550
Wire Wire Line
	11250 6550 11250 6650
Wire Wire Line
	11250 6550 10400 6550
Wire Wire Line
	8875 6550 8875 6475
Connection ~ 11250 6550
Wire Wire Line
	9075 6475 9075 6550
Connection ~ 9075 6550
Wire Wire Line
	9075 6550 8875 6550
Wire Wire Line
	9275 6475 9275 6550
Connection ~ 9275 6550
Wire Wire Line
	9275 6550 9075 6550
Wire Wire Line
	9475 6475 9475 6550
Connection ~ 9475 6550
Wire Wire Line
	9475 6550 9275 6550
Wire Wire Line
	9800 6550 9800 6475
Wire Wire Line
	10000 6475 10000 6550
Wire Wire Line
	10200 6475 10200 6550
Wire Wire Line
	10400 6475 10400 6550
Connection ~ 9800 6550
Wire Wire Line
	9800 6550 9475 6550
Connection ~ 10000 6550
Wire Wire Line
	10000 6550 9800 6550
Connection ~ 10200 6550
Wire Wire Line
	10200 6550 10000 6550
Connection ~ 10400 6550
Wire Wire Line
	10400 6550 10200 6550
Wire Wire Line
	12825 6550 12825 6475
Wire Wire Line
	13025 6475 13025 6550
Wire Wire Line
	13225 6475 13225 6550
Wire Wire Line
	13425 6475 13425 6550
Connection ~ 13025 6550
Wire Wire Line
	13025 6550 12825 6550
Connection ~ 13225 6550
Wire Wire Line
	13225 6550 13025 6550
Wire Wire Line
	13425 6550 13225 6550
Connection ~ 12825 6550
Connection ~ 13425 6550
Wire Wire Line
	12825 6550 12550 6550
Wire Wire Line
	11950 6550 11950 6475
Wire Wire Line
	12150 6475 12150 6550
Wire Wire Line
	12350 6475 12350 6550
Wire Wire Line
	12550 6475 12550 6550
Connection ~ 12150 6550
Wire Wire Line
	12150 6550 11950 6550
Connection ~ 12350 6550
Wire Wire Line
	12350 6550 12150 6550
Wire Wire Line
	12550 6550 12350 6550
Connection ~ 11950 6550
Connection ~ 12550 6550
Wire Wire Line
	11950 6550 11250 6550
Wire Wire Line
	13725 6550 13725 6475
Wire Wire Line
	13925 6475 13925 6550
Wire Wire Line
	14125 6475 14125 6550
Connection ~ 13925 6550
Wire Wire Line
	13925 6550 13725 6550
Connection ~ 14125 6550
Wire Wire Line
	14125 6550 13925 6550
Connection ~ 13725 6550
Wire Wire Line
	13725 6550 13425 6550
Wire Wire Line
	8800 5050 8875 5050
Wire Wire Line
	10975 4950 9075 4950
Wire Wire Line
	8800 4850 9275 4850
Wire Wire Line
	8800 4750 9475 4750
Wire Wire Line
	8800 4650 9800 4650
Wire Wire Line
	8800 4550 10000 4550
Wire Wire Line
	8800 4450 10200 4450
Wire Wire Line
	8800 4350 10400 4350
Wire Wire Line
	10975 4250 10600 4250
Wire Wire Line
	10400 4350 10400 6175
Connection ~ 10400 4350
Wire Wire Line
	10400 4350 10975 4350
Wire Wire Line
	10200 4450 10200 6175
Connection ~ 10200 4450
Wire Wire Line
	10200 4450 10975 4450
Wire Wire Line
	10000 4550 10000 6175
Connection ~ 10000 4550
Wire Wire Line
	10000 4550 10975 4550
Wire Wire Line
	9800 4650 9800 6175
Connection ~ 9800 4650
Wire Wire Line
	9800 4650 10975 4650
Wire Wire Line
	8875 6175 8875 5050
Connection ~ 8875 5050
Wire Wire Line
	8875 5050 10975 5050
Wire Wire Line
	9075 6175 9075 4950
Connection ~ 9075 4950
Wire Wire Line
	9075 4950 8850 4950
Wire Wire Line
	9275 6175 9275 4850
Connection ~ 9275 4850
Wire Wire Line
	9275 4850 10975 4850
Wire Wire Line
	9475 6175 9475 4750
Connection ~ 9475 4750
Wire Wire Line
	9475 4750 10975 4750
Wire Wire Line
	11950 6000 10600 6000
Wire Wire Line
	10600 6000 10600 4250
Wire Wire Line
	11950 6000 11950 6175
Connection ~ 10600 4250
Wire Wire Line
	10600 4250 8800 4250
Wire Wire Line
	14375 4150 14325 4150
Wire Wire Line
	11575 4250 14125 4250
Wire Wire Line
	14375 4350 13925 4350
Wire Wire Line
	11575 4450 13725 4450
Wire Wire Line
	14375 4550 13425 4550
Wire Wire Line
	11575 4650 12550 4650
Wire Wire Line
	14375 4750 13225 4750
Wire Wire Line
	11575 4850 13025 4850
Wire Wire Line
	14375 4950 12825 4950
Wire Wire Line
	11575 5050 12350 5050
Wire Wire Line
	14375 5150 12150 5150
$Comp
L cpu-board:GND #U$0387
U 1 1 FCA1AC8A
P 10725 5575
F 0 "#U$0387" H 10725 5575 50  0001 C CNN
F 1 "GND" H 10638 5488 59  0000 L BNN
F 2 "" H 10725 5575 50  0001 C CNN
F 3 "" H 10725 5575 50  0001 C CNN
	1    10725 5575
	1    0    0    -1  
$EndComp
$Comp
L cpu-board:GND #U$0373
U 1 1 30A05D14
P 10525 3900
F 0 "#U$0373" H 10525 3900 50  0001 C CNN
F 1 "GND" H 10425 3825 59  0000 L BNN
F 2 "" H 10525 3900 50  0001 C CNN
F 3 "" H 10525 3900 50  0001 C CNN
	1    10525 3900
	-1   0    0    1   
$EndComp
Wire Wire Line
	10900 4000 10900 4050
Wire Wire Line
	10975 4050 10900 4050
Wire Wire Line
	10525 4150 10525 4000
Wire Wire Line
	10525 4150 10975 4150
Wire Wire Line
	11575 4050 11700 4050
Wire Wire Line
	11700 4050 11700 4000
Wire Wire Line
	10975 5250 10950 5250
Wire Wire Line
	10950 5250 10950 5475
Wire Wire Line
	10975 5150 10725 5150
Wire Wire Line
	10725 5150 10725 5475
Wire Wire Line
	11575 5250 11700 5250
Wire Wire Line
	11700 5250 11700 5475
Wire Wire Line
	12150 5150 12150 6175
Connection ~ 12150 5150
Wire Wire Line
	12150 5150 11575 5150
Wire Wire Line
	12350 5050 12350 6175
Connection ~ 12350 5050
Wire Wire Line
	12350 5050 14375 5050
Wire Wire Line
	12550 4650 12550 6175
Connection ~ 12550 4650
Wire Wire Line
	12550 4650 14375 4650
Wire Wire Line
	12825 6175 12825 4950
Connection ~ 12825 4950
Wire Wire Line
	12825 4950 11575 4950
Wire Wire Line
	13025 6175 13025 4850
Connection ~ 13025 4850
Wire Wire Line
	13025 4850 14375 4850
Wire Wire Line
	13225 6175 13225 4750
Connection ~ 13225 4750
Wire Wire Line
	13225 4750 11575 4750
Wire Wire Line
	13425 6175 13425 4550
Connection ~ 13425 4550
Wire Wire Line
	13425 4550 11575 4550
Wire Wire Line
	13725 4450 13725 6175
Connection ~ 13725 4450
Wire Wire Line
	13725 4450 14375 4450
Wire Wire Line
	13925 4350 13925 6175
Connection ~ 13925 4350
Wire Wire Line
	13925 4350 11575 4350
Wire Wire Line
	14125 4250 14125 6175
Connection ~ 14125 4250
Wire Wire Line
	14125 4250 14375 4250
Wire Wire Line
	14325 4150 14325 6175
Connection ~ 14325 4150
Wire Wire Line
	14325 4150 11575 4150
Wire Wire Line
	15075 5300 15075 5150
Wire Wire Line
	15075 5150 14675 5150
Wire Wire Line
	14675 4150 15050 4150
Wire Wire Line
	15050 4150 15050 4000
Wire Wire Line
	14675 4250 14825 4250
Wire Wire Line
	14675 4350 14825 4350
Wire Wire Line
	14675 4450 14825 4450
Wire Wire Line
	14675 4550 14825 4550
Wire Wire Line
	14675 4650 14825 4650
Wire Wire Line
	14675 4750 14825 4750
Wire Wire Line
	14675 4850 14825 4850
Wire Wire Line
	14675 4950 14825 4950
Wire Wire Line
	14675 5050 14825 5050
$Comp
L cpu-board:FH_40BR J17
U 1 1 E8FF25C4
P 12600 2150
F 0 "J17" V 12800 100 73  0000 C CNN
F 1 "FH_40BR" V 12675 -25 73  0001 C CNN
F 2 "AllModules:AMP177983-40_1" H 12600 2150 50  0001 C CNN
F 3 "" H 12600 2150 50  0001 C CNN
F 4 "CONNECTOR, 40 CONTACTS" H 12600 2150 50  0001 C CNN "Description"
F 5 "10097263" H 12600 2150 50  0001 C CNN "Item Number"
F 6 "TYCO ELECTRONICS" H 12600 2150 50  0001 C CNN "Manufacturer"
F 7 "5177983-1" H 12600 2150 50  0001 C CNN "Manufacturer_No"
F 8 "0.8MM FREE HEIGHT CONNECTOR" H 12600 2150 50  0001 C CNN "Manufacturer_Desc"
F 9 "TYCO ELECTRONICS" H 12600 2150 50  0001 C CNN "Manufacturer2"
F 10 "5177985-1" H 12600 2150 50  0001 C CNN "Manufacturer_No2"
F 11 "" H 12600 2150 50  0001 C CNN "Manufacturer_Desc2"
	1    12600 2150
	0    -1   -1   0   
$EndComp
$Comp
L cpu-board:TANTALB C34
U 1 1 555B33A9
P 14375 1300
F 0 "C34" V 14575 1200 56  0000 C CNN
F 1 "1uF" V 14500 1225 42  0000 C CNN
F 2 "AllModules:C3216_1" H 14375 1300 50  0001 C CNN
F 3 "" H 14375 1300 50  0001 C CNN
F 4 "CAPACITOR TANTALUM, 1UF,35V, +/-10%" H 14375 1300 50  0001 C CNN "Description"
F 5 "10022959" H 14375 1300 50  0001 C CNN "Item Number"
F 6 "KEMET" H 14375 1300 50  0001 C CNN "Manufacturer"
F 7 "T491A105M035AT" H 14375 1300 50  0001 C CNN "Manufacturer_No"
F 8 "Cap, Tantalum, Polarized, 35V, 20% +/-Tol, 1uF, Surface Mount, 1206 (Case A), EIA Metric 3216" H 14375 1300 50  0001 C CNN "Manufacturer_Desc"
F 9 "KEMET" H 14375 1300 50  0001 C CNN "Manufacturer2"
F 10 "T495A105K035ATE3K0" H 14375 1300 50  0001 C CNN "Manufacturer_No2"
F 11 "Cap, Tantalum, Polarized, 35V, 10% +/-Tol, 1uF, Surface Mount, 1206 (Case A), EIA Metric 3216" H 14375 1300 50  0001 C CNN "Manufacturer_Desc2"
	1    14375 1300
	0    -1   -1   0   
$EndComp
Wire Wire Line
	14575 1300 14525 1300
Wire Wire Line
	14275 1300 14200 1300
Wire Wire Line
	14200 1300 14200 1025
Wire Wire Line
	14200 1300 14200 1750
Connection ~ 14200 1300
Wire Wire Line
	14400 2150 14400 2375
Wire Wire Line
	14200 2150 14200 2375
Wire Wire Line
	14000 2150 14000 2675
Wire Wire Line
	13800 2150 13800 2925
Wire Wire Line
	13600 2150 13600 2425
Wire Wire Line
	13200 2150 13200 2675
Wire Wire Line
	13000 2150 13000 2925
Wire Wire Line
	12800 2150 12800 2675
Wire Wire Line
	12600 2150 12600 2675
Wire Wire Line
	12400 2150 12400 2925
Wire Wire Line
	12200 2150 12200 2925
Wire Wire Line
	12000 2150 12000 2375
Wire Wire Line
	11800 2150 11800 2925
Wire Wire Line
	11600 2150 11600 2925
Wire Wire Line
	11400 2150 11400 2925
Wire Wire Line
	10800 2150 10800 2800
Wire Wire Line
	10800 2800 10700 2800
Connection ~ 10800 2800
Wire Wire Line
	10800 2800 10800 2975
Wire Wire Line
	10500 2800 10450 2800
Wire Wire Line
	10450 2800 10450 2925
Wire Wire Line
	10450 2800 10450 2425
Wire Wire Line
	10450 2425 10600 2425
Wire Wire Line
	10600 2425 10600 2150
Connection ~ 10450 2800
Wire Wire Line
	11000 1750 11000 1475
Wire Wire Line
	10800 1025 10800 1300
Wire Wire Line
	10800 1300 10700 1300
Connection ~ 10800 1300
Wire Wire Line
	10800 1300 10800 1750
Wire Wire Line
	10450 1050 10450 1300
Wire Wire Line
	10450 1300 10500 1300
Wire Wire Line
	10450 1300 10450 1550
Wire Wire Line
	10450 1550 10600 1550
Wire Wire Line
	10600 1550 10600 1750
Connection ~ 10450 1300
Wire Wire Line
	14400 1750 14400 1500
Wire Wire Line
	14400 1500 14525 1500
Wire Wire Line
	14525 1500 14525 1300
Connection ~ 14525 1300
Wire Wire Line
	14525 1300 14475 1300
NoConn ~ 14000 1750
NoConn ~ 13800 1750
NoConn ~ 13600 1750
NoConn ~ 13400 1750
NoConn ~ 13200 1750
NoConn ~ 13000 1750
NoConn ~ 12800 1750
NoConn ~ 12600 1750
NoConn ~ 12400 1750
NoConn ~ 12200 1750
NoConn ~ 12000 1750
NoConn ~ 11800 1750
NoConn ~ 11600 1750
NoConn ~ 11400 1750
NoConn ~ 11200 1750
NoConn ~ 11200 2150
NoConn ~ 11000 2150
Text Label 13400 2300 1    50   ~ 0
D5
Text Label 13000 2300 1    50   ~ 0
D4
Text Label 12400 2300 1    50   ~ 0
D6
Text Label 13800 2300 1    50   ~ 0
D3
Text Label 12200 2300 1    50   ~ 0
D0
Text Label 11800 2300 1    50   ~ 0
D2
Text Label 11600 2300 1    50   ~ 0
D1
Text Label 11400 2300 1    50   ~ 0
D7
Entry Wire Line
	11400 2925 11500 3025
Entry Wire Line
	11600 2925 11700 3025
Entry Wire Line
	11800 2925 11900 3025
Entry Wire Line
	12200 2925 12300 3025
Entry Wire Line
	12400 2925 12500 3025
Entry Wire Line
	13000 2925 13100 3025
Entry Wire Line
	13400 2925 13500 3025
Entry Wire Line
	13800 2925 13900 3025
Text HLabel 14200 3025 2    50   Input ~ 0
D[0..15]
Wire Wire Line
	13400 2150 13400 2925
Entry Wire Line
	12600 2675 12700 2775
Entry Wire Line
	12800 2675 12900 2775
Entry Wire Line
	13200 2675 13300 2775
Entry Wire Line
	14000 2675 14100 2775
Text Label 12600 2200 3    50   ~ 0
A1
Text Label 12800 2200 3    50   ~ 0
A2
Text Label 13200 2200 3    50   ~ 0
A0
Text Label 14000 2200 3    50   ~ 0
A3
Text HLabel 14225 2775 2    50   Input ~ 0
A[0..19]
Wire Wire Line
	3000 4425 3300 4425
Wire Wire Line
	3000 4625 3287 4625
Wire Wire Line
	3000 5025 3225 5025
Wire Wire Line
	3000 5425 3275 5425
Wire Wire Line
	3000 1625 3300 1625
Wire Wire Line
	3000 1825 3275 1825
Wire Wire Line
	3000 2025 3275 2025
Wire Wire Line
	3000 5625 3275 5625
Wire Wire Line
	3000 2225 3275 2225
Wire Wire Line
	3000 2425 3275 2425
Wire Wire Line
	3000 2625 3275 2625
Wire Wire Line
	3000 3225 3275 3225
Wire Wire Line
	3000 3825 3300 3825
$Comp
L cpu-board:ZIF-52610-2290 J1
U 1 1 449C7C68
P 2800 5925
AR Path="/449C7C68" Ref="J1"  Part="1" 
AR Path="/5E926050/449C7C68" Ref="J1"  Part="1" 
F 0 "J1" H 2987 5800 73  0000 L BNN
F 1 "ZIF-52610-2290" H 3000 5925 50  0001 C CNN
F 2 "AllModules:MOL52610-22_1" H 3000 5925 50  0001 C CNN
F 3 "" H 3000 5925 50  0001 C CNN
F 4 "CONNECTOR, 22 CONTACTS" H 3000 5925 50  0001 C CNN "Description"
F 5 "10097256" H 3000 5925 50  0001 C CNN "Item Number"
F 6 "MOLEX_RMS1" H 3000 5925 50  0001 C CNN "Manufacturer"
F 7 "0526102272" H 3000 5925 50  0001 C CNN "Manufacturer_No"
F 8 "CONNECTOR" H 3000 5925 50  0001 C CNN "Manufacturer_Desc"
F 9 "MOLEX_RMS1" H 3000 5925 50  0001 C CNN "Manufacturer2"
F 10 "0526102271" H 3000 5925 50  0001 C CNN "Manufacturer_No2"
F 11 "CONNECTOR" H 3000 5925 50  0001 C CNN "Manufacturer_Desc2"
	1    2800 5925
	1    0    0    -1  
$EndComp
Wire Wire Line
	2800 1625 3000 1625
Connection ~ 3000 1625
Wire Wire Line
	2800 1825 3000 1825
Connection ~ 3000 1825
Wire Wire Line
	2800 2425 3000 2425
Wire Wire Line
	2800 2625 3000 2625
Wire Wire Line
	2800 2025 3000 2025
Wire Wire Line
	2800 2225 3000 2225
Wire Wire Line
	2800 3425 3000 3425
Wire Wire Line
	2800 3625 3000 3625
Wire Wire Line
	2800 3025 3000 3025
Wire Wire Line
	2800 3225 3000 3225
Wire Wire Line
	2800 4225 3000 4225
Wire Wire Line
	2800 4425 3000 4425
Wire Wire Line
	2800 3825 3000 3825
Wire Wire Line
	2800 4025 3000 4025
Wire Wire Line
	2800 5025 3000 5025
Wire Wire Line
	2800 5225 3000 5225
Wire Wire Line
	2800 4625 3000 4625
Wire Wire Line
	2800 4825 3000 4825
Wire Wire Line
	2800 5825 3000 5825
Wire Wire Line
	2800 5425 3000 5425
Wire Wire Line
	2800 5625 3000 5625
Wire Bus Line
	12600 2775 14225 2775
Wire Bus Line
	11400 3025 14200 3025
Connection ~ 3000 2025
Connection ~ 3000 2225
Connection ~ 3000 2425
Connection ~ 3000 2625
Connection ~ 3000 3025
Connection ~ 3000 3225
Connection ~ 3000 3425
Connection ~ 3000 3625
Connection ~ 3000 3825
Connection ~ 3000 4025
Connection ~ 3000 4225
Connection ~ 3000 4425
Connection ~ 3000 4625
Connection ~ 3000 4825
Connection ~ 3000 5025
Connection ~ 3000 5225
Connection ~ 3000 5425
Connection ~ 3000 5625
Connection ~ 3000 5825
$EndSCHEMATC
