(module NK236_1_1 (layer F.Cu) (tedit 5E99F0FB)
  (attr smd)
  (fp_text reference SW1 (at 0.6663 -0.4596 180 unlocked) (layer F.SilkS)
    (effects (font (size 1.0496 1.104) (thickness 0.18)))
  )
  (fp_text value SI-10-NK236 (at 4.4 -0.8 180 unlocked) (layer F.SilkS) hide
    (effects (font (size 1.0496 1.104) (thickness 0.18)))
  )
  (fp_line (start -5.08 -1.27) (end -5.08 1.27) (layer F.SilkS) (width 0.18))
  (fp_line (start 5.08 1.27) (end -5.08 1.27) (layer F.SilkS) (width 0.18))
  (fp_line (start 5.08 -1.27) (end 5.08 1.27) (layer F.SilkS) (width 0.18))
  (fp_line (start 5.08 -1.27) (end -5.08 -1.27) (layer F.SilkS) (width 0.18))
  (fp_line (start -0.635 -0.635) (end -1.905 -0.635) (layer B.Fab) (width 0.1))
  (fp_line (start -5.08 -1.27) (end -5.08 1.27) (layer B.Fab) (width 0.1))
  (fp_line (start 5.08 1.27) (end -5.08 1.27) (layer B.Fab) (width 0.1))
  (fp_line (start -4.445 -0.635) (end -4.445 0.635) (layer B.Fab) (width 0.1))
  (fp_line (start 4.445 0.635) (end -4.445 0.635) (layer B.Fab) (width 0.1))
  (fp_line (start 5.08 -1.27) (end 5.08 1.27) (layer B.Fab) (width 0.1))
  (fp_line (start 4.445 -0.635) (end 4.445 0.635) (layer B.Fab) (width 0.1))
  (fp_line (start 4.445 -0.635) (end -4.445 -0.635) (layer B.Fab) (width 0.1))
  (fp_line (start 5.08 -1.27) (end -5.08 -1.27) (layer B.Fab) (width 0.1))
  (fp_line (start -0.635 0.635) (end -1.905 0.635) (layer B.Fab) (width 0.1))
  (fp_line (start -1.905 -0.635) (end -1.905 0.635) (layer B.Fab) (width 0.1))
  (pad 3 thru_hole circle (at 2.54 0 180) (size 1.4732 1.4732) (drill 0.8128) (layers *.Cu *.Mask))
  (pad 2 thru_hole circle (at -2.54 0 180) (size 1.4732 1.4732) (drill 0.8128) (layers *.Cu *.Mask))
  (pad 1 thru_hole circle (at 0 0 180) (size 1.4732 1.4732) (drill 0.8128) (layers *.Cu *.Mask))
  (model "${KIPRJMOD}/Footprints.3dshapes/NK_1511073_cp.wrl"
    (at (xyz 0 0 0))
    (scale (xyz 1 1 1))
    (rotate (xyz 0 0 0))
  )
)
