EESchema Schematic File Version 4
EELAYER 30 0
EELAYER END
$Descr User 17335 11946
encoding utf-8
Sheet 4 8
Title "RB0505 CPU Board"
Date "2020-04-15"
Rev ""
Comp ""
Comment1 ""
Comment2 ""
Comment3 ""
Comment4 ""
$EndDescr
Connection ~ 1875 2250
Connection ~ 1600 2250
Wire Wire Line
	1875 2250 1925 2250
Wire Wire Line
	1875 1350 1875 2250
Wire Wire Line
	1600 2250 1600 1850
Wire Wire Line
	1600 2250 1875 2250
Wire Wire Line
	1600 2400 1600 2250
Wire Notes Line
	1375 7663 6475 7663
Wire Notes Line
	1375 10663 1375 7663
Wire Notes Line
	1375 10663 6475 10663
Wire Notes Line
	1400 838  1400 3100
Wire Notes Line
	1400 838  5037 838 
Wire Notes Line
	1400 3100 5037 3100
Wire Notes Line
	1400 3238 1400 5500
Wire Notes Line
	1400 3238 5037 3238
Wire Notes Line
	1400 5500 5037 5500
Wire Notes Line
	1400 5788 5000 5788
Wire Notes Line
	1400 7488 1400 5788
Wire Notes Line
	5000 5788 5000 7488
Wire Notes Line
	5000 7488 1400 7488
Wire Notes Line
	5037 838  5037 3100
Wire Notes Line
	5037 3238 5037 5500
Wire Notes Line
	6475 7663 6475 10663
Wire Notes Line
	6650 950  6650 8075
Wire Notes Line
	6650 950  11212 950 
Wire Notes Line
	6650 8075 11212 8075
Wire Notes Line
	6812 1313 11050 1313
Wire Notes Line
	6812 3313 6812 1313
Wire Notes Line
	6812 3413 11050 3413
Wire Notes Line
	6812 5613 6812 3413
Wire Notes Line
	6812 5813 11050 5813
Wire Notes Line
	6812 7913 6812 5813
Wire Notes Line
	11050 1313 11050 3313
Wire Notes Line
	11050 3313 6812 3313
Wire Notes Line
	11050 3413 11050 5613
Wire Notes Line
	11050 5613 6812 5613
Wire Notes Line
	11050 5813 11050 7913
Wire Notes Line
	11050 7913 6812 7913
Wire Notes Line
	11212 950  11212 8075
Wire Notes Line
	11300 950  16112 950 
Wire Notes Line
	11300 3363 11300 950 
Wire Notes Line
	16112 950  16112 3363
Wire Notes Line
	16112 3363 11300 3363
Text Notes 1450 7800 0    59   ~ 0
5V Power Supply
Text Notes 1500 988  0    59   ~ 0
5V Ref Patient Pressure Sensor, µC, Valve, O² Regul
Text Notes 1500 5950 0    59   ~ 0
3.3V Power Supply
Text Notes 1512 3375 0    59   ~ 0
10V Ref, Inspiratory + Exhalation Flow Sensors
Text Notes 6750 1100 0    59   ~ 0
POWER SUPPLY MONITORING
Text Notes 6900 1450 0    59   ~ 0
+5V Ref Monitoring
Text Notes 6900 3563 0    59   ~ 0
+10V Ref Monitoring
Text Notes 6900 5963 0    59   ~ 0
+3,3V Monitoring
Text Notes 15762 10763 0    59   ~ 0
A
Text Notes 16000 10763 0    59   ~ 0
05/03/14
Text Notes 16500 10775 0    59   ~ 0
JR
Text Notes 11337 1088 0    56   ~ 0
STARTING CURRENT PROTECTION
Text HLabel 9825 2300 2    56   Output ~ 0
+5VREF-FAILURE
Text HLabel 9825 4575 2    56   Output ~ 0
+10VREF-FAILURE
Text HLabel 9825 6925 2    56   Output ~ 0
+3,3V-FAILURE
Text HLabel 15250 2500 2    56   Output ~ 0
MES-24V
$Comp
L cpu-board:+24V #U$37
U 1 1 29820D38
P 1600 1750
AR Path="/29820D38" Ref="#U$37"  Part="1" 
AR Path="/5E92540F/29820D38" Ref="#U$037"  Part="1" 
F 0 "#U$037" H 1600 1750 50  0001 C CNN
F 1 "+24V" H 1500 1625 59  0000 L BNN
F 2 "" H 1600 1750 50  0001 C CNN
F 3 "" H 1600 1750 50  0001 C CNN
	1    1600 1750
	-1   0    0    1   
$EndComp
$Comp
L cpu-board:+24V #U$430
U 1 1 A729E0A6
P 1700 8700
AR Path="/A729E0A6" Ref="#U$430"  Part="1" 
AR Path="/5E92540F/A729E0A6" Ref="#U$0430"  Part="1" 
F 0 "#U$0430" H 1700 8700 50  0001 C CNN
F 1 "+24V" H 1587 8562 59  0000 L BNN
F 2 "" H 1700 8700 50  0001 C CNN
F 3 "" H 1700 8700 50  0001 C CNN
	1    1700 8700
	-1   0    0    1   
$EndComp
$Comp
L cpu-board:+5V #U$157
U 1 1 E8E1CB51
P 2125 6175
AR Path="/E8E1CB51" Ref="#U$157"  Part="1" 
AR Path="/5E92540F/E8E1CB51" Ref="#U$0157"  Part="1" 
F 0 "#U$0157" H 2125 6175 50  0001 C CNN
F 1 "+5V" H 2062 6100 59  0000 L BNN
F 2 "" H 2125 6175 50  0001 C CNN
F 3 "" H 2125 6175 50  0001 C CNN
	1    2125 6175
	-1   0    0    1   
$EndComp
$Comp
L cpu-board:+5VREF #U$64
U 1 1 E60C17AF
P 3925 2000
AR Path="/E60C17AF" Ref="#U$64"  Part="1" 
AR Path="/5E92540F/E60C17AF" Ref="#U$064"  Part="1" 
F 0 "#U$064" H 3925 2000 50  0001 C CNN
F 1 "+5VREF" H 3750 1912 59  0000 L BNN
F 2 "" H 3925 2000 50  0001 C CNN
F 3 "" H 3925 2000 50  0001 C CNN
	1    3925 2000
	-1   0    0    1   
$EndComp
$Comp
L cpu-board:+10VREF #U$67
U 1 1 5FFDB1B2
P 3925 4500
AR Path="/5FFDB1B2" Ref="#U$67"  Part="1" 
AR Path="/5E92540F/5FFDB1B2" Ref="#U$067"  Part="1" 
F 0 "#U$067" H 3925 4500 50  0001 C CNN
F 1 "+10VREF" H 3750 4325 59  0000 L BNN
F 2 "" H 3925 4500 50  0001 C CNN
F 3 "" H 3925 4500 50  0001 C CNN
	1    3925 4500
	-1   0    0    1   
$EndComp
$Comp
L cpu-board:+24V #U$148
U 1 1 D319FAF3
P 14525 1675
AR Path="/D319FAF3" Ref="#U$148"  Part="1" 
AR Path="/5E92540F/D319FAF3" Ref="#U$0148"  Part="1" 
F 0 "#U$0148" H 14525 1675 50  0001 C CNN
F 1 "+24V" H 14638 1600 59  0000 R TNN
F 2 "" H 14525 1675 50  0001 C CNN
F 3 "" H 14525 1675 50  0001 C CNN
	1    14525 1675
	-1   0    0    1   
$EndComp
$Comp
L cpu-board:ICTE5 D4
U 1 1 C08B3BB7
P 11675 2350
AR Path="/C08B3BB7" Ref="D4"  Part="1" 
AR Path="/5E92540F/C08B3BB7" Ref="D4"  Part="1" 
F 0 "D4" V 11700 2250 51  0000 R TNN
F 1 "1SMB36AT3" V 11625 2262 51  0000 R TNN
F 2 "AllModules:SMB_1" H 11675 2350 50  0001 C CNN
F 3 "" H 11675 2350 50  0001 C CNN
F 4 "DIODE TRANSIENT 600W,36V" H 11675 2350 50  0001 C CNN "Description"
F 5 "10022654" H 11675 2350 50  0001 C CNN "Item Number"
F 6 "LITTLEFUSE" H 11675 2350 50  0001 C CNN "Manufacturer"
F 7 "1SMB36AT3G" H 11675 2350 50  0001 C CNN "Manufacturer_No"
F 8 "ZENER TRANSIENT VOLTAGE SUPPRESSORS" H 11675 2350 50  0001 C CNN "Manufacturer_Desc"
F 9 "ON SEMICONDUCTOR_RMS1" H 11675 2350 50  0001 C CNN "Manufacturer2"
F 10 "1SMB36AT3G" H 11675 2350 50  0001 C CNN "Manufacturer_No2"
F 11 "ZENER TRANSIENT VOLTAGE SUPPRESSORS" H 11675 2350 50  0001 C CNN "Manufacturer_Desc2"
F 12 "LITTLEFUSE" H 11675 2350 50  0001 C CNN "Manufacturer3"
F 13 "SZ1SMB36AT3G" H 11675 2350 50  0001 C CNN "Manufacturer_No3"
F 14 "ZENER TRANSIENT VOLTAGE SUPPRESSORS" H 11675 2350 50  0001 C CNN "Manufacturer_Desc3"
	1    11675 2350
	0    -1   -1   0   
$EndComp
$Comp
L cpu-board:C0805 C79
U 1 1 5EA262E6
P 1600 2500
AR Path="/5EA262E6" Ref="C79"  Part="1" 
AR Path="/5E92540F/5EA262E6" Ref="C79"  Part="1" 
F 0 "C79" H 1700 2550 64  0000 L CNN
F 1 "100nF" H 1700 2450 42  0000 L CNN
F 2 "AllModules:C0805_1" H 1600 2500 50  0001 C CNN
F 3 "" H 1600 2500 50  0001 C CNN
F 4 "CAPACITOR CERAMIC, 100NF, +/-10%, 50V, X7R,0805" H 1600 2500 50  0001 C CNN "Description"
F 5 "10022135" H 1600 2500 50  0001 C CNN "Item Number"
F 6 "YAGEO_RMS1" H 1600 2500 50  0001 C CNN "Manufacturer"
F 7 "223858055649" H 1600 2500 50  0001 C CNN "Manufacturer_No"
F 8 "CAPACITOR, CERAMIC, MULTILAYER, 50 V, X7R, 0.1 UF, SURFACE MOUNT, 0805" H 1600 2500 50  0001 C CNN "Manufacturer_Desc"
F 9 "MURATA MANUFACTURING CO., LTD." H 1600 2500 50  0001 C CNN "Manufacturer2"
F 10 "GRM21BR71H104KA01L" H 1600 2500 50  0001 C CNN "Manufacturer_No2"
F 11 "MONOLITHIC CERAMIC CAPACITOR" H 1600 2500 50  0001 C CNN "Manufacturer_Desc2"
F 12 "YAGEO_RMS1" H 1600 2500 50  0001 C CNN "Manufacturer3"
F 13 "223858015649" H 1600 2500 50  0001 C CNN "Manufacturer_No3"
F 14 "CAPACITOR, CERAMIC, MULTILAYER, 50 V, X7R, 0.1 UF, SURFACE MOUNT, 0805" H 1600 2500 50  0001 C CNN "Manufacturer_Desc3"
F 15 "SAMSUNG_RMS1" H 1600 2500 50  0001 C CNN "Manufacturer4"
F 16 "CL21B104KBCNNNC" H 1600 2500 50  0001 C CNN "Manufacturer_No4"
F 17 "MULTILAYER CERAMIC CAPACITOR" H 1600 2500 50  0001 C CNN "Manufacturer_Desc4"
F 18 "YAGEO_RMS1" H 1600 2500 50  0001 C CNN "Manufacturer5"
F 19 "CC0805KRX7R9BB104" H 1600 2500 50  0001 C CNN "Manufacturer_No5"
F 20 "CAP CER .1UF 50V 10% X7R 0805" H 1600 2500 50  0001 C CNN "Manufacturer_Desc5"
F 21 "AVX_RMS1" H 1600 2500 50  0001 C CNN "Manufacturer6"
F 22 "08055C104KAT2A" H 1600 2500 50  0001 C CNN "Manufacturer_No6"
F 23 "CAPACITOR CERAMIC, 100NF, +/-10%, 50V, X7R,0805, X7R DIELECTRIC" H 1600 2500 50  0001 C CNN "Manufacturer_Desc6"
	1    1600 2500
	1    0    0    -1  
$EndComp
$Comp
L cpu-board:C0805 C82
U 1 1 3B4E26FC
P 1600 4900
AR Path="/3B4E26FC" Ref="C82"  Part="1" 
AR Path="/5E92540F/3B4E26FC" Ref="C82"  Part="1" 
F 0 "C82" H 1700 4950 64  0000 L CNN
F 1 "100nF" H 1700 4850 42  0000 L CNN
F 2 "AllModules:C0805_1" H 1600 4900 50  0001 C CNN
F 3 "" H 1600 4900 50  0001 C CNN
F 4 "CAPACITOR CERAMIC, 100NF, +/-10%, 50V, X7R,0805" H 1600 4900 50  0001 C CNN "Description"
F 5 "10022135" H 1600 4900 50  0001 C CNN "Item Number"
F 6 "YAGEO_RMS1" H 1600 4900 50  0001 C CNN "Manufacturer"
F 7 "223858055649" H 1600 4900 50  0001 C CNN "Manufacturer_No"
F 8 "CAPACITOR, CERAMIC, MULTILAYER, 50 V, X7R, 0.1 UF, SURFACE MOUNT, 0805" H 1600 4900 50  0001 C CNN "Manufacturer_Desc"
F 9 "MURATA MANUFACTURING CO., LTD." H 1600 4900 50  0001 C CNN "Manufacturer2"
F 10 "GRM21BR71H104KA01L" H 1600 4900 50  0001 C CNN "Manufacturer_No2"
F 11 "MONOLITHIC CERAMIC CAPACITOR" H 1600 4900 50  0001 C CNN "Manufacturer_Desc2"
F 12 "YAGEO_RMS1" H 1600 4900 50  0001 C CNN "Manufacturer3"
F 13 "223858015649" H 1600 4900 50  0001 C CNN "Manufacturer_No3"
F 14 "CAPACITOR, CERAMIC, MULTILAYER, 50 V, X7R, 0.1 UF, SURFACE MOUNT, 0805" H 1600 4900 50  0001 C CNN "Manufacturer_Desc3"
F 15 "SAMSUNG_RMS1" H 1600 4900 50  0001 C CNN "Manufacturer4"
F 16 "CL21B104KBCNNNC" H 1600 4900 50  0001 C CNN "Manufacturer_No4"
F 17 "MULTILAYER CERAMIC CAPACITOR" H 1600 4900 50  0001 C CNN "Manufacturer_Desc4"
F 18 "YAGEO_RMS1" H 1600 4900 50  0001 C CNN "Manufacturer5"
F 19 "CC0805KRX7R9BB104" H 1600 4900 50  0001 C CNN "Manufacturer_No5"
F 20 "CAP CER .1UF 50V 10% X7R 0805" H 1600 4900 50  0001 C CNN "Manufacturer_Desc5"
F 21 "AVX_RMS1" H 1600 4900 50  0001 C CNN "Manufacturer6"
F 22 "08055C104KAT2A" H 1600 4900 50  0001 C CNN "Manufacturer_No6"
F 23 "CAPACITOR CERAMIC, 100NF, +/-10%, 50V, X7R,0805, X7R DIELECTRIC" H 1600 4900 50  0001 C CNN "Manufacturer_Desc6"
	1    1600 4900
	1    0    0    -1  
$EndComp
$Comp
L cpu-board:C0805 C105
U 1 1 DFA69215
P 2025 9450
AR Path="/DFA69215" Ref="C105"  Part="1" 
AR Path="/5E92540F/DFA69215" Ref="C105"  Part="1" 
F 0 "C105" H 1900 9500 64  0000 R CNN
F 1 "100nF" H 1900 9400 42  0000 R CNN
F 2 "AllModules:C0805_1" H 2025 9450 50  0001 C CNN
F 3 "" H 2025 9450 50  0001 C CNN
F 4 "CAPACITOR CERAMIC, 100NF, +/-10%, 50V, X7R,0805" H 2025 9450 50  0001 C CNN "Description"
F 5 "10022135" H 2025 9450 50  0001 C CNN "Item Number"
F 6 "YAGEO_RMS1" H 2025 9450 50  0001 C CNN "Manufacturer"
F 7 "223858055649" H 2025 9450 50  0001 C CNN "Manufacturer_No"
F 8 "CAPACITOR, CERAMIC, MULTILAYER, 50 V, X7R, 0.1 UF, SURFACE MOUNT, 0805" H 2025 9450 50  0001 C CNN "Manufacturer_Desc"
F 9 "MURATA MANUFACTURING CO., LTD." H 2025 9450 50  0001 C CNN "Manufacturer2"
F 10 "GRM21BR71H104KA01L" H 2025 9450 50  0001 C CNN "Manufacturer_No2"
F 11 "MONOLITHIC CERAMIC CAPACITOR" H 2025 9450 50  0001 C CNN "Manufacturer_Desc2"
F 12 "YAGEO_RMS1" H 2025 9450 50  0001 C CNN "Manufacturer3"
F 13 "223858015649" H 2025 9450 50  0001 C CNN "Manufacturer_No3"
F 14 "CAPACITOR, CERAMIC, MULTILAYER, 50 V, X7R, 0.1 UF, SURFACE MOUNT, 0805" H 2025 9450 50  0001 C CNN "Manufacturer_Desc3"
F 15 "SAMSUNG_RMS1" H 2025 9450 50  0001 C CNN "Manufacturer4"
F 16 "CL21B104KBCNNNC" H 2025 9450 50  0001 C CNN "Manufacturer_No4"
F 17 "MULTILAYER CERAMIC CAPACITOR" H 2025 9450 50  0001 C CNN "Manufacturer_Desc4"
F 18 "YAGEO_RMS1" H 2025 9450 50  0001 C CNN "Manufacturer5"
F 19 "CC0805KRX7R9BB104" H 2025 9450 50  0001 C CNN "Manufacturer_No5"
F 20 "CAP CER .1UF 50V 10% X7R 0805" H 2025 9450 50  0001 C CNN "Manufacturer_Desc5"
F 21 "AVX_RMS1" H 2025 9450 50  0001 C CNN "Manufacturer6"
F 22 "08055C104KAT2A" H 2025 9450 50  0001 C CNN "Manufacturer_No6"
F 23 "CAPACITOR CERAMIC, 100NF, +/-10%, 50V, X7R,0805, X7R DIELECTRIC" H 2025 9450 50  0001 C CNN "Manufacturer_Desc6"
	1    2025 9450
	-1   0    0    -1  
$EndComp
$Comp
L cpu-board:C0805 C91
U 1 1 3BD8044E
P 2450 6750
AR Path="/3BD8044E" Ref="C91"  Part="1" 
AR Path="/5E92540F/3BD8044E" Ref="C91"  Part="1" 
F 0 "C91" H 2350 6800 64  0000 R CNN
F 1 "100nF" H 2350 6700 42  0000 R CNN
F 2 "AllModules:C0402_1" H 2450 6750 50  0001 C CNN
F 3 "" H 2450 6750 50  0001 C CNN
	1    2450 6750
	1    0    0    -1  
$EndComp
$Comp
L cpu-board:C0805 C90
U 1 1 8D21F230
P 3475 6750
AR Path="/8D21F230" Ref="C90"  Part="1" 
AR Path="/5E92540F/8D21F230" Ref="C90"  Part="1" 
F 0 "C90" H 3550 6800 64  0000 L CNN
F 1 "100nF" H 3550 6700 42  0000 L CNN
F 2 "AllModules:C0402_1" H 3475 6750 50  0001 C CNN
F 3 "" H 3475 6750 50  0001 C CNN
	1    3475 6750
	1    0    0    -1  
$EndComp
$Comp
L cpu-board:+3,3V #U$136
U 1 1 6DF59C4C
P 3975 6350
AR Path="/6DF59C4C" Ref="#U$136"  Part="1" 
AR Path="/5E92540F/6DF59C4C" Ref="#U$0103"  Part="1" 
F 0 "#U$0103" H 3975 6350 50  0001 C CNN
F 1 "+3,3V" H 3875 6562 59  0000 L BNN
F 2 "" H 3975 6350 50  0001 C CNN
F 3 "" H 3975 6350 50  0001 C CNN
	1    3975 6350
	1    0    0    -1  
$EndComp
$Comp
L cpu-board:C0805 C107
U 1 1 21969A4D
P 6050 8400
AR Path="/21969A4D" Ref="C107"  Part="1" 
AR Path="/5E92540F/21969A4D" Ref="C107"  Part="1" 
F 0 "C107" H 5950 8450 64  0000 R CNN
F 1 "100nF" H 5950 8350 42  0000 R CNN
F 2 "AllModules:C0402_1" H 6050 8400 50  0001 C CNN
F 3 "" H 6050 8400 50  0001 C CNN
	1    6050 8400
	-1   0    0    -1  
$EndComp
$Comp
L cpu-board:GND #U$189
U 1 1 3F673420
P 2300 8350
AR Path="/3F673420" Ref="#U$189"  Part="1" 
AR Path="/5E92540F/3F673420" Ref="#U$0189"  Part="1" 
F 0 "#U$0189" H 2300 8350 50  0001 C CNN
F 1 "GND" H 2213 8263 59  0000 L BNN
F 2 "" H 2300 8350 50  0001 C CNN
F 3 "" H 2300 8350 50  0001 C CNN
	1    2300 8350
	-1   0    0    -1  
$EndComp
$Comp
L cpu-board:0VANA #U$38
U 1 1 D00605AD
P 2875 2800
AR Path="/D00605AD" Ref="#U$38"  Part="1" 
AR Path="/5E92540F/D00605AD" Ref="#U$038"  Part="1" 
F 0 "#U$038" H 2875 2800 50  0001 C CNN
F 1 "0VANA" H 2738 2600 59  0000 L BNN
F 2 "" H 2875 2800 50  0001 C CNN
F 3 "" H 2875 2800 50  0001 C CNN
	1    2875 2800
	1    0    0    -1  
$EndComp
$Comp
L cpu-board:GND #U$163
U 1 1 C2734EFA
P 2950 7225
AR Path="/C2734EFA" Ref="#U$163"  Part="1" 
AR Path="/5E92540F/C2734EFA" Ref="#U$0163"  Part="1" 
F 0 "#U$0163" H 2950 7225 50  0001 C CNN
F 1 "GND" H 2863 7137 59  0000 L BNN
F 2 "" H 2950 7225 50  0001 C CNN
F 3 "" H 2950 7225 50  0001 C CNN
	1    2950 7225
	1    0    0    -1  
$EndComp
$Comp
L cpu-board:GND #U$188
U 1 1 E9CEE54B
P 3700 10500
AR Path="/E9CEE54B" Ref="#U$188"  Part="1" 
AR Path="/5E92540F/E9CEE54B" Ref="#U$0188"  Part="1" 
F 0 "#U$0188" H 3700 10500 50  0001 C CNN
F 1 "GND" H 3613 10413 59  0000 L BNN
F 2 "" H 3700 10500 50  0001 C CNN
F 3 "" H 3700 10500 50  0001 C CNN
	1    3700 10500
	-1   0    0    -1  
$EndComp
$Comp
L cpu-board:GND #U$183
U 1 1 A3030CF0
P 4750 10525
AR Path="/A3030CF0" Ref="#U$183"  Part="1" 
AR Path="/5E92540F/A3030CF0" Ref="#U$0183"  Part="1" 
F 0 "#U$0183" H 4750 10525 50  0001 C CNN
F 1 "GND" H 4662 10438 59  0000 L BNN
F 2 "" H 4750 10525 50  0001 C CNN
F 3 "" H 4750 10525 50  0001 C CNN
	1    4750 10525
	-1   0    0    -1  
$EndComp
$Comp
L cpu-board:GND #U$192
U 1 1 AFF65876
P 5500 8875
AR Path="/AFF65876" Ref="#U$192"  Part="1" 
AR Path="/5E92540F/AFF65876" Ref="#U$0192"  Part="1" 
F 0 "#U$0192" H 5500 8875 50  0001 C CNN
F 1 "GND" H 5425 8787 59  0000 L BNN
F 2 "" H 5500 8875 50  0001 C CNN
F 3 "" H 5500 8875 50  0001 C CNN
	1    5500 8875
	-1   0    0    -1  
$EndComp
$Comp
L cpu-board:+5V #U$194
U 1 1 B988052F
P 6350 7950
AR Path="/B988052F" Ref="#U$194"  Part="1" 
AR Path="/5E92540F/B988052F" Ref="#U$0194"  Part="1" 
F 0 "#U$0194" H 6350 7950 50  0001 C CNN
F 1 "+5V" H 6262 7862 59  0000 L BNN
F 2 "" H 6350 7950 50  0001 C CNN
F 3 "" H 6350 7950 50  0001 C CNN
	1    6350 7950
	1    0    0    1   
$EndComp
$Comp
L cpu-board:GND #U$213
U 1 1 ECE78060
P 2550 9725
AR Path="/ECE78060" Ref="#U$213"  Part="1" 
AR Path="/5E92540F/ECE78060" Ref="#U$0213"  Part="1" 
F 0 "#U$0213" H 2550 9725 50  0001 C CNN
F 1 "GND" H 2463 9650 59  0000 L BNN
F 2 "" H 2550 9725 50  0001 C CNN
F 3 "" H 2550 9725 50  0001 C CNN
	1    2550 9725
	1    0    0    -1  
$EndComp
$Comp
L cpu-board:0VANA #U$376
U 1 1 CFE99AB5
P 8750 3025
AR Path="/CFE99AB5" Ref="#U$376"  Part="1" 
AR Path="/5E92540F/CFE99AB5" Ref="#U$0376"  Part="1" 
F 0 "#U$0376" H 8750 3025 50  0001 C CNN
F 1 "0VANA" H 8625 2838 59  0000 L BNN
F 2 "" H 8750 3025 50  0001 C CNN
F 3 "" H 8750 3025 50  0001 C CNN
	1    8750 3025
	1    0    0    -1  
$EndComp
$Comp
L cpu-board:0VANA #U$377
U 1 1 BA815124
P 8750 5300
AR Path="/BA815124" Ref="#U$377"  Part="1" 
AR Path="/5E92540F/BA815124" Ref="#U$0377"  Part="1" 
F 0 "#U$0377" H 8750 5300 50  0001 C CNN
F 1 "0VANA" H 8625 5125 59  0000 L BNN
F 2 "" H 8750 5300 50  0001 C CNN
F 3 "" H 8750 5300 50  0001 C CNN
	1    8750 5300
	1    0    0    -1  
$EndComp
$Comp
L cpu-board:GND #U$389
U 1 1 F567780A
P 8750 7725
AR Path="/F567780A" Ref="#U$389"  Part="1" 
AR Path="/5E92540F/F567780A" Ref="#U$0389"  Part="1" 
F 0 "#U$0389" H 8750 7725 50  0001 C CNN
F 1 "GND" H 8662 7638 59  0000 L BNN
F 2 "" H 8750 7725 50  0001 C CNN
F 3 "" H 8750 7725 50  0001 C CNN
	1    8750 7725
	1    0    0    -1  
$EndComp
$Comp
L cpu-board:PRLL5819 D7
U 1 1 11F28FEE
P 1700 8975
AR Path="/11F28FEE" Ref="D7"  Part="1" 
AR Path="/5E92540F/11F28FEE" Ref="D7"  Part="1" 
F 0 "D7" V 1746 9084 59  0000 L BNN
F 1 "PRLL5819" V 1827 9087 42  0000 L BNN
F 2 "AllModules:SOD87_1" H 1700 8975 50  0001 C CNN
F 3 "" H 1700 8975 50  0001 C CNN
F 4 "DIODE SCHOTTKY, 40V, 1A" H 1700 8975 50  0001 C CNN "Description"
F 5 "10097253" H 1700 8975 50  0001 C CNN "Item Number"
F 6 "DIODES INC_RMS1" H 1700 8975 50  0001 C CNN "Manufacturer"
F 7 "1N5819HW-7-F" H 1700 8975 50  0001 C CNN "Manufacturer_No"
F 8 "SURFACE MOUNT SCHOTTKY BARRIER RECTIFIER" H 1700 8975 50  0001 C CNN "Manufacturer_Desc"
	1    1700 8975
	0    1    1    0   
$EndComp
$Comp
L cpu-board:BAT54 D11
U 1 1 84A4DC5F
P 2550 8125
AR Path="/84A4DC5F" Ref="D11"  Part="1" 
AR Path="/5E92540F/84A4DC5F" Ref="D11"  Part="1" 
F 0 "D11" H 2522 8292 59  0000 L BNN
F 1 "STPS340U" H 2524 8211 42  0000 L BNN
F 2 "AllModules:SMB_1" H 2550 8125 50  0001 C CNN
F 3 "" H 2550 8125 50  0001 C CNN
F 4 "DIODE SCHOTTKY, 3A, 40V" H 2550 8125 50  0001 C CNN "Description"
F 5 "10022656" H 2550 8125 50  0001 C CNN "Item Number"
F 6 "STMICROELECTRONICS" H 2550 8125 50  0001 C CNN "Manufacturer"
F 7 "STPS340U" H 2550 8125 50  0001 C CNN "Manufacturer_No"
F 8 "POWER SCHOTTKY RECTIFIER" H 2550 8125 50  0001 C CNN "Manufacturer_Desc"
	1    2550 8125
	1    0    0    -1  
$EndComp
$Comp
L cpu-board:JUMP_0U JP9
U 1 1 C8B46213
P 12350 1550
AR Path="/C8B46213" Ref="JP9"  Part="1" 
AR Path="/5E92540F/C8B46213" Ref="JP9"  Part="1" 
F 0 "JP9" H 12250 1650 51  0000 L BNN
F 1 "JUMP_0U" H 12200 1725 51  0001 L BNN
F 2 "AllModules:R0603_1" H 12350 1550 50  0001 C CNN
F 3 "" H 12350 1550 50  0001 C CNN
	1    12350 1550
	1    0    0    -1  
$EndComp
$Comp
L cpu-board:R0805 R44
U 1 1 84674E91
P 2125 4650
AR Path="/84674E91" Ref="R44"  Part="1" 
AR Path="/5E92540F/84674E91" Ref="R44"  Part="1" 
F 0 "R44" H 2062 4800 64  0000 L BNN
F 1 "180" H 2062 4725 42  0000 L BNN
F 2 "AllModules:R0805_1" H 2125 4650 50  0001 C CNN
F 3 "" H 2125 4650 50  0001 C CNN
F 4 "RESISTOR, 180 OHM, 0805, +/-5%" H 2125 4650 50  0001 C CNN "Description"
F 5 "10023240" H 2125 4650 50  0001 C CNN "Item Number"
F 6 "YAGEO_RMS1" H 2125 4650 50  0001 C CNN "Manufacturer"
F 7 "232273061181" H 2125 4650 50  0001 C CNN "Manufacturer_No"
F 8 "RESISTOR, METAL GLAZE/THICK FILM, 0.125 W, 5 %, 100 PPM, 180 OHM, SURFACE MOUNT, 0805" H 2125 4650 50  0001 C CNN "Manufacturer_Desc"
F 9 "KOA SPEER" H 2125 4650 50  0001 C CNN "Manufacturer2"
F 10 "RK73B2ATTD181J" H 2125 4650 50  0001 C CNN "Manufacturer_No2"
F 11 "THICK FILM CHIP RESISTOR" H 2125 4650 50  0001 C CNN "Manufacturer_Desc2"
F 12 "YAGEO_RMS1" H 2125 4650 50  0001 C CNN "Manufacturer3"
F 13 "232273061181L" H 2125 4650 50  0001 C CNN "Manufacturer_No3"
F 14 "RESISTOR, METAL GLAZE/THICK FILM, 0.125 W, 5 %, 100 PPM, 180 OHM, SURFACE MOUNT, 0805" H 2125 4650 50  0001 C CNN "Manufacturer_Desc3"
F 15 "YAGEO_RMS1" H 2125 4650 50  0001 C CNN "Manufacturer4"
F 16 "RC0805JR-07180RL" H 2125 4650 50  0001 C CNN "Manufacturer_No4"
F 17 "RESISTOR, METAL GLAZE/THICK FILM, 0.125 W, 5 %, 100 PPM, 180 OHM, SURFACE MOUNT, 0805" H 2125 4650 50  0001 C CNN "Manufacturer_Desc4"
	1    2125 4650
	1    0    0    -1  
$EndComp
$Comp
L cpu-board:R0805 R71
U 1 1 58DA2A05
P 4750 9175
AR Path="/58DA2A05" Ref="R71"  Part="1" 
AR Path="/5E92540F/58DA2A05" Ref="R71"  Part="1" 
F 0 "R71" V 4675 9087 64  0000 R TNN
F 1 "10k" V 4775 9087 42  0000 R TNN
F 2 "AllModules:R0603_1" H 4750 9175 50  0001 C CNN
F 3 "" H 4750 9175 50  0001 C CNN
F 4 "RESISTOR, PRECISION,10K OHM, 0.063W,+/-0.1%,0603" H 4750 9175 50  0001 C CNN "Description"
F 5 "10097272" H 4750 9175 50  0001 C CNN "Item Number"
F 6 "SUSUMU CO" H 4750 9175 50  0001 C CNN "Manufacturer"
F 7 "RG1608P-103-B-T5" H 4750 9175 50  0001 C CNN "Manufacturer_No"
F 8 "RES 10.0K OHM 1/10W .1% 0603 SMD" H 4750 9175 50  0001 C CNN "Manufacturer_Desc"
F 9 "WELWYN" H 4750 9175 50  0001 C CNN "Manufacturer2"
F 10 "PCF0603R-10KBI" H 4750 9175 50  0001 C CNN "Manufacturer_No2"
F 11 "PRECISION SURFACE MOUNT RESISTOR" H 4750 9175 50  0001 C CNN "Manufacturer_Desc2"
F 12 "YAGEO_RMS1" H 4750 9175 50  0001 C CNN "Manufacturer3"
F 13 "RT0603BRB0710K" H 4750 9175 50  0001 C CNN "Manufacturer_No3"
F 14 "" H 4750 9175 50  0001 C CNN "Manufacturer_Desc3"
F 15 "YAGEO_RMS1" H 4750 9175 50  0001 C CNN "Manufacturer4"
F 16 "RT0603BRB0710KL" H 4750 9175 50  0001 C CNN "Manufacturer_No4"
F 17 "" H 4750 9175 50  0001 C CNN "Manufacturer_Desc4"
	1    4750 9175
	0    -1   1    0   
$EndComp
$Comp
L cpu-board:R0805 R73
U 1 1 EBEFFEA5
P 4750 10175
AR Path="/EBEFFEA5" Ref="R73"  Part="1" 
AR Path="/5E92540F/EBEFFEA5" Ref="R73"  Part="1" 
F 0 "R73" V 4825 10250 64  0000 L BNN
F 1 "3.24k" V 4725 10263 42  0000 L BNN
F 2 "AllModules:R0603_1" H 4750 10175 50  0001 C CNN
F 3 "" H 4750 10175 50  0001 C CNN
F 4 "RESISTOR,PRECISION, 3.24K OHM, 0.063W,+/-0.1%,0603" H 4750 10175 50  0001 C CNN "Description"
F 5 "10097273" H 4750 10175 50  0001 C CNN "Item Number"
F 6 "SUSUMU CO" H 4750 10175 50  0001 C CNN "Manufacturer"
F 7 "RG1608P-3241-B-T5" H 4750 10175 50  0001 C CNN "Manufacturer_No"
F 8 "" H 4750 10175 50  0001 C CNN "Manufacturer_Desc"
F 9 "WELWYN" H 4750 10175 50  0001 C CNN "Manufacturer2"
F 10 "PCF0603R-3K24BI" H 4750 10175 50  0001 C CNN "Manufacturer_No2"
F 11 "PRECISION SURFACE MOUNT RESISTOR" H 4750 10175 50  0001 C CNN "Manufacturer_Desc2"
F 12 "WELWYN" H 4750 10175 50  0001 C CNN "Manufacturer3"
F 13 "PCF0603R-3K24BT1" H 4750 10175 50  0001 C CNN "Manufacturer_No3"
F 14 "PRECISION SURFACE MOUNT RESISTOR" H 4750 10175 50  0001 C CNN "Manufacturer_Desc3"
F 15 "YAGEO_RMS1" H 4750 10175 50  0001 C CNN "Manufacturer4"
F 16 "RT0603BRD073K24L" H 4750 10175 50  0001 C CNN "Manufacturer_No4"
F 17 "" H 4750 10175 50  0001 C CNN "Manufacturer_Desc4"
	1    4750 10175
	0    1    -1   0   
$EndComp
$Comp
L cpu-board:R0805 R66
U 1 1 DA816598
P 8150 3900
AR Path="/DA816598" Ref="R66"  Part="1" 
AR Path="/5E92540F/DA816598" Ref="R66"  Part="1" 
F 0 "R66" H 8062 4038 64  0000 L BNN
F 1 "470" H 8075 3975 42  0000 L BNN
F 2 "AllModules:R0805_1" H 8150 3900 50  0001 C CNN
F 3 "" H 8150 3900 50  0001 C CNN
F 4 "RESISTOR,470 OHM, 0.125W,+/-1%, 0805" H 8150 3900 50  0001 C CNN "Description"
F 5 "10022697" H 8150 3900 50  0001 C CNN "Item Number"
F 6 "YAGEO_RMS1" H 8150 3900 50  0001 C CNN "Manufacturer"
F 7 "232273464701L" H 8150 3900 50  0001 C CNN "Manufacturer_No"
F 8 "RESISTOR, METAL GLAZE/THICK FILM, 0.125 W, 1 %, 100 PPM, 470 OHM, SURFACE MOUNT, 0805" H 8150 3900 50  0001 C CNN "Manufacturer_Desc"
F 9 "VISHAY_RMS1" H 8150 3900 50  0001 C CNN "Manufacturer2"
F 10 "CRCW0805470RFKEA" H 8150 3900 50  0001 C CNN "Manufacturer_No2"
F 11 "THICK FILM RECTANGULAR CHIP RESISTOR" H 8150 3900 50  0001 C CNN "Manufacturer_Desc2"
F 12 "YAGEO_RMS1" H 8150 3900 50  0001 C CNN "Manufacturer3"
F 13 "232273464701" H 8150 3900 50  0001 C CNN "Manufacturer_No3"
F 14 "RESISTOR, METAL GLAZE/THICK FILM, 0.125 W, 1 %, 100 PPM, 470 OHM, SURFACE MOUNT, 0805" H 8150 3900 50  0001 C CNN "Manufacturer_Desc3"
F 15 "YAGEO_RMS1" H 8150 3900 50  0001 C CNN "Manufacturer4"
F 16 "RC0805FR-07470RL" H 8150 3900 50  0001 C CNN "Manufacturer_No4"
F 17 "RESISTOR, METAL GLAZE/THICK FILM, 0.125 W, 1 %, 100 PPM, 470 OHM, SURFACE MOUNT, 0805" H 8150 3900 50  0001 C CNN "Manufacturer_Desc4"
F 18 "ASJ" H 8150 3900 50  0001 C CNN "Manufacturer5"
F 19 "CR21-4700FL" H 8150 3900 50  0001 C CNN "Manufacturer_No5"
F 20 "THICK FILM CHIP RESISTOR" H 8150 3900 50  0001 C CNN "Manufacturer_Desc5"
	1    8150 3900
	1    0    0    -1  
$EndComp
$Comp
L cpu-board:R0805 R67
U 1 1 2547CA40
P 8450 4600
AR Path="/2547CA40" Ref="R67"  Part="1" 
AR Path="/5E92540F/2547CA40" Ref="R67"  Part="1" 
F 0 "R67" V 8450 4863 64  0000 R TNN
F 1 "470" V 8363 4850 42  0000 R TNN
F 2 "AllModules:R0805_1" H 8450 4600 50  0001 C CNN
F 3 "" H 8450 4600 50  0001 C CNN
F 4 "RESISTOR,470 OHM, 0.125W,+/-1%, 0805" H 8450 4600 50  0001 C CNN "Description"
F 5 "10022697" H 8450 4600 50  0001 C CNN "Item Number"
F 6 "YAGEO_RMS1" H 8450 4600 50  0001 C CNN "Manufacturer"
F 7 "232273464701L" H 8450 4600 50  0001 C CNN "Manufacturer_No"
F 8 "RESISTOR, METAL GLAZE/THICK FILM, 0.125 W, 1 %, 100 PPM, 470 OHM, SURFACE MOUNT, 0805" H 8450 4600 50  0001 C CNN "Manufacturer_Desc"
F 9 "VISHAY_RMS1" H 8450 4600 50  0001 C CNN "Manufacturer2"
F 10 "CRCW0805470RFKEA" H 8450 4600 50  0001 C CNN "Manufacturer_No2"
F 11 "THICK FILM RECTANGULAR CHIP RESISTOR" H 8450 4600 50  0001 C CNN "Manufacturer_Desc2"
F 12 "YAGEO_RMS1" H 8450 4600 50  0001 C CNN "Manufacturer3"
F 13 "232273464701" H 8450 4600 50  0001 C CNN "Manufacturer_No3"
F 14 "RESISTOR, METAL GLAZE/THICK FILM, 0.125 W, 1 %, 100 PPM, 470 OHM, SURFACE MOUNT, 0805" H 8450 4600 50  0001 C CNN "Manufacturer_Desc3"
F 15 "YAGEO_RMS1" H 8450 4600 50  0001 C CNN "Manufacturer4"
F 16 "RC0805FR-07470RL" H 8450 4600 50  0001 C CNN "Manufacturer_No4"
F 17 "RESISTOR, METAL GLAZE/THICK FILM, 0.125 W, 1 %, 100 PPM, 470 OHM, SURFACE MOUNT, 0805" H 8450 4600 50  0001 C CNN "Manufacturer_Desc4"
F 18 "ASJ" H 8450 4600 50  0001 C CNN "Manufacturer5"
F 19 "CR21-4700FL" H 8450 4600 50  0001 C CNN "Manufacturer_No5"
F 20 "THICK FILM CHIP RESISTOR" H 8450 4600 50  0001 C CNN "Manufacturer_Desc5"
	1    8450 4600
	0    -1   -1   0   
$EndComp
$Comp
L cpu-board:R0805 R40
U 1 1 7FF0BFE4
P 15125 2775
AR Path="/7FF0BFE4" Ref="R40"  Part="1" 
AR Path="/5E92540F/7FF0BFE4" Ref="R40"  Part="1" 
F 0 "R40" V 15112 2862 64  0000 L BNN
F 1 "15k" V 15187 2862 42  0000 L BNN
F 2 "AllModules:R0603_1" H 15125 2775 50  0001 C CNN
F 3 "" H 15125 2775 50  0001 C CNN
F 4 "RESISTOR, 15K OHM, 0603, +/-1%" H 15125 2775 50  0001 C CNN "Description"
F 5 "10023238" H 15125 2775 50  0001 C CNN "Item Number"
F 6 "ASJ" H 15125 2775 50  0001 C CNN "Manufacturer"
F 7 "CR16153FL" H 15125 2775 50  0001 C CNN "Manufacturer_No"
F 8 "" H 15125 2775 50  0001 C CNN "Manufacturer_Desc"
F 9 "VISHAY_RMS1" H 15125 2775 50  0001 C CNN "Manufacturer2"
F 10 "CRCW060315K0FKEA" H 15125 2775 50  0001 C CNN "Manufacturer_No2"
F 11 "THICK FILM RECTANGULAR CHIP RESISTOR" H 15125 2775 50  0001 C CNN "Manufacturer_Desc2"
F 12 "YAGEO_RMS1" H 15125 2775 50  0001 C CNN "Manufacturer3"
F 13 "232270461503L" H 15125 2775 50  0001 C CNN "Manufacturer_No3"
F 14 "RESISTOR, METAL GLAZE/THICK FILM, 0.1 W, 1 %, 100 PPM, 15000 OHM, SURFACE MOUNT, 0603" H 15125 2775 50  0001 C CNN "Manufacturer_Desc3"
F 15 "YAGEO_RMS1" H 15125 2775 50  0001 C CNN "Manufacturer4"
F 16 "RC0603FR-0715KL" H 15125 2775 50  0001 C CNN "Manufacturer_No4"
F 17 "RESISTOR, METAL GLAZE/THICK FILM, 0.1 W, 1 %, 100 PPM, 15000 OHM, SURFACE MOUNT, 0603" H 15125 2775 50  0001 C CNN "Manufacturer_Desc4"
F 18 "YAGEO_RMS1" H 15125 2775 50  0001 C CNN "Manufacturer5"
F 19 "232270461503" H 15125 2775 50  0001 C CNN "Manufacturer_No5"
F 20 "RESISTOR, METAL GLAZE/THICK FILM, 0.1 W, 1 %, 100 PPM, 15000 OHM, SURFACE MOUNT, 0603" H 15125 2775 50  0001 C CNN "Manufacturer_Desc5"
	1    15125 2775
	0    1    1    0   
$EndComp
$Comp
L cpu-board:WE-TPC-MH L2
U 1 1 86B7B564
P 3650 8125
AR Path="/86B7B564" Ref="L2"  Part="1" 
AR Path="/5E92540F/86B7B564" Ref="L2"  Part="1" 
F 0 "L2" H 3750 8363 59  0000 R TNN
F 1 "33uH" H 3750 8263 59  0000 R TNN
F 2 "AllModules:WE-PD4_1" H 3650 8125 50  0001 C CNN
F 3 "" H 3650 8125 50  0001 C CNN
F 4 "INDUCTOR,33UH +/-10%" H 3650 8125 50  0001 C CNN "Description"
F 5 "10022908" H 3650 8125 50  0001 C CNN "Item Number"
F 6 "WURTH ELEKTRONIK GMBH" H 3650 8125 50  0001 C CNN "Manufacturer"
F 7 "74456133" H 3650 8125 50  0001 C CNN "Manufacturer_No"
F 8 "POWER CHOKE" H 3650 8125 50  0001 C CNN "Manufacturer_Desc"
	1    3650 8125
	-1   0    0    -1  
$EndComp
$Comp
L cpu-board:MV100?F50V C88
U 1 1 2D29FFA4
P 1700 9775
AR Path="/2D29FFA4" Ref="C88"  Part="1" 
AR Path="/5E92540F/2D29FFA4" Ref="C88"  Part="1" 
F 0 "C88" H 1825 9781 56  0000 L BNN
F 1 "1000uF" H 1825 9706 42  0000 L BNN
F 2 "AllModules:CO31D1_1" H 1700 9775 50  0001 C CNN
F 3 "" H 1700 9775 50  0001 C CNN
F 4 "CAPACITOR ELECTROLYTIC, 1000UF,35V,+/-20%" H 1700 9775 50  0001 C CNN "Description"
F 5 "10097252" H 1700 9775 50  0001 C CNN "Item Number"
F 6 "ILLINOIS CAPACITOR, INC." H 1700 9775 50  0001 C CNN "Manufacturer"
F 7 "108TTA035M" H 1700 9775 50  0001 C CNN "Manufacturer_No"
F 8 "" H 1700 9775 50  0001 C CNN "Manufacturer_Desc"
F 9 "MULTICOMP                       (920630)" H 1700 9775 50  0001 C CNN "Manufacturer2"
F 10 "MCLV102M1VB-1327-RH" H 1700 9775 50  0001 C CNN "Manufacturer_No2"
F 11 "" H 1700 9775 50  0001 C CNN "Manufacturer_Desc2"
	1    1700 9775
	1    0    0    -1  
$EndComp
$Comp
L cpu-board:TANTALB C92
U 1 1 939B92B5
P 3875 6750
AR Path="/939B92B5" Ref="C92"  Part="1" 
AR Path="/5E92540F/939B92B5" Ref="C92"  Part="1" 
F 0 "C92" H 3987 6743 56  0000 L BNN
F 1 "22uF" H 4000 6668 42  0000 L BNN
F 2 "AllModules:C3216_1" H 3875 6750 50  0001 C CNN
F 3 "" H 3875 6750 50  0001 C CNN
F 4 "CAPACITOR TANTALUM, 22UF, 10V,+/-10%" H 3875 6750 50  0001 C CNN "Description"
F 5 "10022973" H 3875 6750 50  0001 C CNN "Item Number"
F 6 "KEMET" H 3875 6750 50  0001 C CNN "Manufacturer"
F 7 "T495A226K010ATE1K2" H 3875 6750 50  0001 C CNN "Manufacturer_No"
F 8 "Cap, Tantalum, Polarized, 10V, 10% +/-Tol, 22uF, Surface Mount, Case A, EIA Metric 3216" H 3875 6750 50  0001 C CNN "Manufacturer_Desc"
	1    3875 6750
	1    0    0    -1  
$EndComp
$Comp
L cpu-board:CHCMS_D8 C106
U 1 1 F8977F3B
P 4950 8400
AR Path="/F8977F3B" Ref="C106"  Part="1" 
AR Path="/5E92540F/F8977F3B" Ref="C106"  Part="1" 
F 0 "C106" H 4850 8468 56  0000 R TNN
F 1 "220uF" H 4838 8368 42  0000 R TNN
F 2 "AllModules:C-SC8_1" H 4950 8400 50  0001 C CNN
F 3 "" H 4950 8400 50  0001 C CNN
F 4 "CAPACITOR ELECTROLYTIC, 220UF,16V+/-20%" H 4950 8400 50  0001 C CNN "Description"
F 5 "10022622" H 4950 8400 50  0001 C CNN "Item Number"
F 6 "PANASONIC_RMS1" H 4950 8400 50  0001 C CNN "Manufacturer"
F 7 "EEEFK1C221P" H 4950 8400 50  0001 C CNN "Manufacturer_No"
F 8 "ALUMINUM ELETROLYTIC CAPACITORS/FK" H 4950 8400 50  0001 C CNN "Manufacturer_Desc"
F 9 "ELNA AMERICA, INC." H 4950 8400 50  0001 C CNN "Manufacturer2"
F 10 "RVD-16V221MG68U-R" H 4950 8400 50  0001 C CNN "Manufacturer_No2"
F 11 "" H 4950 8400 50  0001 C CNN "Manufacturer_Desc2"
F 12 "ELNA AMERICA, INC." H 4950 8400 50  0001 C CNN "Manufacturer3"
F 13 "RVZ-16V221MG68U" H 4950 8400 50  0001 C CNN "Manufacturer_No3"
F 14 "CHIP TYPE, LOW IMPEDANCE CAP." H 4950 8400 50  0001 C CNN "Manufacturer_Desc3"
	1    4950 8400
	-1   0    0    -1  
$EndComp
$Comp
L cpu-board:TANTALB C108
U 1 1 1DA7F1EB
P 5500 8400
AR Path="/1DA7F1EB" Ref="C108"  Part="1" 
AR Path="/5E92540F/1DA7F1EB" Ref="C108"  Part="1" 
F 0 "C108" H 5400 8468 56  0000 R TNN
F 1 "10uF" H 5400 8368 42  0000 R TNN
F 2 "AllModules:C6032_1" H 5500 8400 50  0001 C CNN
F 3 "" H 5500 8400 50  0001 C CNN
F 4 "CAPACITOR TANTALUM, 10UF, 25V, +/-10%" H 5500 8400 50  0001 C CNN "Description"
F 5 "10022608" H 5500 8400 50  0001 C CNN "Item Number"
F 6 "KEMET" H 5500 8400 50  0001 C CNN "Manufacturer"
F 7 "T491C106K025AT" H 5500 8400 50  0001 C CNN "Manufacturer_No"
F 8 "Cap, Tantalum, Polarized, 25V, 10% +/-Tol, 10uF, Surface Mount, 2312 (Case C), EIA Metric 6032" H 5500 8400 50  0001 C CNN "Manufacturer_Desc"
F 9 "KEMET" H 5500 8400 50  0001 C CNN "Manufacturer2"
F 10 "T495C106K025ATE275" H 5500 8400 50  0001 C CNN "Manufacturer_No2"
F 11 "Cap, Tantalum, Polarized, 25V, 10% +/-Tol, 10uF, Surface Mount, 2312 (Case C), EIA Metric 6032" H 5500 8400 50  0001 C CNN "Manufacturer_Desc2"
	1    5500 8400
	-1   0    0    -1  
$EndComp
$Comp
L cpu-board:MV100?F50V C21
U 1 1 967DA045
P 14150 2300
AR Path="/967DA045" Ref="C21"  Part="1" 
AR Path="/5E92540F/967DA045" Ref="C21"  Part="1" 
F 0 "C21" H 14350 2300 56  0000 L BNN
F 1 "100uF" H 14275 2231 42  0000 L BNN
F 2 "AllModules:C-SC8_1" H 14150 2300 50  0001 C CNN
F 3 "" H 14150 2300 50  0001 C CNN
F 4 "CAPACITOR ELECTROLYTIC, 100UF, 35V +/-20%" H 14150 2300 50  0001 C CNN "Description"
F 5 "10022963" H 14150 2300 50  0001 C CNN "Item Number"
F 6 "MULTICOMP                       (920630)" H 14150 2300 50  0001 C CNN "Manufacturer"
F 7 "MCRH35V107M8X11" H 14150 2300 50  0001 C CNN "Manufacturer_No"
F 8 "ELECTROLYTIC CAPACITOR" H 14150 2300 50  0001 C CNN "Manufacturer_Desc"
F 9 "LELON" H 14150 2300 50  0001 C CNN "Manufacturer2"
F 10 "RXW101M1V-SA-0811" H 14150 2300 50  0001 C CNN "Manufacturer_No2"
F 11 "ALUMINIUM ELECTROLYTIC CAPACITOR" H 14150 2300 50  0001 C CNN "Manufacturer_Desc2"
	1    14150 2300
	1    0    0    -1  
$EndComp
$Comp
L cpu-board:BCP51 T11
U 1 1 64295267
P 2400 1350
AR Path="/64295267" Ref="T11"  Part="1" 
AR Path="/5E92540F/64295267" Ref="T11"  Part="1" 
F 0 "T11" V 2637 1440 85  0000 L BNN
F 1 "FZT953" V 2545 1453 42  0000 L BNN
F 2 "AllModules:SOT223_1" H 2400 1350 50  0001 C CNN
F 3 "" H 2400 1350 50  0001 C CNN
F 4 "RSP TRANSISTOR, BIPOLAR, PNP, 100V, 5A, SOT223" H 2400 1350 50  0001 C CNN "Description"
F 5 "10023243" H 2400 1350 50  0001 C CNN "Item Number"
F 6 "ZETEX" H 2400 1350 50  0001 C CNN "Manufacturer"
F 7 "FZT953" H 2400 1350 50  0001 C CNN "Manufacturer_No"
F 8 "60 TO 100V PNP TRANSISTOR" H 2400 1350 50  0001 C CNN "Manufacturer_Desc"
F 9 "ZETEX" H 2400 1350 50  0001 C CNN "Manufacturer2"
F 10 "FZT953TA" H 2400 1350 50  0001 C CNN "Manufacturer_No2"
F 11 "TRANSISTOR" H 2400 1350 50  0001 C CNN "Manufacturer_Desc2"
	1    2400 1350
	0    1    -1   0   
$EndComp
$Comp
L cpu-board:BCP51 T12
U 1 1 28298AA4
P 2400 3750
AR Path="/28298AA4" Ref="T12"  Part="1" 
AR Path="/5E92540F/28298AA4" Ref="T12"  Part="1" 
F 0 "T12" V 2650 3840 85  0000 L BNN
F 1 "FZT953" V 2557 3853 42  0000 L BNN
F 2 "AllModules:SOT223_1" H 2400 3750 50  0001 C CNN
F 3 "" H 2400 3750 50  0001 C CNN
F 4 "RSP TRANSISTOR, BIPOLAR, PNP, 100V, 5A, SOT223" H 2400 3750 50  0001 C CNN "Description"
F 5 "10023243" H 2400 3750 50  0001 C CNN "Item Number"
F 6 "ZETEX" H 2400 3750 50  0001 C CNN "Manufacturer"
F 7 "FZT953" H 2400 3750 50  0001 C CNN "Manufacturer_No"
F 8 "60 TO 100V PNP TRANSISTOR" H 2400 3750 50  0001 C CNN "Manufacturer_Desc"
F 9 "ZETEX" H 2400 3750 50  0001 C CNN "Manufacturer2"
F 10 "FZT953TA" H 2400 3750 50  0001 C CNN "Manufacturer_No2"
F 11 "TRANSISTOR" H 2400 3750 50  0001 C CNN "Manufacturer_Desc2"
	1    2400 3750
	0    1    -1   0   
$EndComp
$Comp
L cpu-board:BCP51 T10
U 1 1 97227110
P 12400 1975
AR Path="/97227110" Ref="T10"  Part="1" 
AR Path="/5E92540F/97227110" Ref="T10"  Part="1" 
F 0 "T10" V 12638 2078 85  0000 L BNN
F 1 "FZT953" V 12533 2090 42  0000 L BNN
F 2 "AllModules:SOT223_1" H 12400 1975 50  0001 C CNN
F 3 "" H 12400 1975 50  0001 C CNN
F 4 "RSP TRANSISTOR, BIPOLAR, PNP, 100V, 5A, SOT223" H 12400 1975 50  0001 C CNN "Description"
F 5 "10023243" H 12400 1975 50  0001 C CNN "Item Number"
F 6 "ZETEX" H 12400 1975 50  0001 C CNN "Manufacturer"
F 7 "FZT953" H 12400 1975 50  0001 C CNN "Manufacturer_No"
F 8 "60 TO 100V PNP TRANSISTOR" H 12400 1975 50  0001 C CNN "Manufacturer_Desc"
F 9 "ZETEX" H 12400 1975 50  0001 C CNN "Manufacturer2"
F 10 "FZT953TA" H 12400 1975 50  0001 C CNN "Manufacturer_No2"
F 11 "TRANSISTOR" H 12400 1975 50  0001 C CNN "Manufacturer_Desc2"
	1    12400 1975
	0    1    -1   0   
$EndComp
$Comp
L cpu-board:LF33CDT IC26
U 1 1 694A8893
P 2950 6400
AR Path="/694A8893" Ref="IC26"  Part="1" 
AR Path="/5E92540F/694A8893" Ref="IC26"  Part="1" 
F 0 "IC26" H 2775 6612 85  0000 L BNN
F 1 "LF33CDT" H 2775 6525 42  0000 L BNN
F 2 "AllModules:DPAK_1" H 2950 6400 50  0001 C CNN
F 3 "" H 2950 6400 50  0001 C CNN
F 4 "REGULATOR 3.3 V 2% 500MA LOW DROPOUT,DPACK" H 2950 6400 50  0001 C CNN "Description"
F 5 "10022892" H 2950 6400 50  0001 C CNN "Item Number"
F 6 "ST MICROELECTRONIC" H 2950 6400 50  0001 C CNN "Manufacturer"
F 7 "LF33CDT" H 2950 6400 50  0001 C CNN "Manufacturer_No"
F 8 "VERY LOW DROP VOLTAGE REGULATOR" H 2950 6400 50  0001 C CNN "Manufacturer_Desc"
F 9 "STMICROELECTRONICS" H 2950 6400 50  0001 C CNN "Manufacturer2"
F 10 "LF33CDT-TR" H 2950 6400 50  0001 C CNN "Manufacturer_No2"
F 11 "VERY LOW DROP VOLTAGE REGULATOR" H 2950 6400 50  0001 C CNN "Manufacturer_Desc2"
	1    2950 6400
	1    0    0    -1  
$EndComp
$Comp
L cpu-board:LT1236 IC23
U 1 1 44FE90A9
P 2925 4500
AR Path="/44FE90A9" Ref="IC23"  Part="1" 
AR Path="/5E92540F/44FE90A9" Ref="IC23"  Part="1" 
F 0 "IC23" H 2613 4712 64  0000 L BNN
F 1 "LT1236ACS8-10" H 2613 4625 59  0000 L BNN
F 2 "AllModules:MX.A8_COMPOSANT_1" H 2925 4500 50  0001 C CNN
F 3 "" H 2925 4500 50  0001 C CNN
F 4 "IC,REFERENCE VOLTAGE 10V FIXED - 10 MA,SO8" H 2925 4500 50  0001 C CNN "Description"
F 5 "10023040" H 2925 4500 50  0001 C CNN "Item Number"
F 6 "LINEAR TECHNOLOGY_RMS1" H 2925 4500 50  0001 C CNN "Manufacturer"
F 7 "LT1236CCS8-10#TRPBF" H 2925 4500 50  0001 C CNN "Manufacturer_No"
F 8 "PRECISION REFERENCE" H 2925 4500 50  0001 C CNN "Manufacturer_Desc"
	1    2925 4500
	1    0    0    -1  
$EndComp
$Comp
L cpu-board:STM809 IC24
U 1 1 7AE97733
P 8950 2300
AR Path="/7AE97733" Ref="IC24"  Part="1" 
AR Path="/5E92540F/7AE97733" Ref="IC24"  Part="1" 
F 0 "IC24" H 8950 2738 59  0000 L BNN
F 1 "STM809LWX" H 8950 2650 59  0000 L BNN
F 2 "AllModules:SOT23-1G_1" H 8950 2300 50  0001 C CNN
F 3 "" H 8950 2300 50  0001 C CNN
F 4 "RESET CIRCUIT, SUPERVISOR VOLTAGE 5V,SOT23" H 8950 2300 50  0001 C CNN "Description"
F 5 "10022974" H 8950 2300 50  0001 C CNN "Item Number"
F 6 "STMICROELECTRONICS" H 8950 2300 50  0001 C CNN "Manufacturer"
F 7 "STM809LWX6F" H 8950 2300 50  0001 C CNN "Manufacturer_No"
F 8 "RESET CIRCUIT" H 8950 2300 50  0001 C CNN "Manufacturer_Desc"
	1    8950 2300
	1    0    0    -1  
$EndComp
$Comp
L cpu-board:STM809 IC25
U 1 1 6D5019AB
P 8950 4575
AR Path="/6D5019AB" Ref="IC25"  Part="1" 
AR Path="/5E92540F/6D5019AB" Ref="IC25"  Part="1" 
F 0 "IC25" H 8950 5000 59  0000 L BNN
F 1 "STM809LWX" H 8950 4913 59  0000 L BNN
F 2 "AllModules:SOT23-1G_1" H 8950 4575 50  0001 C CNN
F 3 "" H 8950 4575 50  0001 C CNN
F 4 "RESET CIRCUIT, SUPERVISOR VOLTAGE 5V,SOT23" H 8950 4575 50  0001 C CNN "Description"
F 5 "10022974" H 8950 4575 50  0001 C CNN "Item Number"
F 6 "STMICROELECTRONICS" H 8950 4575 50  0001 C CNN "Manufacturer"
F 7 "STM809LWX6F" H 8950 4575 50  0001 C CNN "Manufacturer_No"
F 8 "RESET CIRCUIT" H 8950 4575 50  0001 C CNN "Manufacturer_Desc"
	1    8950 4575
	1    0    0    -1  
$EndComp
$Comp
L cpu-board:STM809 IC36
U 1 1 28D53763
P 8950 6925
AR Path="/28D53763" Ref="IC36"  Part="1" 
AR Path="/5E92540F/28D53763" Ref="IC36"  Part="1" 
F 0 "IC36" H 8962 7338 59  0000 L BNN
F 1 "STM809TWX" H 8962 7263 59  0000 L BNN
F 2 "AllModules:SOT23-1G_1" H 8950 6925 50  0001 C CNN
F 3 "" H 8950 6925 50  0001 C CNN
F 4 "IC, SUPERVISOR VOLTAGE 3.3 V,SOT23" H 8950 6925 50  0001 C CNN "Description"
F 5 "10023041" H 8950 6925 50  0001 C CNN "Item Number"
F 6 "STMICROELECTRONICS" H 8950 6925 50  0001 C CNN "Manufacturer"
F 7 "STM809TWX6F" H 8950 6925 50  0001 C CNN "Manufacturer_No"
F 8 "RESET CIRCUIT" H 8950 6925 50  0001 C CNN "Manufacturer_Desc"
	1    8950 6925
	1    0    0    -1  
$EndComp
$Comp
L cpu-board:TANTALD C85
U 1 1 2D7C5423
P 3925 4875
AR Path="/2D7C5423" Ref="C85"  Part="1" 
AR Path="/5E92540F/2D7C5423" Ref="C85"  Part="1" 
F 0 "C85" H 4100 4950 56  0000 L CNN
F 1 "10uF" H 4100 4875 42  0000 L CNN
F 2 "AllModules:C6032_1" H 3925 4875 50  0001 C CNN
F 3 "" H 3925 4875 50  0001 C CNN
F 4 "CAPACITOR TANTALUM, 10UF, 25V, +/-10%" H 3925 4875 50  0001 C CNN "Description"
F 5 "10022608" H 3925 4875 50  0001 C CNN "Item Number"
F 6 "KEMET" H 3925 4875 50  0001 C CNN "Manufacturer"
F 7 "T491C106K025AT" H 3925 4875 50  0001 C CNN "Manufacturer_No"
F 8 "Cap, Tantalum, Polarized, 25V, 10% +/-Tol, 10uF, Surface Mount, 2312 (Case C), EIA Metric 6032" H 3925 4875 50  0001 C CNN "Manufacturer_Desc"
F 9 "KEMET" H 3925 4875 50  0001 C CNN "Manufacturer2"
F 10 "T495C106K025ATE275" H 3925 4875 50  0001 C CNN "Manufacturer_No2"
F 11 "Cap, Tantalum, Polarized, 25V, 10% +/-Tol, 10uF, Surface Mount, 2312 (Case C), EIA Metric 6032" H 3925 4875 50  0001 C CNN "Manufacturer_Desc2"
	1    3925 4875
	1    0    0    -1  
$EndComp
$Comp
L cpu-board:TANTALD C81
U 1 1 5EA262E9
P 3925 2475
AR Path="/5EA262E9" Ref="C81"  Part="1" 
AR Path="/5E92540F/5EA262E9" Ref="C81"  Part="1" 
F 0 "C81" H 4100 2500 56  0000 L CNN
F 1 "10uF" H 4100 2425 42  0000 L CNN
F 2 "AllModules:C6032_1" H 3925 2475 50  0001 C CNN
F 3 "" H 3925 2475 50  0001 C CNN
F 4 "CAPACITOR TANTALUM, 10UF, 25V, +/-10%" H 3925 2475 50  0001 C CNN "Description"
F 5 "10022608" H 3925 2475 50  0001 C CNN "Item Number"
F 6 "KEMET" H 3925 2475 50  0001 C CNN "Manufacturer"
F 7 "T491C106K025AT" H 3925 2475 50  0001 C CNN "Manufacturer_No"
F 8 "Cap, Tantalum, Polarized, 25V, 10% +/-Tol, 10uF, Surface Mount, 2312 (Case C), EIA Metric 6032" H 3925 2475 50  0001 C CNN "Manufacturer_Desc"
F 9 "KEMET" H 3925 2475 50  0001 C CNN "Manufacturer2"
F 10 "T495C106K025ATE275" H 3925 2475 50  0001 C CNN "Manufacturer_No2"
F 11 "Cap, Tantalum, Polarized, 25V, 10% +/-Tol, 10uF, Surface Mount, 2312 (Case C), EIA Metric 6032" H 3925 2475 50  0001 C CNN "Manufacturer_Desc2"
	1    3925 2475
	1    0    0    -1  
$EndComp
$Comp
L cpu-board:R0805 R35
U 1 1 AB7C9AB4
P 2125 2250
AR Path="/AB7C9AB4" Ref="R35"  Part="1" 
AR Path="/5E92540F/AB7C9AB4" Ref="R35"  Part="1" 
F 0 "R35" H 2050 2387 64  0000 L BNN
F 1 "180" H 2062 2312 42  0000 L BNN
F 2 "AllModules:R0805_1" H 2125 2250 50  0001 C CNN
F 3 "" H 2125 2250 50  0001 C CNN
F 4 "RESISTOR, 180 OHM, 0805, +/-5%" H 2125 2250 50  0001 C CNN "Description"
F 5 "10023240" H 2125 2250 50  0001 C CNN "Item Number"
F 6 "YAGEO_RMS1" H 2125 2250 50  0001 C CNN "Manufacturer"
F 7 "232273061181" H 2125 2250 50  0001 C CNN "Manufacturer_No"
F 8 "RESISTOR, METAL GLAZE/THICK FILM, 0.125 W, 5 %, 100 PPM, 180 OHM, SURFACE MOUNT, 0805" H 2125 2250 50  0001 C CNN "Manufacturer_Desc"
F 9 "KOA SPEER" H 2125 2250 50  0001 C CNN "Manufacturer2"
F 10 "RK73B2ATTD181J" H 2125 2250 50  0001 C CNN "Manufacturer_No2"
F 11 "THICK FILM CHIP RESISTOR" H 2125 2250 50  0001 C CNN "Manufacturer_Desc2"
F 12 "YAGEO_RMS1" H 2125 2250 50  0001 C CNN "Manufacturer3"
F 13 "232273061181L" H 2125 2250 50  0001 C CNN "Manufacturer_No3"
F 14 "RESISTOR, METAL GLAZE/THICK FILM, 0.125 W, 5 %, 100 PPM, 180 OHM, SURFACE MOUNT, 0805" H 2125 2250 50  0001 C CNN "Manufacturer_Desc3"
F 15 "YAGEO_RMS1" H 2125 2250 50  0001 C CNN "Manufacturer4"
F 16 "RC0805JR-07180RL" H 2125 2250 50  0001 C CNN "Manufacturer_No4"
F 17 "RESISTOR, METAL GLAZE/THICK FILM, 0.125 W, 5 %, 100 PPM, 180 OHM, SURFACE MOUNT, 0805" H 2125 2250 50  0001 C CNN "Manufacturer_Desc4"
	1    2125 2250
	1    0    0    -1  
$EndComp
$Comp
L cpu-board:LT1236 IC21
U 1 1 88F14A94
P 2925 2100
AR Path="/88F14A94" Ref="IC21"  Part="1" 
AR Path="/5E92540F/88F14A94" Ref="IC21"  Part="1" 
F 0 "IC21" H 2625 2325 64  0000 L BNN
F 1 "LT1236ACS8-5" H 2638 2237 59  0000 L BNN
F 2 "AllModules:MX.A8_COMPOSANT_1" H 2925 2100 50  0001 C CNN
F 3 "" H 2925 2100 50  0001 C CNN
F 4 "IC,REFERENCE VOLTAGE 5V FIXED - 10 MA,SO8" H 2925 2100 50  0001 C CNN "Description"
F 5 "10023039" H 2925 2100 50  0001 C CNN "Item Number"
F 6 "LINEAR TECHNOLOGY_RMS1" H 2925 2100 50  0001 C CNN "Manufacturer"
F 7 "LT1236CCS8-5#TRPBF" H 2925 2100 50  0001 C CNN "Manufacturer_No"
F 8 "PRECISION REFERENCE" H 2925 2100 50  0001 C CNN "Manufacturer_Desc"
	1    2925 2100
	1    0    0    -1  
$EndComp
Wire Wire Line
	1600 2800 2875 2800
Wire Wire Line
	2875 2700 2875 2800
Connection ~ 2875 2800
Wire Wire Line
	2875 2800 3475 2800
Wire Wire Line
	3475 2800 3475 2600
Wire Wire Line
	3475 2400 3475 2250
Wire Wire Line
	3475 2250 3375 2250
Wire Wire Line
	3475 2250 3925 2250
Connection ~ 3475 2250
Wire Wire Line
	3925 2100 3925 2250
Connection ~ 3925 2250
Wire Wire Line
	3925 2375 3925 2250
Wire Wire Line
	3475 2800 3925 2800
Connection ~ 3475 2800
Wire Wire Line
	3925 2575 3925 2800
Wire Wire Line
	2325 2250 2400 2250
Wire Wire Line
	3475 1350 2750 1350
Wire Wire Line
	3475 1350 3475 2250
Wire Wire Line
	2600 1300 2750 1300
Wire Wire Line
	2750 1300 2750 1350
Connection ~ 2750 1350
Wire Wire Line
	2750 1350 2600 1350
Wire Wire Line
	2400 1650 2400 2250
Connection ~ 2400 2250
Wire Wire Line
	2400 2250 2425 2250
Connection ~ 1875 4650
Connection ~ 1600 4650
Wire Wire Line
	1600 4650 1600 4250
Wire Wire Line
	1600 4650 1875 4650
Wire Wire Line
	1600 4800 1600 4650
Wire Wire Line
	1600 5200 1600 5000
Wire Wire Line
	1875 3750 1875 4650
Wire Wire Line
	1875 4650 1925 4650
$Comp
L cpu-board:+24V #U$?
U 1 1 5EAD48BA
P 1600 4150
AR Path="/5EAD48BA" Ref="#U$?"  Part="1" 
AR Path="/5E92540F/5EAD48BA" Ref="#U$0107"  Part="1" 
F 0 "#U$0107" H 1600 4150 50  0001 C CNN
F 1 "+24V" H 1500 4025 59  0000 L BNN
F 2 "" H 1600 4150 50  0001 C CNN
F 3 "" H 1600 4150 50  0001 C CNN
	1    1600 4150
	-1   0    0    1   
$EndComp
$Comp
L cpu-board:0VANA #U$?
U 1 1 5EAD48D2
P 2875 5200
AR Path="/5EAD48D2" Ref="#U$?"  Part="1" 
AR Path="/5E92540F/5EAD48D2" Ref="#U$0108"  Part="1" 
F 0 "#U$0108" H 2875 5200 50  0001 C CNN
F 1 "0VANA" H 2738 5000 59  0000 L BNN
F 2 "" H 2875 5200 50  0001 C CNN
F 3 "" H 2875 5200 50  0001 C CNN
	1    2875 5200
	1    0    0    -1  
$EndComp
Wire Wire Line
	1875 3750 2200 3750
Wire Wire Line
	1600 5200 2875 5200
Wire Wire Line
	2875 5100 2875 5200
Connection ~ 2875 5200
Wire Wire Line
	2875 5200 3475 5200
Wire Wire Line
	3475 5200 3475 5000
Wire Wire Line
	3475 4800 3475 4650
Wire Wire Line
	3475 4650 3375 4650
Wire Wire Line
	3475 4650 3925 4650
Connection ~ 3475 4650
Wire Wire Line
	3925 4500 3925 4650
Connection ~ 3925 4650
Wire Wire Line
	3925 4775 3925 4650
Wire Wire Line
	3475 5200 3925 5200
Connection ~ 3475 5200
Wire Wire Line
	3925 4975 3925 5200
Wire Wire Line
	2325 4650 2400 4650
Wire Wire Line
	3475 3750 2750 3750
Wire Wire Line
	3475 3750 3475 4650
Wire Wire Line
	2600 3700 2750 3700
Wire Wire Line
	2750 3700 2750 3750
Connection ~ 2750 3750
Wire Wire Line
	2750 3750 2600 3750
Wire Wire Line
	2400 4050 2400 4650
Connection ~ 2400 4650
Wire Wire Line
	2400 4650 2425 4650
Wire Wire Line
	2125 6275 2125 6400
Wire Wire Line
	2125 6400 2450 6400
Wire Wire Line
	2450 6650 2450 6400
Connection ~ 2450 6400
Wire Wire Line
	2450 6400 2550 6400
Wire Wire Line
	2450 6850 2450 7125
Wire Wire Line
	2450 7125 2950 7125
Wire Wire Line
	2950 7125 2950 6700
Connection ~ 2950 7125
Wire Wire Line
	2950 7125 3475 7125
Wire Wire Line
	3475 7125 3475 6850
Wire Wire Line
	3475 6650 3475 6400
Wire Wire Line
	3475 6400 3350 6400
Wire Wire Line
	3475 6400 3875 6400
Wire Wire Line
	3875 6400 3875 6650
Connection ~ 3475 6400
Wire Wire Line
	3875 6850 3875 7125
Wire Wire Line
	3875 7125 3475 7125
Connection ~ 3475 7125
Wire Wire Line
	3875 6400 3975 6400
Connection ~ 3875 6400
Wire Wire Line
	3975 6250 3975 6400
Wire Wire Line
	1700 9875 1700 10325
Wire Wire Line
	1700 10325 3700 10325
Wire Wire Line
	3700 10325 3700 10400
$Comp
L cpu-board:TANTALB C117
U 1 1 E481EE55
P 2550 9450
AR Path="/E481EE55" Ref="C117"  Part="1" 
AR Path="/5E92540F/E481EE55" Ref="C117"  Part="1" 
F 0 "C117" H 2675 9443 56  0000 L BNN
F 1 "10uF" H 2675 9368 42  0000 L BNN
F 2 "AllModules:C7343_1" H 2550 9450 50  0001 C CNN
F 3 "" H 2550 9450 50  0001 C CNN
F 4 "CAPACITOR TANTALUM,10UF, 50V,+/-10%" H 2550 9450 50  0001 C CNN "Description"
F 5 "10022978" H 2550 9450 50  0001 C CNN "Item Number"
F 6 "AVX CORPORATION" H 2550 9450 50  0001 C CNN "Manufacturer"
F 7 "TAJD106K050RNJ" H 2550 9450 50  0001 C CNN "Manufacturer_No"
F 8 "CAPACITOR TANTALUM,10UF, 50V,+/-10%" H 2550 9450 50  0001 C CNN "Manufacturer_Desc"
	1    2550 9450
	1    0    0    -1  
$EndComp
Wire Wire Line
	2900 9575 2550 9575
Wire Wire Line
	2550 9550 2550 9575
Connection ~ 2550 9575
Wire Wire Line
	2550 9575 2550 9625
NoConn ~ 2900 9875
Wire Wire Line
	2900 9275 2550 9275
Wire Wire Line
	2550 9275 2550 9350
Wire Wire Line
	2550 9275 2025 9275
Wire Wire Line
	2025 9275 2025 9350
Connection ~ 2550 9275
Wire Wire Line
	2025 9550 2025 9575
Wire Wire Line
	2025 9575 2550 9575
Wire Wire Line
	1700 9675 1700 9275
Wire Wire Line
	2025 9275 1700 9275
Connection ~ 2025 9275
Connection ~ 1700 9275
Wire Wire Line
	1700 9275 1700 9175
Wire Wire Line
	1700 8800 1700 8875
Wire Wire Line
	2900 8975 2850 8975
Wire Wire Line
	2450 8125 2300 8125
Wire Wire Line
	2300 8125 2300 8250
Wire Wire Line
	2750 8125 2850 8125
Wire Wire Line
	2850 8125 3350 8125
Connection ~ 2850 8125
$Comp
L cpu-board:C0805 C97
U 1 1 F034F2C9
P 3675 8425
AR Path="/F034F2C9" Ref="C97"  Part="1" 
AR Path="/5E92540F/F034F2C9" Ref="C97"  Part="1" 
F 0 "C97" V 3900 8344 64  0000 L BNN
F 1 "10nF" V 3806 8363 42  0000 L BNN
F 2 "AllModules:C0603_1" H 3675 8425 50  0001 C CNN
F 3 "" H 3675 8425 50  0001 C CNN
F 4 "CAPACITOR CERAMIC,10NF,+/-10%,50V,0603" H 3675 8425 50  0001 C CNN "Description"
F 5 "10022508" H 3675 8425 50  0001 C CNN "Item Number"
F 6 "YAGEO_RMS1" H 3675 8425 50  0001 C CNN "Manufacturer"
F 7 "223858615636" H 3675 8425 50  0001 C CNN "Manufacturer_No"
F 8 "CAPACITOR, CERAMIC, MULTILAYER, 50 V, X7R, 0.01 UF, SURFACE MOUNT, 0603" H 3675 8425 50  0001 C CNN "Manufacturer_Desc"
F 9 "YAGEO_RMS1" H 3675 8425 50  0001 C CNN "Manufacturer2"
F 10 "223858615536" H 3675 8425 50  0001 C CNN "Manufacturer_No2"
F 11 "CAPACITOR, CERAMIC, MULTILAYER, 50 V, X7R, 0.01 UF, SURFACE MOUNT, 0603" H 3675 8425 50  0001 C CNN "Manufacturer_Desc2"
F 12 "KEMET_RMS1" H 3675 8425 50  0001 C CNN "Manufacturer3"
F 13 "C0603C103K5RACTU" H 3675 8425 50  0001 C CNN "Manufacturer_No3"
F 14 "CERAMIC CHIP CAPACITOR" H 3675 8425 50  0001 C CNN "Manufacturer_Desc3"
F 15 "YAGEO_RMS1" H 3675 8425 50  0001 C CNN "Manufacturer4"
F 16 "CC0603KRX7R9BB103" H 3675 8425 50  0001 C CNN "Manufacturer_No4"
F 17 "CAPACITOR, CERAMIC, MULTILAYER, 50 V, X7R, 0.01 UF, SURFACE MOUNT, 0603" H 3675 8425 50  0001 C CNN "Manufacturer_Desc4"
	1    3675 8425
	0    1    -1   0   
$EndComp
Wire Wire Line
	2850 8125 2850 8425
Wire Wire Line
	3575 8425 2850 8425
Connection ~ 2850 8425
Wire Wire Line
	2850 8425 2850 8975
Wire Wire Line
	4500 8975 4525 8975
Wire Wire Line
	4525 8975 4525 8425
Wire Wire Line
	4525 8425 3775 8425
Wire Wire Line
	3950 8125 4750 8125
Wire Wire Line
	4750 8125 4750 8975
Wire Wire Line
	4750 9375 4750 9875
Wire Wire Line
	4750 9875 4500 9875
Wire Wire Line
	4750 9975 4750 9875
Connection ~ 4750 9875
Wire Wire Line
	4750 10375 4750 10425
NoConn ~ 4500 9575
NoConn ~ 4500 9275
Wire Wire Line
	6050 8500 6050 8625
Wire Wire Line
	6050 8625 5500 8625
Wire Wire Line
	5500 8625 5500 8775
Wire Wire Line
	5500 8625 5500 8500
Connection ~ 5500 8625
Wire Wire Line
	5500 8625 4950 8625
Wire Wire Line
	4950 8625 4950 8500
Wire Wire Line
	4750 8125 4950 8125
Connection ~ 4750 8125
Wire Wire Line
	6350 8125 6350 8050
Wire Wire Line
	4950 8300 4950 8125
Connection ~ 4950 8125
Wire Wire Line
	4950 8125 5500 8125
Wire Wire Line
	5500 8125 5500 8300
Connection ~ 5500 8125
Wire Wire Line
	5500 8125 6050 8125
Wire Wire Line
	6050 8300 6050 8125
Connection ~ 6050 8125
Wire Wire Line
	6050 8125 6350 8125
Wire Wire Line
	9450 6925 9825 6925
Wire Wire Line
	8750 7425 8750 7625
Wire Wire Line
	7850 6250 8750 6250
Wire Wire Line
	8750 6250 8750 6425
Wire Wire Line
	9825 4575 9450 4575
Wire Wire Line
	8750 5075 8750 5150
Wire Wire Line
	8450 4800 8450 5150
Wire Wire Line
	8450 5150 8750 5150
Connection ~ 8750 5150
Wire Wire Line
	8750 5150 8750 5300
Wire Wire Line
	8450 4400 8450 3900
Wire Wire Line
	8450 3900 8350 3900
Wire Wire Line
	8750 4075 8750 3900
Wire Wire Line
	8750 3900 8450 3900
Connection ~ 8450 3900
Wire Wire Line
	7950 3900 7850 3900
Wire Wire Line
	7850 1750 8750 1750
Wire Wire Line
	8750 1750 8750 1800
Wire Wire Line
	9450 2300 9825 2300
Wire Wire Line
	8750 3025 8750 2800
Wire Wire Line
	1875 1350 2200 1350
Connection ~ 3700 10325
$Comp
L cpu-board:TPS5430DDA IC29
U 1 1 408852E0
P 3600 9525
AR Path="/408852E0" Ref="IC29"  Part="1" 
AR Path="/5E92540F/408852E0" Ref="IC29"  Part="1" 
F 0 "IC29" H 4100 10575 85  0000 R TNN
F 1 "TPS5430" H 4100 10450 50  0000 R TNN
F 2 "AllModules:SO08-PPAD_COMPOSANT_1" H 3600 9525 50  0001 C CNN
F 3 "" H 3600 9525 50  0001 C CNN
F 4 "REGULATOR, 5.5V TO 36V,3A" H 3600 9525 50  0001 C CNN "Description"
F 5 "10022895" H 3600 9525 50  0001 C CNN "Item Number"
F 6 "TEXAS INSTRUMENTS_RMS1" H 3600 9525 50  0001 C CNN "Manufacturer"
F 7 "TPS 5430 DDA" H 3600 9525 50  0001 C CNN "Manufacturer_No"
F 8 "3A, WIDE INPUT RANGE, CONVERTER" H 3600 9525 50  0001 C CNN "Manufacturer_Desc"
F 9 "TEXAS INSTRUMENTS_RMS1" H 3600 9525 50  0001 C CNN "Manufacturer2"
F 10 "TPS5430DDAR" H 3600 9525 50  0001 C CNN "Manufacturer_No2"
F 11 "" H 3600 9525 50  0001 C CNN "Manufacturer_Desc2"
	1    3600 9525
	-1   0    0    -1  
$EndComp
$Comp
L cpu-board:+24VUTIL #U$166
U 1 1 4F99660B
P 11675 1375
AR Path="/4F99660B" Ref="#U$166"  Part="1" 
AR Path="/5E92540F/4F99660B" Ref="#U$0166"  Part="1" 
F 0 "#U$0166" H 11675 1375 50  0001 C CNN
F 1 "+24VUTIL" H 11462 1237 59  0000 L BNN
F 2 "" H 11675 1375 50  0001 C CNN
F 3 "" H 11675 1375 50  0001 C CNN
	1    11675 1375
	-1   0    0    1   
$EndComp
Wire Wire Line
	1600 2600 1600 2800
$Comp
L cpu-board:C0805 C80
U 1 1 5EA262E8
P 3475 2500
AR Path="/5EA262E8" Ref="C80"  Part="1" 
AR Path="/5E92540F/5EA262E8" Ref="C80"  Part="1" 
F 0 "C80" H 3588 2550 64  0000 L CNN
F 1 "100nF" H 3588 2450 42  0000 L CNN
F 2 "AllModules:C0402_1" H 3475 2500 50  0001 C CNN
F 3 "" H 3475 2500 50  0001 C CNN
F 4 "CAPACITOR,100NF,16V,+/-10%,X7R,0402" H 3475 2500 50  0001 C CNN "Description"
F 5 "10022607" H 3475 2500 50  0001 C CNN "Item Number"
F 6 "MURATA" H 3475 2500 50  0001 C CNN "Manufacturer"
F 7 "GRM155R71C104JA88J" H 3475 2500 50  0001 C CNN "Manufacturer_No"
F 8 "CAPACITOR, CERAMIC, MULTILAYER, 16V, X7R, 0.1UF, 0402" H 3475 2500 50  0001 C CNN "Manufacturer_Desc"
F 9 "YAGEO_RMS1" H 3475 2500 50  0001 C CNN "Manufacturer2"
F 10 "CC0402KRX7R7BB104" H 3475 2500 50  0001 C CNN "Manufacturer_No2"
F 11 "CAP CER 0.1uF 16V X7R 10% 0402" H 3475 2500 50  0001 C CNN "Manufacturer_Desc2"
F 12 "YAGEO_RMS1" H 3475 2500 50  0001 C CNN "Manufacturer3"
F 13 "223878715649" H 3475 2500 50  0001 C CNN "Manufacturer_No3"
F 14 "CAPACITOR, CERAMIC, MULTILAYER, 16 V, X7R, 0.1 UF, SURFACE MOUNT, 0402" H 3475 2500 50  0001 C CNN "Manufacturer_Desc3"
F 15 "MURATA MANUFACTURING CO., LTD." H 3475 2500 50  0001 C CNN "Manufacturer4"
F 16 "GRM155R71C104KA88D" H 3475 2500 50  0001 C CNN "Manufacturer_No4"
F 17 "MONOLITHIC CERAMIC CAPACITOR" H 3475 2500 50  0001 C CNN "Manufacturer_Desc4"
	1    3475 2500
	1    0    0    -1  
$EndComp
$Comp
L cpu-board:C0805 C?
U 1 1 5EA9F004
P 3475 4900
AR Path="/5EA9F004" Ref="C?"  Part="1" 
AR Path="/5E92540F/5EA9F004" Ref="C83"  Part="1" 
F 0 "C83" H 3350 4950 64  0000 R CNN
F 1 "100nF" H 3350 4850 42  0000 R CNN
F 2 "AllModules:C0402_1" H 3475 4900 50  0001 C CNN
F 3 "" H 3475 4900 50  0001 C CNN
	1    3475 4900
	-1   0    0    -1  
$EndComp
Wire Wire Line
	11675 1475 11675 1550
Wire Wire Line
	11675 1550 12150 1550
Wire Wire Line
	11675 1550 11675 1975
Wire Wire Line
	11675 1975 11750 1975
Connection ~ 11675 1550
Wire Wire Line
	11675 1975 11675 2250
Connection ~ 11675 1975
Wire Wire Line
	11675 2450 11675 3050
Wire Wire Line
	11675 3050 12400 3050
$Comp
L cpu-board:SLOBLO FU2
U 1 1 2106B4DB
P 11950 1975
AR Path="/2106B4DB" Ref="FU2"  Part="1" 
AR Path="/5E92540F/2106B4DB" Ref="FU2"  Part="1" 
F 0 "FU2" H 11800 2105 51  0000 L BNN
F 1 "500 mA T" H 11800 2023 51  0000 L BNN
F 2 "AllModules:FU154000_1" H 11950 1975 50  0001 C CNN
F 3 "" H 11950 1975 50  0001 C CNN
F 4 "FUSE, 500MA" H 11950 1975 50  0001 C CNN "Description"
F 5 "10022703" H 11950 1975 50  0001 C CNN "Item Number"
F 6 "LITTELFUSE_RMS1" H 11950 1975 50  0001 C CNN "Manufacturer"
F 7 "0154.500DRT" H 11950 1975 50  0001 C CNN "Manufacturer_No"
F 8 "VERY FAST ACTING FUSE" H 11950 1975 50  0001 C CNN "Manufacturer_Desc"
	1    11950 1975
	1    0    0    -1  
$EndComp
Wire Wire Line
	12200 1975 12150 1975
Wire Wire Line
	12400 2275 12400 2450
Wire Wire Line
	12400 2850 12400 3050
$Comp
L cpu-board:R1206 R41
U 1 1 5EAEEA7B
P 12400 2650
F 0 "R41" V 12350 2750 64  0000 L CNN
F 1 "4.7k" V 12450 2750 42  0000 L CNN
F 2 "AllModules:R0603_1" H 12400 2650 50  0001 C CNN
F 3 "" H 12400 2650 50  0001 C CNN
F 4 "RESISTOR, 4.7 K OHM, 0.063W +/-5%" H 12400 2650 50  0001 C CNN "Description"
F 5 "10022617" H 12400 2650 50  0001 C CNN "Item Number"
F 6 "ASJ" H 12400 2650 50  0001 C CNN "Manufacturer"
F 7 "CR16-472JL" H 12400 2650 50  0001 C CNN "Manufacturer_No"
F 8 "THICK FILM CHIP RESISTOR" H 12400 2650 50  0001 C CNN "Manufacturer_Desc"
F 9 "YAGEO_RMS1" H 12400 2650 50  0001 C CNN "Manufacturer2"
F 10 "232270260472L" H 12400 2650 50  0001 C CNN "Manufacturer_No2"
F 11 "RESISTOR, METAL GLAZE/THICK FILM, 0.1 W, 5 %, 100 PPM, 4700 OHM, SURFACE MOUNT, 0603" H 12400 2650 50  0001 C CNN "Manufacturer_Desc2"
F 12 "YAGEO_RMS1" H 12400 2650 50  0001 C CNN "Manufacturer3"
F 13 "RC0603JR-074K7L" H 12400 2650 50  0001 C CNN "Manufacturer_No3"
F 14 "RESISTOR, METAL GLAZE/THICK FILM, 0.1 W, 5 %, 100 PPM, 4700 OHM, SURFACE MOUNT, 0603" H 12400 2650 50  0001 C CNN "Manufacturer_Desc3"
F 15 "YAGEO_RMS1" H 12400 2650 50  0001 C CNN "Manufacturer4"
F 16 "232270260472" H 12400 2650 50  0001 C CNN "Manufacturer_No4"
F 17 "RESISTOR, METAL GLAZE/THICK FILM, 0.1 W, 5 %, 100 PPM, 4700 OHM, SURFACE MOUNT, 0603" H 12400 2650 50  0001 C CNN "Manufacturer_Desc4"
	1    12400 2650
	0    1    1    0   
$EndComp
$Comp
L cpu-board:C0805 C47
U 1 1 5EB01229
P 12975 2300
F 0 "C47" H 13100 2350 64  0000 L CNN
F 1 "220pF" H 13100 2250 42  0000 L CNN
F 2 "AllModules:C0402_1" H 12975 2300 50  0001 C CNN
F 3 "" H 12975 2300 50  0001 C CNN
F 4 "CAPACITOR CERAMIC, 220PF, 50V,+/-5%, NPO,0402" H 12975 2300 50  0001 C CNN "Description"
F 5 "10022966" H 12975 2300 50  0001 C CNN "Item Number"
F 6 "YAGEO_RMS1" H 12975 2300 50  0001 C CNN "Manufacturer"
F 7 "223886915221" H 12975 2300 50  0001 C CNN "Manufacturer_No"
F 8 "CAPACITOR, CERAMIC, MULTILAYER, 50 V, C0G, 0.00022 UF, SURFACE MOUNT, 0402" H 12975 2300 50  0001 C CNN "Manufacturer_Desc"
F 9 "MURATA MANUFACTURING CO., LTD." H 12975 2300 50  0001 C CNN "Manufacturer2"
F 10 "GRM1555C1H221JA01D" H 12975 2300 50  0001 C CNN "Manufacturer_No2"
F 11 "MONOLITHIC CERAMIC CAPACITOR" H 12975 2300 50  0001 C CNN "Manufacturer_Desc2"
F 12 "YAGEO_RMS1" H 12975 2300 50  0001 C CNN "Manufacturer3"
F 13 "CC0402JRNPO9BN221" H 12975 2300 50  0001 C CNN "Manufacturer_No3"
F 14 "CAPACITOR, CERAMIC, MULTILAYER, 50 V, C0G, 0.00022 UF, SURFACE MOUNT, 0402" H 12975 2300 50  0001 C CNN "Manufacturer_Desc3"
	1    12975 2300
	1    0    0    -1  
$EndComp
$Comp
L cpu-board:C0805 C46
U 1 1 5EB01C7B
P 13625 2300
F 0 "C46" H 13750 2375 64  0000 L CNN
F 1 "100nF" H 13750 2275 42  0000 L CNN
F 2 "AllModules:C0805_1" H 13625 2300 50  0001 C CNN
F 3 "" H 13625 2300 50  0001 C CNN
F 4 "CAPACITOR CERAMIC, 100NF, +/-10%, 50V, X7R,0805" H 13625 2300 50  0001 C CNN "Description"
F 5 "10022135" H 13625 2300 50  0001 C CNN "Item Number"
F 6 "YAGEO_RMS1" H 13625 2300 50  0001 C CNN "Manufacturer"
F 7 "223858055649" H 13625 2300 50  0001 C CNN "Manufacturer_No"
F 8 "CAPACITOR, CERAMIC, MULTILAYER, 50 V, X7R, 0.1 UF, SURFACE MOUNT, 0805" H 13625 2300 50  0001 C CNN "Manufacturer_Desc"
F 9 "MURATA MANUFACTURING CO., LTD." H 13625 2300 50  0001 C CNN "Manufacturer2"
F 10 "GRM21BR71H104KA01L" H 13625 2300 50  0001 C CNN "Manufacturer_No2"
F 11 "MONOLITHIC CERAMIC CAPACITOR" H 13625 2300 50  0001 C CNN "Manufacturer_Desc2"
F 12 "YAGEO_RMS1" H 13625 2300 50  0001 C CNN "Manufacturer3"
F 13 "223858015649" H 13625 2300 50  0001 C CNN "Manufacturer_No3"
F 14 "CAPACITOR, CERAMIC, MULTILAYER, 50 V, X7R, 0.1 UF, SURFACE MOUNT, 0805" H 13625 2300 50  0001 C CNN "Manufacturer_Desc3"
F 15 "SAMSUNG_RMS1" H 13625 2300 50  0001 C CNN "Manufacturer4"
F 16 "CL21B104KBCNNNC" H 13625 2300 50  0001 C CNN "Manufacturer_No4"
F 17 "MULTILAYER CERAMIC CAPACITOR" H 13625 2300 50  0001 C CNN "Manufacturer_Desc4"
F 18 "YAGEO_RMS1" H 13625 2300 50  0001 C CNN "Manufacturer5"
F 19 "CC0805KRX7R9BB104" H 13625 2300 50  0001 C CNN "Manufacturer_No5"
F 20 "CAP CER .1UF 50V 10% X7R 0805" H 13625 2300 50  0001 C CNN "Manufacturer_Desc5"
F 21 "AVX_RMS1" H 13625 2300 50  0001 C CNN "Manufacturer6"
F 22 "08055C104KAT2A" H 13625 2300 50  0001 C CNN "Manufacturer_No6"
F 23 "CAPACITOR CERAMIC, 100NF, +/-10%, 50V, X7R,0805, X7R DIELECTRIC" H 13625 2300 50  0001 C CNN "Manufacturer_Desc6"
	1    13625 2300
	1    0    0    -1  
$EndComp
$Comp
L cpu-board:7427504 L30
U 1 1 5EAF932D
P 13350 1975
F 0 "L30" H 13350 2200 42  0000 C CNN
F 1 "7427504" H 13350 2100 34  0000 C CNN
F 2 "AllModules:WE-7427504_ENT-12.7X3_1" H 13350 1975 50  0001 C CNN
F 3 "" H 13350 1975 50  0001 C CNN
F 4 "FERRITE, 2.5, 3A" H 13350 1975 50  0001 C CNN "Description"
F 5 "10023186" H 13350 1975 50  0001 C CNN "Item Number"
F 6 "WURTH ELEKTRONIK GMBH" H 13350 1975 50  0001 C CNN "Manufacturer"
F 7 "7427512" H 13350 1975 50  0001 C CNN "Manufacturer_No"
F 8 "5 HOLE SMD FERRITE BEAD" H 13350 1975 50  0001 C CNN "Manufacturer_Desc"
F 9 "WURTH ELEKTRONIK GMBH" H 13350 1975 50  0001 C CNN "Manufacturer2"
F 10 "7427504" H 13350 1975 50  0001 C CNN "Manufacturer_No2"
F 11 "6 HOLE FERRITE BEAD" H 13350 1975 50  0001 C CNN "Manufacturer_Desc2"
	1    13350 1975
	1    0    0    -1  
$EndComp
Wire Wire Line
	12600 1975 12700 1975
Wire Wire Line
	12550 1550 12975 1550
Wire Wire Line
	12975 1550 12975 1975
Connection ~ 12975 1975
Wire Wire Line
	12975 1975 13200 1975
Wire Wire Line
	12400 3050 12975 3050
Wire Wire Line
	12975 3050 12975 2400
Connection ~ 12400 3050
Wire Wire Line
	12975 1975 12975 2200
Wire Wire Line
	13500 1975 13625 1975
Wire Wire Line
	13625 1975 13625 2200
Wire Wire Line
	13625 2400 13625 3050
Wire Wire Line
	13625 3050 12975 3050
Connection ~ 12975 3050
Wire Wire Line
	14150 2400 14150 3050
Wire Wire Line
	14150 3050 13625 3050
Connection ~ 13625 3050
Wire Wire Line
	13625 1975 14150 1975
Wire Wire Line
	14150 1975 14150 2200
Connection ~ 13625 1975
Wire Wire Line
	14150 1975 14525 1975
Wire Wire Line
	14525 1975 14525 1775
Connection ~ 14150 1975
$Comp
L cpu-board:R0805 R?
U 1 1 5EB4CA51
P 15125 2225
AR Path="/5EB4CA51" Ref="R?"  Part="1" 
AR Path="/5E92540F/5EB4CA51" Ref="R36"  Part="1" 
F 0 "R36" V 15112 2312 64  0000 L BNN
F 1 "75k" V 15187 2312 42  0000 L BNN
F 2 "AllModules:R0603_1" H 15125 2225 50  0001 C CNN
F 3 "" H 15125 2225 50  0001 C CNN
	1    15125 2225
	0    1    1    0   
$EndComp
Wire Wire Line
	14525 1975 15125 1975
Wire Wire Line
	15125 1975 15125 2025
Connection ~ 14525 1975
Wire Wire Line
	15125 2425 15125 2500
Wire Wire Line
	15125 2500 15250 2500
Connection ~ 15125 2500
Wire Wire Line
	15125 2500 15125 2575
Wire Wire Line
	15125 2975 15125 3000
$Comp
L cpu-board:0VANA #U$?
U 1 1 5EB67D38
P 15125 3050
AR Path="/5EB67D38" Ref="#U$?"  Part="1" 
AR Path="/5E92540F/5EB67D38" Ref="#U$0112"  Part="1" 
F 0 "#U$0112" H 15125 3050 50  0001 C CNN
F 1 "0VANA" H 15000 2863 59  0000 L BNN
F 2 "" H 15125 3050 50  0001 C CNN
F 3 "" H 15125 3050 50  0001 C CNN
	1    15125 3050
	1    0    0    -1  
$EndComp
$Comp
L cpu-board:C0805 C74
U 1 1 5EB68398
P 14900 2775
F 0 "C74" H 15175 2825 64  0000 R CNN
F 1 "100nF" H 15175 2725 42  0000 R CNN
F 2 "AllModules:C0402_1" H 14900 2775 50  0001 C CNN
F 3 "" H 14900 2775 50  0001 C CNN
F 4 "CAPACITOR,100NF,16V,+/-10%,X7R,0402" H 14900 2775 50  0001 C CNN "Description"
F 5 "10022607" H 14900 2775 50  0001 C CNN "Item Number"
F 6 "MURATA" H 14900 2775 50  0001 C CNN "Manufacturer"
F 7 "GRM155R71C104JA88J" H 14900 2775 50  0001 C CNN "Manufacturer_No"
F 8 "CAPACITOR, CERAMIC, MULTILAYER, 16V, X7R, 0.1UF, 0402" H 14900 2775 50  0001 C CNN "Manufacturer_Desc"
F 9 "YAGEO_RMS1" H 14900 2775 50  0001 C CNN "Manufacturer2"
F 10 "CC0402KRX7R7BB104" H 14900 2775 50  0001 C CNN "Manufacturer_No2"
F 11 "CAP CER 0.1uF 16V X7R 10% 0402" H 14900 2775 50  0001 C CNN "Manufacturer_Desc2"
F 12 "YAGEO_RMS1" H 14900 2775 50  0001 C CNN "Manufacturer3"
F 13 "223878715649" H 14900 2775 50  0001 C CNN "Manufacturer_No3"
F 14 "CAPACITOR, CERAMIC, MULTILAYER, 16 V, X7R, 0.1 UF, SURFACE MOUNT, 0402" H 14900 2775 50  0001 C CNN "Manufacturer_Desc3"
F 15 "MURATA MANUFACTURING CO., LTD." H 14900 2775 50  0001 C CNN "Manufacturer4"
F 16 "GRM155R71C104KA88D" H 14900 2775 50  0001 C CNN "Manufacturer_No4"
F 17 "MONOLITHIC CERAMIC CAPACITOR" H 14900 2775 50  0001 C CNN "Manufacturer_Desc4"
	1    14900 2775
	-1   0    0    -1  
$EndComp
Wire Wire Line
	15125 2500 14900 2500
Wire Wire Line
	14900 2500 14900 2675
Wire Wire Line
	14900 2875 14900 3000
Wire Wire Line
	14900 3000 15125 3000
Connection ~ 15125 3000
Wire Wire Line
	15125 3000 15125 3050
$Comp
L cpu-board:GND #U$?
U 1 1 5EBA76AF
P 13625 3150
AR Path="/5EBA76AF" Ref="#U$?"  Part="1" 
AR Path="/5E92540F/5EBA76AF" Ref="#U$0113"  Part="1" 
F 0 "#U$0113" H 13625 3150 50  0001 C CNN
F 1 "GND" H 13537 3063 59  0000 L BNN
F 2 "" H 13625 3150 50  0001 C CNN
F 3 "" H 13625 3150 50  0001 C CNN
	1    13625 3150
	1    0    0    -1  
$EndComp
Wire Wire Line
	12600 1925 12700 1925
Wire Wire Line
	12700 1925 12700 1975
Connection ~ 12700 1975
Wire Wire Line
	12700 1975 12975 1975
$Comp
L cpu-board:+3,3V #U$?
U 1 1 5E9E0DC3
P 7850 6300
AR Path="/5E9E0DC3" Ref="#U$?"  Part="1" 
AR Path="/5E92540F/5E9E0DC3" Ref="#U$0125"  Part="1" 
F 0 "#U$0125" H 7850 6300 50  0001 C CNN
F 1 "+3,3V" H 7750 6512 59  0000 L BNN
F 2 "" H 7850 6300 50  0001 C CNN
F 3 "" H 7850 6300 50  0001 C CNN
	1    7850 6300
	1    0    0    -1  
$EndComp
Wire Wire Line
	7850 6200 7850 6250
$Comp
L cpu-board:+10VREF #U$?
U 1 1 5E9E8B84
P 7850 3800
AR Path="/5E9E8B84" Ref="#U$?"  Part="1" 
AR Path="/5E92540F/5E9E8B84" Ref="#U$0127"  Part="1" 
F 0 "#U$0127" H 7850 3800 50  0001 C CNN
F 1 "+10VREF" H 7675 3625 59  0000 L BNN
F 2 "" H 7850 3800 50  0001 C CNN
F 3 "" H 7850 3800 50  0001 C CNN
	1    7850 3800
	-1   0    0    1   
$EndComp
$Comp
L cpu-board:+5VREF #U$?
U 1 1 5E9E93B2
P 7850 1625
AR Path="/5E9E93B2" Ref="#U$?"  Part="1" 
AR Path="/5E92540F/5E9E93B2" Ref="#U$0128"  Part="1" 
F 0 "#U$0128" H 7850 1625 50  0001 C CNN
F 1 "+5VREF" H 7675 1537 59  0000 L BNN
F 2 "" H 7850 1625 50  0001 C CNN
F 3 "" H 7850 1625 50  0001 C CNN
	1    7850 1625
	-1   0    0    1   
$EndComp
Wire Wire Line
	7850 1725 7850 1750
Wire Wire Line
	7850 3800 7850 3900
$Comp
L cpu-board:MV100?F50V C?
U 1 1 5EA4EF1D
P 14150 2300
AR Path="/5EA4EF1D" Ref="C?"  Part="1" 
AR Path="/5E92540F/5EA4EF1D" Ref="ZC21"  Part="1" 
F 0 "ZC21" H 14300 2400 56  0000 L BNN
F 1 "100uF" H 14275 2231 42  0000 L BNN
F 2 "AllModules:03513_1" H 14150 2300 50  0001 C CNN
F 3 "" H 14150 2300 50  0001 C CNN
F 4 "CAPACITOR ELECTROLYTIC, 100UF, 35V +/-20%" H 14150 2300 50  0001 C CNN "Description"
F 5 "10022963" H 14150 2300 50  0001 C CNN "Item Number"
F 6 "MULTICOMP                       (920630)" H 14150 2300 50  0001 C CNN "Manufacturer"
F 7 "" H 14150 2300 50  0001 C CNN "Manufacturer_No"
F 8 "ELECTROLYTIC CAPACITOR" H 14150 2300 50  0001 C CNN "Manufacturer_Desc"
F 9 "" H 14150 2300 50  0001 C CNN "Manufacturer2"
F 10 "" H 14150 2300 50  0001 C CNN "Manufacturer_No2"
F 11 "ALUMINIUM ELECTROLYTIC CAPACITOR" H 14150 2300 50  0001 C CNN "Manufacturer_Desc2"
	1    14150 2300
	1    0    0    -1  
$EndComp
Connection ~ 14150 2200
Connection ~ 14150 2400
$Comp
L cpu-board:CHCMS_D8 C?
U 1 1 5EA53F33
P 4950 8400
AR Path="/5EA53F33" Ref="C?"  Part="1" 
AR Path="/5E92540F/5EA53F33" Ref="ZC106"  Part="1" 
F 0 "ZC106" H 4900 8550 56  0000 R TNN
F 1 "220uF" H 4838 8368 42  0000 R TNN
F 2 "AllModules:03512_1" H 4950 8400 50  0001 C CNN
F 3 "" H 4950 8400 50  0001 C CNN
F 4 "CAPACITOR ELECTROLYTIC, 220UF,16V+/-20%" H 4950 8400 50  0001 C CNN "Description"
F 5 "10022622" H 4950 8400 50  0001 C CNN "Item Number"
F 6 "" H 4950 8400 50  0001 C CNN "Manufacturer"
F 7 "" H 4950 8400 50  0001 C CNN "Manufacturer_No"
F 8 "" H 4950 8400 50  0001 C CNN "Manufacturer_Desc"
F 9 "" H 4950 8400 50  0001 C CNN "Manufacturer2"
F 10 "" H 4950 8400 50  0001 C CNN "Manufacturer_No2"
F 11 "" H 4950 8400 50  0001 C CNN "Manufacturer_Desc2"
F 12 "" H 4950 8400 50  0001 C CNN "Manufacturer3"
F 13 "" H 4950 8400 50  0001 C CNN "Manufacturer_No3"
F 14 "" H 4950 8400 50  0001 C CNN "Manufacturer_Desc3"
	1    4950 8400
	-1   0    0    -1  
$EndComp
Connection ~ 4950 8300
Connection ~ 4950 8500
$EndSCHEMATC
