SED_2018,Employed_FT_LF_male,Employed_PT_LF_male,Employed_away_from_work_LF_male,Unemployed_looking_FT_LF_male,Unemployed_looking_PT_LF_male,Not_in_LF_male,Employed_FT_LF_female,Employed_PT_LF_female,Employed_away_from_work_LF_female,Unemployed_looking_FT_LF_female,Unemployed_looking_PT_LF_female,Not_in_LF_female
Pumicestone,5803,1850,483,608,223,8102,3308,3782,495,390,399,9983
Morayfield,7949,2296,558,1038,336,5737,4418,4725,564,651,602,8501
Bancroft,9300,2166,578,801,314,5081,5350,5034,666,560,567,7901
Glass House,7157,2391,591,511,200,6707,3879,4907,573,314,334,7260
Kurwongbah,9932,2242,580,676,306,4387,5611,5514,658,395,511,6515
Redcliffe,7836,2248,530,707,296,6717,4792,4665,632,458,439,9319
Murrumba,10385,2186,592,716,284,4543,6190,5277,699,531,570,7489
Pine Rivers,10372,2516,643,592,282,4618,5907,5866,708,371,418,6604
Traeger,8383,1200,704,676,139,3807,5203,2886,565,390,240,4910
Ninderry,7617,2539,509,504,278,5281,4112,5643,505,318,404,7112
Buderim,7782,2497,477,493,364,5300,4546,5937,572,311,591,7916
Nicklin,6543,2335,493,583,241,5587,3625,4946,526,323,383,7483
Kawana,7676,2363,483,511,265,5615,4168,5402,522,303,428,8086
Caloundra,6615,2156,509,522,242,6311,3684,4655,553,321,377,8483
Maroochydore,7456,2574,505,571,277,5458,4755,5172,526,328,418,7417
Noosa,6452,2867,495,505,244,6682,3860,5316,499,266,368,8448
Toowoomba South,8881,2449,526,694,381,5949,5474,5216,640,439,474,9299
Toowoomba North,8674,2183,477,675,285,5636,5186,5053,586,384,400,8227
Townsville,8969,2330,582,945,365,5266,6184,4531,666,540,460,6403
Hinchinbrook,9088,1808,648,808,218,4838,5136,4507,674,426,402,5936
Hill,8231,2446,731,843,228,8068,4595,5144,685,436,339,8877
Mulgrave,8796,2288,622,891,308,5001,5761,4919,653,561,428,6673
Barron River,9051,2689,636,684,306,4784,6528,5514,689,357,419,5908
Cairns,9124,2974,711,1024,384,5977,6469,5335,704,544,526,7551
McConnel,11911,3810,587,796,591,5071,8780,4948,642,469,732,6132
Cooper,10221,2913,439,509,357,4085,6684,5980,661,285,416,5684
Ferny Grove,10077,2340,525,519,294,4405,5982,5461,729,279,361,6237
Maiwar,10010,4051,552,687,841,6874,6822,6425,796,442,1019,9315
Moggill,9110,2654,440,439,361,4740,5385,5750,572,245,452,6648
Mount Ommaney,9795,2558,464,592,318,4601,6010,5473,658,293,403,6547
Jordan,11337,2244,582,689,325,3340,6946,5177,740,480,534,5311
Stretton,9985,3717,595,886,530,6394,5949,5419,647,521,674,9498
Algester,10639,2826,567,860,400,5077,6310,5208,746,542,572,7629
Toohey,9404,3972,555,878,611,7083,5888,5516,660,540,706,9628
Miller,9262,2890,459,508,376,4335,6097,5573,659,295,447,5928
South Brisbane,9666,3539,490,668,548,4755,7054,4868,586,375,629,5659
No usual address (Qld),1110,431,208,491,121,2635,643,550,146,266,104,2513
Migratory - Offshore - Shipping (Qld),20,6,3,6,0,25,13,10,9,0,0,37
Maryborough,5807,1875,476,958,249,9318,3413,4018,507,502,366,10132
Hervey Bay,5014,2107,456,868,316,9068,3433,4062,462,521,467,11230
Gympie,6279,2132,576,807,280,8295,3267,4459,547,453,410,9889
Bundaberg,6455,2100,457,977,313,7131,3880,4366,495,510,442,9743
Thuringowa,8629,2094,571,1063,320,5000,5643,4942,656,612,510,7232
Whitsunday,10162,1935,714,770,170,3931,5546,4929,697,458,393,5410
Mackay,10023,2026,677,1112,311,5202,5518,5076,634,594,557,7888
Burdekin,11255,1770,878,697,147,4626,5351,4606,737,429,334,6566
Waterford,9001,2370,559,860,352,5919,5284,4432,644,629,521,8852
Woodridge,10148,2812,794,1454,482,6976,5643,4675,693,1013,765,10688
Logan,9034,1961,593,628,218,4715,5062,4491,575,420,417,6779
Macalister,9437,2331,553,903,290,5649,5606,4777,641,618,516,8501
Ipswich,7900,1903,485,734,278,5137,4697,4080,574,469,438,7251
Ipswich West,8516,1977,520,674,265,5353,5062,4483,584,468,405,7194
Lockyer,7956,2058,636,698,221,6511,4271,4573,612,486,400,8095
Inala,8840,2586,544,965,478,8630,5543,4618,662,687,608,9464
Southport,8146,3207,518,699,429,6363,5210,5487,576,416,627,9098
Coomera,11517,2427,674,697,305,3786,6456,5873,734,540,583,6210
Gaven,8781,2603,504,660,262,4870,5270,5423,592,410,460,6769
Scenic Rim,8631,2188,654,522,185,6199,4589,5121,655,338,312,7942
Theodore,10435,2558,534,633,309,4079,5882,5973,695,412,533,6522
Mudgeeraba,9613,2996,561,543,298,4979,5743,6397,708,325,475,7236
Broadwater,7359,2157,399,474,212,6006,4561,4537,419,284,342,8382
Bonney,7962,3041,465,778,418,6041,5357,5287,627,485,586,8330
Currumbin,7246,2672,521,508,263,5337,4309,5254,583,233,364,7080
Mermaid Beach,8970,3085,529,538,316,5044,5914,5801,643,358,480,7163
Burleigh,8214,2553,482,554,254,4972,5271,5525,619,286,387,7231
Surfers Paradise,8610,3602,539,617,348,6042,5375,5400,561,448,496,7618
Gladstone,10206,1703,674,1395,202,3881,4604,4504,558,652,523,6353
Burnett,6331,1893,534,813,237,7479,3606,3984,464,449,325,8378
Keppel,8679,2017,650,824,254,5585,5157,5035,637,435,406,7118
Mirani,9535,1573,737,754,194,5280,4437,4389,659,404,385,6370
Rockhampton,8632,2107,601,1122,307,5555,5284,4703,657,533,460,8110
Gregory,8746,1221,643,426,105,2653,4495,3373,613,273,211,4009
Nanango,7118,2054,597,710,197,8464,3883,4209,567,408,321,9902
Southern Downs,8135,2090,607,491,161,6406,4220,4672,655,296,261,8545
Callide,9687,1701,771,632,147,5144,4672,4390,629,372,276,6999
Warrego,8848,1492,585,512,138,3957,4941,3792,608,284,196,5437
Bundamba,9114,2408,669,1134,377,5366,5257,4268,685,855,613,8139
Condamine,9966,2015,678,487,165,4880,5032,5213,697,320,292,6738
Cook,7594,2069,704,962,254,6100,4993,3766,646,571,338,7136
Greenslopes,10242,2891,475,537,337,3858,7261,5398,723,300,394,5723
Clayfield,11340,3004,576,568,295,3946,8119,5399,669,348,412,5907
Nudgee,10953,2818,604,682,319,4656,7444,5145,761,421,461,6575
Stafford,10417,2779,515,616,308,4532,7255,5476,813,314,423,6691
Everton,10538,2399,498,483,282,4150,6296,5966,676,252,366,6091
Sandgate,9623,2477,535,598,295,5301,6294,5337,700,368,445,7634
Aspley,9550,2471,493,586,272,5203,5915,5332,699,283,369,7775
Bulimba,11622,2556,464,518,264,3580,8087,5526,735,331,364,5576
Springwood,10553,2487,534,581,269,4397,6351,5461,686,358,431,6332
Redlands,7811,2041,476,548,238,6182,4547,4787,546,321,334,8008
Oodgeroo,7936,2112,423,409,237,4936,4774,4717,459,237,328,7073
Chatsworth,9967,2440,458,465,247,4137,6443,5526,632,242,372,6273
Lytton,9814,2326,536,641,293,5068,6252,5266,714,390,387,7436
Capalaba,10094,2455,559,657,282,4743,6001,5564,698,361,408,6835
Mansfield,9009,2776,471,527,364,5246,5641,5266,642,376,525,7716
Mundingburra,9193,2432,606,799,436,5824,5661,4836,671,435,577,7059
