SA2_NAME16,Mothers_2015,Babies_2015,Mothers_2016,Babies_2016,Mothers_2017,Babies_2017,Mothers_2018,Babies_2018,Mothers_2019,Babies_2019,Mothers_20152019,Babies_20152019,OutsideRed_2015,OutsideRed_2016,OutsideRed_2017,OutsideRed_2018,OutsideRed_2019
Alexandra Hills,216,219,216,221,209,216,235,237,217,222,1093,1115,44,30,50,36,45
Birkdale,163,164,147,149,170,172,151,154,152,155,783,794,42,37,44,28,46
Capalaba,239,241,252,255,232,232,232,235,213,216,1168,1179,53,56,59,47,51
Thorneside,61,66,47,48,47,50,46,46,50,51,251,261,9,17,12,7,10
Wellington Point,135,140,93,95,128,130,96,98,99,99,551,562,30,21,34,22,23
Cleveland,126,127,107,108,109,112,112,115,109,112,563,574,15,15,11,21,16
Ormiston,41,41,33,33,44,45,40,41,53,54,211,214,6,5,6,9,13
Redland Bay,175,175,192,195,184,187,179,184,199,201,929,942,24,28,27,31,23
Redland Islands,80,81,77,80,43,43,0,0,0,0,200,204,11,7,5,0,0
Redland Islands,0,0,0,0,26,26,66,67,58,58,150,151,0,0,3,9,5
Sheldon - Mount Cotton,113,115,108,109,122,123,125,126,108,110,576,583,28,21,27,26,29
Thornlands,145,147,153,156,153,155,208,211,218,221,877,890,27,24,30,30,39
Victoria Point,158,164,158,161,142,146,123,127,123,124,704,722,23,23,17,20,25
