SA2 NAME 2016,Proj_2016,Proj_2021,Proj_2026,Proj_2031,Proj_2036,Proj_2041,Proj_2046
Alexandra Hills,16882,16874,16597,16295,15944,15633,20721
Birkdale,15485,15832,16371,16588,16907,17263,20721
Capalaba,18198,18725,19433,20078,20379,20721,20721
Thorneside,3875,4101,4342,4348,4348,4358,20721
Wellington Point,12031,12555,13064,13361,13477,13631,20721
Cleveland,15292,16811,19573,21870,23475,25145,20721
Ormiston,5956,6189,6506,6711,6829,6916,20721
Redland Bay,16088,17648,19785,22189,24317,27127,20721
Sheldon - Mount Cotton,8245,8333,8353,8423,8482,8498,20721
Thornlands,15299,17356,18499,18987,19403,19598,20721
Victoria Point,15424,16226,16971,17670,18331,18709,20721
Redland Islands,9212,10378,11500,12721,13739,14834,20721
Total,151987,161027,170996,179241,185631,192431,20721
