"","SSC_NAME16","Phys_hlth_wellbeing_Pct","Social_competence_Pct","Emotional_maturity_Pct","Lang_cog_skills_school_based_Pct","Comm_skills_general_knowledge_Pct","Vulnerable_1plus_domains_Pct","Vulnerable_2plus_domains_Pct","Physical_health_wellbeing","Social_competence","Emotional_maturity","Language_cognitive_skills_school.based","Communication_skills_general_knowledge","Vulnerable_1plus_domains","Vulnerable_2plus_domains","SA2_NAME16"
"1","Alexandra Hills",15.8,13.3,11.2,12.2,12.8,27,16.8,31,26,22,24,25,53,33,"Alexandra Hills"
"2","Birkdale",14.5,15.1,14,9.3,13.9,29.8,16.9,25,26,24,16,24,51,29,"Birkdale"
"3","Capalaba",16.7,17.1,15.2,10,11,35.2,20,35,36,32,21,23,74,42,"Capalaba"
"4","Cleveland",4.7,5.5,7.9,7.1,5.5,16.5,9.4,6,7,10,9,7,21,12,"Cleveland"
"5","Karragarra Island",0,0,0,0,0,0,0,0,0,0,0,0,0,0,"Redland Islands"
"6","Macleay Island",11.8,23.5,29.4,11.8,5.9,41.2,23.5,2,4,5,2,1,7,4,"Redland Islands"
"7","Mount Cotton",4.3,6,6,6,3.4,11.1,6.8,5,7,7,7,4,13,8,"Sheldon - Mount Cotton"
"8","North Stradbroke Island",4.2,4.2,0,8.3,8.3,12.5,4.2,1,1,0,2,2,3,1,"Redland Islands"
"9","Ormiston",6.5,6.5,8.7,6.5,6.5,19.6,10.9,3,3,4,3,3,9,5,"Ormiston"
"10","Redland Bay",8.8,9.2,7.9,6,5.3,18.9,10.1,20,21,18,13,12,43,23,"Redland Bay"
"11","Russell Island",27.3,4.5,4.5,9,0,31.8,4.5,6,1,1,2,0,7,1,"Redland Islands"
"12","Thorneside",13,13,8.7,9,10.9,28.3,15,6,6,4,4,5,13,7,"Thorneside"
"13","Thornlands",6,7.9,7.3,1,3.7,15.7,7.3,11,15,14,2,7,30,14,"Thornlands"
"14","Victoria Point",7,7.7,6.3,4.2,4.2,17.6,8.5,10,11,9,6,6,25,12,"Victoria Point"
"15","Wellington Point",13.3,8.6,7,4.7,8.6,23.4,8.6,17,11,9,6,11,30,11,"Wellington Point"
