SED_2018,Non-Indigenous_male,Aboriginal_male,Torres_Strait_Islander_male,Both_Aboriginal_Torres_Strait_Islander_male,Non-Indigenous_female,Aboriginal_female,Torres_Strait_Islander_female,Both_Aboriginal_Torres_Strait_Islander_female
Pumicestone,19984,659,38,31,21144,655,28,19
Morayfield,22388,1120,52,71,23793,1217,52,77
Bancroft,23708,779,44,41,25135,825,60,47
Glass House,20810,614,36,32,20424,433,18,22
Kurwongbah,23338,622,28,28,24200,692,41,37
Redcliffe,21653,584,43,29,23474,646,37,36
Murrumba,24209,655,34,47,25834,744,33,39
Pine Rivers,24273,425,34,16,24766,468,28,26
Traeger,15487,3856,92,150,14324,4048,101,144
Ninderry,21032,396,21,29,22216,386,20,10
Buderim,21177,313,25,3,24105,329,25,19
Nicklin,19212,549,36,25,20599,526,31,30
Kawana,20986,460,30,15,22596,392,22,16
Caloundra,19547,418,12,19,21136,459,15,8
Maroochydore,19542,344,23,23,21057,354,26,20
Noosa,20678,291,18,7,22058,300,18,11
Toowoomba South,23185,902,40,26,25707,1005,55,25
Toowoomba North,21506,1059,29,37,23316,1114,23,49
Townsville,20234,1906,208,344,20277,2006,260,322
Hinchinbrook,20973,1197,157,136,20548,1106,113,118
Hill,22569,1971,393,409,21966,1763,291,325
Mulgrave,20227,2631,723,638,20523,2975,775,713
Barron River,22078,821,214,153,23004,808,210,142
Cairns,22133,1235,983,598,22462,1431,1186,628
McConnel,24313,247,24,23,23325,191,14,19
Cooper,23004,211,14,20,23861,166,16,6
Ferny Grove,22960,406,50,18,23498,372,32,9
Maiwar,26658,137,14,11,28306,146,21,8
Moggill,22857,145,12,7,23837,129,18,4
Mount Ommaney,23264,227,10,16,24223,248,11,20
Jordan,24776,656,42,19,25000,691,34,22
Stretton,27459,173,8,23,28063,196,16,23
Algester,25602,512,42,39,25930,497,31,43
Toohey,26620,274,28,13,26722,297,30,22
Miller,21842,198,23,16,22908,187,21,15
South Brisbane,21862,217,19,14,21133,219,21,24
No usual address (Qld),5387,422,45,21,4499,251,29,28
Migratory - Offshore - Shipping (Qld),61,0,0,0,71,3,0,0
Maryborough,21724,1023,48,56,21896,915,50,59
Hervey Bay,20923,889,40,48,23089,928,38,35
Gympie,21978,816,51,31,22356,754,50,36
Bundaberg,20752,1022,68,71,22458,1109,50,67
Thuringowa,21069,1761,348,317,22387,1901,387,376
Whitsunday,21902,638,160,118,21120,726,159,153
Mackay,22677,869,363,266,23348,933,387,274
Burdekin,23261,1152,127,131,21465,1153,128,175
Waterford,23852,833,52,64,24854,905,65,58
Woodridge,29753,1186,110,101,30032,1265,101,124
Logan,21235,638,23,44,21796,613,40,30
Macalister,24037,773,62,33,25226,846,59,38
Ipswich,19986,1031,54,48,21013,1000,42,56
Ipswich West,21371,1122,50,36,21966,1102,39,25
Lockyer,21916,922,38,54,22051,867,31,39
Inala,26941,1146,79,68,26566,918,53,76
Southport,22959,399,27,9,24755,382,26,14
Coomera,26273,599,34,15,26986,658,38,25
Gaven,21974,439,18,13,22988,480,16,24
Scenic Rim,22322,664,34,41,22737,690,35,37
Theodore,24422,441,15,20,25497,500,14,13
Mudgeeraba,24043,349,22,10,25874,368,15,23
Broadwater,19640,216,18,8,21475,241,4,14
Bonney,21928,423,26,18,23723,458,19,7
Currumbin,19806,431,35,32,20769,450,24,25
Mermaid Beach,22088,274,15,3,23875,264,20,17
Burleigh,20842,333,20,18,22810,384,24,24
Surfers Paradise,22303,198,11,9,22286,201,13,3
Gladstone,22473,870,36,91,21349,912,39,101
Burnett,20376,619,31,40,20072,620,26,34
Keppel,21783,1079,90,84,22132,1090,70,79
Mirani,21448,990,154,128,19863,853,161,106
Rockhampton,21762,1642,122,143,22770,1869,132,137
Gregory,16653,1332,51,73,15648,1301,44,76
Nanango,22142,1707,36,73,21937,1737,30,76
Southern Downs,21361,1057,28,22,21745,1143,29,33
Callide,22013,1025,53,59,20913,1084,39,64
Warrego,18172,1864,36,49,17462,1976,33,39
Bundamba,24858,1174,88,65,25108,1230,82,72
Condamine,22621,898,22,19,22661,851,20,21
Cook,14573,3984,3425,1869,13618,4198,3394,1922
Greenslopes,22316,251,23,21,23494,242,30,19
Clayfield,23304,252,26,10,24295,277,17,8
Nudgee,24030,532,40,44,24712,512,43,50
Stafford,23480,416,44,37,25131,492,51,39
Everton,23060,321,32,25,24169,335,32,22
Sandgate,23213,514,39,41,24877,548,41,30
Aspley,22727,311,16,20,24466,335,19,29
Bulimba,23582,295,31,24,25003,316,31,15
Springwood,23656,350,42,21,24104,374,34,25
Redlands,21014,414,43,21,22030,458,34,28
Oodgeroo,19304,446,19,30,20616,466,26,27
Chatsworth,22452,260,15,16,23805,301,19,15
Lytton,23071,543,62,21,24548,597,39,40
Capalaba,23203,546,38,16,23789,611,17,43
Mansfield,22634,293,29,25,24438,294,28,29
Mundingburra,21985,1279,273,209,21990,1106,264,192
