SED_2018,No_cars,Two_cars,One_car,Three_cars,Four_cars,Total_cars
Ninderry,420,7209,4972,2298,1239,16128
Buderim,728,6848,5774,2267,1025,16649
Traeger,1315,5157,5685,1793,1063,15009
Nicklin,761,5935,5153,2241,1351,15444
Kawana,735,6830,6322,2089,918,16893
Caloundra,988,6297,6656,1935,953,16839
Maroochydore,1136,6732,8309,1742,694,18610
Noosa,804,7145,6952,2192,998,18085
Toowoomba South,1533,7216,8133,2007,841,19732
Toowoomba North,1398,6845,7189,2151,1016,18599
Townsville,2053,6593,8282,1696,714,19333
Mundingburra,943,6731,5841,2181,959,16660
Thuringowa,877,7093,5767,2309,1016,17058
Bundaberg,1685,6239,7702,1801,805,18234
Gympie,938,6911,7032,2474,1384,18733
Hervey Bay,1425,6465,9235,1819,757,19693
Maryborough,1105,6605,6785,2366,1197,18061
Migratory - Offshore - Shipping (Qld),0,0,0,0,0,0
Capalaba,703,7121,5268,2680,1554,17326
Oodgeroo,855,6097,5159,2200,1128,15443
Chatsworth,746,7148,5047,2304,1233,16478
Redlands,876,6313,5337,2420,1300,16244
Springwood,470,7467,4626,2737,1556,16849
Pine Rivers,510,7293,4318,2936,1785,16834
Murrumba,801,7707,6644,2275,1084,18518
Redcliffe,1906,6521,8226,2015,1014,19681
Kurwongbah,574,6935,4592,2757,1534,16402
Glass House,269,6132,3997,2685,1922,15008
Morayfield,1349,6046,6053,2181,1376,17009
Bancroft,713,7062,5997,2269,1217,17256
Pumicestone,905,6140,7152,2013,1136,17352
Whitsunday,699,7015,5361,2364,1083,16532
Mackay,1607,7119,7355,2324,911,19318
Burdekin,862,7481,6322,2710,1439,18811
Waterford,1218,6521,6146,2367,1149,17400
Woodridge,1573,7018,6965,2551,1277,19389
Logan,334,5407,3411,2790,2421,14366
Macalister,1096,6784,6400,2398,1373,18048
Ipswich,1328,5841,5827,1995,918,15912
Bundamba,1001,6542,6290,2169,1060,17064
Ipswich West,874,6086,5038,2443,1576,16015
Lockyer,562,6263,4453,2780,1889,15947
Inala,1353,6462,6507,2142,953,17412
Southport,1713,6508,7962,1867,843,18901
Coomera,234,8235,4039,2925,1604,17036
Gaven,691,6703,5206,2444,1375,16417
Scenic Rim,456,6697,4728,2915,2048,16852
Theodore,401,7587,4757,2739,1405,16887
Mudgeeraba,405,7573,5114,2762,1557,17413
Broadwater,692,6978,6372,2049,968,17055
Bonney,1380,6568,8348,1798,809,18919
Currumbin,879,6254,5867,2052,1185,16247
Mermaid Beach,1021,7369,6917,2036,901,18247
Burleigh,1022,6976,7042,2002,831,17871
Surfers Paradise,2023,6443,9077,1677,747,19972
Gladstone,813,7128,5507,2460,1079,16984
Burnett,513,6855,6539,2352,1215,17480
Keppel,787,7123,6050,2441,1205,17618
Mirani,462,6592,4278,2837,1695,15868
Gregory,793,5231,5104,2012,1309,14454
Rockhampton,1611,6585,7259,2138,949,18545
Condamine,314,6880,3829,3110,2173,16305
Nanango,1005,6724,6899,2609,1615,18845
Southern Downs,1028,6688,6153,2587,1550,18001
Callide,766,6638,5663,2857,1877,17791
Warrego,879,5537,5098,2331,1599,15449
Cook,2693,5172,6390,1708,892,16853
Hinchinbrook,461,7524,5039,2498,1272,16796
Hill,1176,7632,7894,2497,1219,20423
Mulgrave,939,6892,5807,2192,1046,16879
Barron River,722,7970,6840,2237,917,18689
Cairns,2583,6421,8970,1727,729,20431
McConnel,5561,4500,11264,773,303,22404
Cooper,1145,6941,6378,2008,852,17329
Ferny Grove,1001,7002,5849,2018,946,16814
Maiwar,2720,6534,9062,1739,758,20810
Moggill,360,7246,4043,2598,1384,15629
Mount Ommaney,668,7377,5499,2261,949,16749
Jordan,248,7364,3853,2809,1613,15881
Stretton,641,7575,5281,2616,1233,17348
Algester,664,7411,5260,2670,1244,17249
Toohey,1373,6815,6859,2197,1068,18309
Miller,1292,6508,6562,1797,789,16948
South Brisbane,3169,4718,8919,1114,462,18389
Mansfield,1134,6588,5683,2111,1043,16556
Greenslopes,1636,6812,7441,1735,791,18412
Clayfield,1889,6953,8829,1731,769,20173
Nudgee,1782,7066,8296,1874,802,19820
Stafford,1936,7158,8016,1841,726,19679
Everton,713,7470,5114,2468,1396,17166
Sandgate,1227,7142,6986,2157,961,18471
Aspley,994,7234,5628,2359,1162,17375
Bulimba,1080,7586,7333,1971,793,18772
Lytton,1168,7180,6529,2319,1042,18240
