SED_2018,Four_+_bedrooms_needed,Three_extra_bedrooms_ needed,Two_extra_bedrooms needed,One_bedroom_ needed,No_bedrooms_needed_or_spare,One_bedroom_spare,Two_bedrooms_spare,Three_bedrooms_spare,Four_+_bedrooms_spare,Total_House_Suit
Ninderry,0,11,51,252,1975,4820,5420,2373,337,15243
Buderim,0,3,37,203,1812,5344,5762,2536,322,16028
Traeger,39,54,134,505,2751,4107,3838,1135,270,12830
Nicklin,7,10,54,348,2574,4587,5050,1975,285,14882
Kawana,0,9,35,224,2183,5777,5739,2077,233,16278
Caloundra,0,11,41,314,2542,5214,5362,2271,254,16005
Maroochydore,0,9,44,366,3448,6391,5217,1470,200,17143
Noosa,5,11,42,240,2409,5211,6202,2441,294,16857
Toowoomba South,5,16,61,320,2755,6318,6895,2552,290,19212
Toowoomba North,3,7,40,336,2706,6121,6220,2302,333,18068
Townsville,54,34,104,464,3788,7482,4700,1394,233,18251
Mundingburra,9,14,61,349,2532,5125,5506,2024,270,15886
Thuringowa,10,25,79,355,2212,5112,6370,2062,202,16418
Bundaberg,5,9,62,374,3048,6059,6290,1697,198,17746
Gympie,9,17,97,418,2807,5281,6675,2277,272,17846
Hervey Bay,7,8,46,298,2410,5807,6888,2658,244,18377
Maryborough,3,6,58,372,2598,5325,6382,2384,317,17458
Migratory - Offshore - Shipping (Qld),0,0,0,0,0,0,0,0,0,0
Capalaba,8,14,56,317,2531,5259,5956,2341,273,16752
Oodgeroo,0,5,37,183,1808,4368,5085,2858,462,14813
Chatsworth,7,8,43,206,1828,4937,5812,2525,448,15805
Redlands,0,13,17,194,1732,4876,5592,2833,356,15626
Springwood,3,10,53,256,2150,4905,5984,2496,352,16208
Pine Rivers,6,16,66,323,2099,4816,5740,2674,454,16196
Murrumba,3,12,58,319,2529,5738,6564,2480,183,17889
Redcliffe,7,4,58,418,3610,7019,6181,1556,248,19105
Kurwongbah,3,11,57,258,2002,4917,5658,2614,317,15829
Glass House,11,20,66,349,1799,3898,5321,2589,401,14451
Morayfield,20,41,92,422,2617,5023,5610,2544,200,16560
Bancroft,7,22,63,343,2097,5630,6008,2363,199,16737
Pumicestone,3,7,47,246,2177,5173,6090,2724,252,16728
Whitsunday,4,3,38,297,2285,4828,5357,2223,228,15263
Mackay,7,6,42,389,3163,6334,6498,1938,230,18601
Burdekin,10,15,71,356,2832,5696,6135,1748,256,17119
Waterford,22,45,160,611,3027,5829,5364,1633,175,16867
Woodridge,37,89,355,1211,3843,5924,5755,1484,125,18817
Logan,3,23,70,333,1708,4128,4839,2330,381,13829
Macalister,3,19,89,489,2794,5761,6038,2058,263,17508
Ipswich,0,13,89,396,2780,5179,5312,1604,176,15552
Bundamba,18,51,170,720,2857,5342,5582,1682,120,16541
Ipswich West,4,6,59,389,2317,4826,5574,2084,250,15499
Lockyer,16,29,86,363,2016,4350,5775,2564,329,15520
Inala,19,52,209,762,3170,5452,5594,1473,165,16900
Southport,7,21,103,706,4704,6272,4764,1279,246,18102
Coomera,5,16,58,286,1742,5252,5709,3075,257,16404
Gaven,4,7,69,376,2675,5504,5265,1699,262,15867
Scenic Rim,5,10,58,310,2318,4987,5798,2400,426,16318
Theodore,5,11,46,305,2091,5468,5624,2413,266,16224
Mudgeeraba,3,11,45,319,2396,5505,5909,2198,398,16785
Broadwater,3,4,27,245,2010,5567,5941,2295,348,16442
Bonney,3,17,103,626,4700,7143,4191,1151,159,18092
Currumbin,3,12,63,322,2905,5742,4561,1567,241,15414
Mermaid Beach,3,6,75,473,3788,6296,4779,1731,229,17371
Burleigh,3,11,46,440,3449,6675,4784,1334,166,16918
Surfers Paradise,10,45,181,748,5634,6554,3673,1631,347,18819
Gladstone,5,6,32,232,1923,4975,5961,2627,284,16036
Burnett,3,10,62,277,2281,4794,5970,2232,292,15931
Keppel,3,12,64,317,2322,4953,5855,2717,310,16547
Mirani,9,13,57,335,2261,4520,5414,2180,302,15090
Gregory,8,20,49,260,1968,3769,4124,1637,368,12192
Rockhampton,3,18,86,452,3143,6323,5803,1667,259,17749
Condamine,0,10,64,285,1806,4284,6042,2897,467,15850
Nanango,24,21,95,431,2816,5604,6669,2258,308,18227
Southern Downs,6,13,72,326,2391,5417,6266,2459,374,17312
Callide,9,18,72,360,2408,5004,5981,2296,380,16530
Warrego,11,17,56,307,2087,4366,4987,1945,418,14188
Cook,87,127,352,881,3473,4730,3816,1219,196,14882
Hinchinbrook,3,7,39,299,2042,4663,5933,2396,231,15609
Hill,8,23,116,540,3425,5970,6659,1787,312,18843
Mulgrave,54,61,192,566,2554,4869,5639,2019,188,16138
Barron River,3,15,62,313,2678,5888,5753,2405,318,17444
Cairns,14,42,203,842,5168,6830,4608,1420,338,19462
McConnel,34,72,288,1290,9563,6903,2477,417,125,21161
Cooper,6,7,40,325,3267,5522,4987,1885,422,16453
Ferny Grove,0,3,54,233,2386,5439,5798,1926,302,16140
Maiwar,13,25,144,753,5323,7357,4179,1494,400,19677
Moggill,7,0,23,131,1253,3919,5376,3406,780,14890
Mount Ommaney,5,18,51,267,1887,4733,6093,2610,431,16093
Jordan,3,18,67,245,1691,4577,5624,2758,294,15274
Stretton,16,40,157,579,2361,4753,5282,2789,573,16556
Algester,11,23,118,505,2288,5111,6028,2203,289,16577
Toohey,40,56,185,719,3372,5247,5252,2104,530,17502
Miller,4,12,49,395,3536,5745,4701,1473,310,16224
South Brisbane,9,23,162,859,6874,5997,2564,609,259,17347
Mansfield,5,18,64,422,2867,4999,5123,2024,404,15935
Greenslopes,6,10,66,500,4128,6984,4526,1291,280,17791
Clayfield,0,20,52,472,4990,7824,4234,1415,353,19366
Nudgee,5,21,122,572,4071,7234,5517,1439,231,19208
Stafford,4,18,67,472,4262,7077,5386,1376,272,18933
Everton,0,3,36,199,2183,5325,5820,2530,367,16470
Sandgate,9,7,70,349,3090,5976,6331,1844,213,17888
Aspley,4,17,35,230,2008,4784,6197,2940,514,16725
Bulimba,0,15,58,373,3466,6690,5526,1451,321,17901
Lytton,4,16,55,330,2841,6026,6122,1857,225,17477
