SED_2018,Not_volunteer_male,Volunteer_male,Not_volunteer_female,Volunteer_female
Pumicestone,14226,2504,14332,3690
Morayfield,15386,2204,15741,3412
Bancroft,15548,2449,16388,3448
Glass House,12932,3475,12249,4805
Kurwongbah,14871,3042,14972,4032
Redcliffe,15262,2786,15787,4211
Murrumba,15829,2672,16771,3761
Pine Rivers,15153,3651,14675,4995
Traeger,11560,2987,10029,3844
Ninderry,13372,3189,13523,4401
Buderim,13289,3417,14774,4844
Nicklin,12298,3271,12389,4668
Kawana,13707,2975,14427,4214
Caloundra,13189,2903,13797,4049
Maroochydore,13475,3172,14173,4206
Noosa,13589,3434,13836,4664
Toowoomba South,14671,3954,16023,5216
Toowoomba North,13945,3730,14702,4860
Townsville,14561,3673,14100,4437
Hinchinbrook,14311,2797,13075,3810
Hill,15084,4084,14073,5565
Mulgrave,14853,2743,14720,3999
Barron River,14406,3517,14360,4838
Cairns,16278,3566,15926,4887
McConnel,18504,4095,16798,4759
Cooper,13875,4508,13728,5854
Ferny Grove,14074,3959,13925,5010
Maiwar,17137,5753,17032,7628
Moggill,13276,4349,13236,5754
Mount Ommaney,14376,3802,14305,4912
Jordan,15752,2540,15471,3544
Stretton,18435,3430,18275,4240
Algester,17343,2744,17190,3577
Toohey,18493,3790,17931,4821
Miller,13456,4232,13264,5596
South Brisbane,15452,4041,14016,5017
No usual address (Qld),4228,678,3488,682
Migratory - Offshore - Shipping (Qld),42,10,63,7
Maryborough,14480,3266,14230,4324
Hervey Bay,14642,2851,15944,3870
Gympie,14471,3541,13784,4918
Bundaberg,14074,3011,15039,4033
Thuringowa,14532,2911,15488,3862
Whitsunday,14329,3057,12950,4248
Mackay,15711,3324,15416,4602
Burdekin,15035,3909,12669,5026
Waterford,16308,2465,16575,3492
Woodridge,19542,2753,19460,3655
Logan,14764,2162,14466,3088
Macalister,16268,2583,16666,3695
Ipswich,13458,2752,13588,3672
Ipswich West,14065,2771,14187,3770
Lockyer,14256,3055,13617,4440
Inala,16236,2889,17137,3755
Southport,16499,2603,17238,3850
Coomera,16606,2550,16570,3601
Gaven,14983,2446,15310,3379
Scenic Rim,14282,3588,13614,5010
Theodore,16029,2330,16277,3497
Mudgeeraba,15631,3132,16212,4275
Broadwater,14253,2127,15315,2951
Bonney,15888,2513,16909,3457
Currumbin,13587,2689,14034,3556
Mermaid Beach,15470,2831,16286,3859
Burleigh,14238,2561,15436,3613
Surfers Paradise,16935,2626,16356,3275
Gladstone,14463,3370,12734,4250
Burnett,13743,3233,12733,4186
Keppel,14066,3633,13933,4589
Mirani,14091,3067,12132,4235
Rockhampton,14787,3200,15202,4226
Gregory,9874,3654,8176,4604
Nanango,14526,4000,13690,5193
Southern Downs,13134,4328,12738,5562
Callide,13227,4473,11324,5710
Warrego,11228,3967,10001,5033
Bundamba,16099,2623,15926,3589
Condamine,13998,3876,13032,5005
Cook,13869,3408,12939,4161
Greenslopes,14314,3873,14645,5009
Clayfield,15647,3810,15627,4995
Nudgee,16482,3376,16200,4426
Stafford,15391,3572,15647,5111
Everton,14420,3779,14442,5014
Sandgate,15394,3172,16104,4463
Aspley,14835,3548,15536,4604
Bulimba,15300,3526,15387,5070
Springwood,15323,3289,15146,4284
Redlands,14317,2707,14364,3943
Oodgeroo,12906,2962,13296,4093
Chatsworth,13936,3626,14624,4675
Lytton,15177,3254,15752,4465
Capalaba,15703,2881,15632,4068
Mansfield,14406,3794,15182,4834
Mundingburra,14738,3610,14182,4680
