 Alarm Date,Postcode,Type of Incident New
1/01/2017,4122,Chemical_Gas_oil_leak_comtamination
1/01/2017,4034,Chemical_Gas_oil_leak_comtamination
1/01/2017,4209,Chemical_Gas_oil_leak_comtamination
1/01/2017,4300,Chemical_Gas_oil_leak_comtamination
1/01/2017,4306,Chemical_Gas_oil_leak_comtamination
2/01/2017,4362,Hurricane
2/01/2017,4121,Chemical_Gas_oil_leak_comtamination
2/01/2017,4110,Extreme_weather_natural_disaster
2/01/2017,4101,Extreme_weather_natural_disaster
2/01/2017,4511,Chemical_Gas_oil_leak_comtamination
2/01/2017,4209,Chemical_Gas_oil_leak_comtamination
3/01/2017,4807,Chemical_Gas_oil_leak_comtamination
3/01/2017,4737,Extreme_weather_natural_disaster
3/01/2017,4020,Chemical_Gas_oil_leak_comtamination
4/01/2017,4376,Chemical_Gas_oil_leak_comtamination
5/01/2017,4610,Chemical_Gas_oil_leak_comtamination
5/01/2017,4075,Chemical_Gas_oil_leak_comtamination
5/01/2017,4074,Chemical_Gas_oil_leak_comtamination
5/01/2017,4510,Chemical_Gas_oil_leak_comtamination
5/01/2017,4034,Chemical_Gas_oil_leak_comtamination
5/01/2017,4881,Chemical_Gas_oil_leak_comtamination
6/01/2017,4401,Chemical_Gas_oil_leak_comtamination
6/01/2017,4655,Chemical_Gas_oil_leak_comtamination
6/01/2017,4573,Chemical_Gas_oil_leak_comtamination
6/01/2017,4504,Chemical_Gas_oil_leak_comtamination
6/01/2017,4873,Chemical_Gas_oil_leak_comtamination
6/01/2017,4880,Chemical_Gas_oil_leak_comtamination
7/01/2017,4215,Chemical_Gas_oil_leak_comtamination
7/01/2017,4207,Chemical_Gas_oil_leak_comtamination
8/01/2017,4680,Chemical_Gas_oil_leak_comtamination
8/01/2017,4214,Chemical_Gas_oil_leak_comtamination
9/01/2017,4014,Chemical_Gas_oil_leak_comtamination
9/01/2017,4215,Chemical_Gas_oil_leak_comtamination
10/01/2017,4300,Chemical_Gas_oil_leak_comtamination
11/01/2017,4510,Chemical_Gas_oil_leak_comtamination
11/01/2017,4212,Chemical_Gas_oil_leak_comtamination
11/01/2017,4870,Chemical_Gas_oil_leak_comtamination
11/01/2017,4860,Chemical_Gas_oil_leak_comtamination
12/01/2017,4557,Chemical_Gas_oil_leak_comtamination
12/01/2017,4218,Chemical_Gas_oil_leak_comtamination
12/01/2017,4365,Extreme_weather_natural_disaster
13/01/2017,4565,Chemical_Gas_oil_leak_comtamination
13/01/2017,4575,Chemical_Gas_oil_leak_comtamination
13/01/2017,4870,Chemical_Gas_oil_leak_comtamination
14/01/2017,4818,Chemical_Gas_oil_leak_comtamination
14/01/2017,4714,Chemical_Gas_oil_leak_comtamination
14/01/2017,4114,Chemical_Gas_oil_leak_comtamination
14/01/2017,4208,Chemical_Gas_oil_leak_comtamination
15/01/2017,4413,Hurricane
15/01/2017,4370,Extreme_weather_natural_disaster
15/01/2017,4878,Chemical_Gas_oil_leak_comtamination
16/01/2017,4169,Extreme_weather_natural_disaster
16/01/2017,4178,Chemical_Gas_oil_leak_comtamination
16/01/2017,4301,Chemical_Gas_oil_leak_comtamination
16/01/2017,4870,Chemical_Gas_oil_leak_comtamination
17/01/2017,4630,Chemical_Gas_oil_leak_comtamination
17/01/2017,4212,Chemical_Gas_oil_leak_comtamination
17/01/2017,4211,Chemical_Gas_oil_leak_comtamination
18/01/2017,4022,Chemical_Gas_oil_leak_comtamination
19/01/2017,4814,Chemical_Gas_oil_leak_comtamination
19/01/2017,4304,Chemical_Gas_oil_leak_comtamination
20/01/2017,4740,Chemical_Gas_oil_leak_comtamination
20/01/2017,4106,Chemical_Gas_oil_leak_comtamination
20/01/2017,4034,Bomb_suspicious_package
21/01/2017,4610,Hurricane
21/01/2017,4880,Chemical_Gas_oil_leak_comtamination
22/01/2017,4350,Chemical_Gas_oil_leak_comtamination
22/01/2017,4500,Chemical_Gas_oil_leak_comtamination
22/01/2017,4500,Chemical_Gas_oil_leak_comtamination
23/01/2017,4740,Chemical_Gas_oil_leak_comtamination
23/01/2017,4120,Chemical_Gas_oil_leak_comtamination
23/01/2017,4014,Chemical_Gas_oil_leak_comtamination
24/01/2017,4031,Chemical_Gas_oil_leak_comtamination
25/01/2017,4720,Chemical_Gas_oil_leak_comtamination
25/01/2017,4575,Chemical_Gas_oil_leak_comtamination
25/01/2017,4078,Chemical_Gas_oil_leak_comtamination
25/01/2017,4054,Chemical_Gas_oil_leak_comtamination
25/01/2017,4127,Chemical_Gas_oil_leak_comtamination
26/01/2017,4700,Chemical_Gas_oil_leak_comtamination
26/01/2017,4152,Chemical_Gas_oil_leak_comtamination
26/01/2017,4312,Chemical_Gas_oil_leak_comtamination
27/01/2017,4677,Chemical_Gas_oil_leak_comtamination
27/01/2017,4720,Chemical_Gas_oil_leak_comtamination
27/01/2017,4213,Chemical_Gas_oil_leak_comtamination
27/01/2017,4341,Chemical_Gas_oil_leak_comtamination
28/01/2017,4068,Chemical_Gas_oil_leak_comtamination
28/01/2017,4225,Chemical_Gas_oil_leak_comtamination
29/01/2017,4031,Chemical_Gas_oil_leak_comtamination
29/01/2017,4069,Chemical_Gas_oil_leak_comtamination
29/01/2017,4870,Chemical_Gas_oil_leak_comtamination
30/01/2017,4825,Chemical_Gas_oil_leak_comtamination
30/01/2017,4133,Chemical_Gas_oil_leak_comtamination
31/01/2017,4700,Chemical_Gas_oil_leak_comtamination
31/01/2017,4650,Chemical_Gas_oil_leak_comtamination
31/01/2017,4210,Chemical_Gas_oil_leak_comtamination
1/02/2017,4650,Chemical_Gas_oil_leak_comtamination
1/02/2017,4575,Chemical_Gas_oil_leak_comtamination
1/02/2017,4008,Chemical_Gas_oil_leak_comtamination
2/02/2017,4680,Chemical_Gas_oil_leak_comtamination
2/02/2017,4127,Chemical_Gas_oil_leak_comtamination
4/02/2017,4110,Chemical_Gas_oil_leak_comtamination
6/02/2017,4820,Chemical_Gas_oil_leak_comtamination
6/02/2017,4350,Chemical_Gas_oil_leak_comtamination
6/02/2017,4558,Chemical_Gas_oil_leak_comtamination
6/02/2017,4207,Chemical_Gas_oil_leak_comtamination
6/02/2017,4880,Chemical_Gas_oil_leak_comtamination
7/02/2017,4077,Chemical_Gas_oil_leak_comtamination
7/02/2017,4305,Chemical_Gas_oil_leak_comtamination
8/02/2017,4127,Chemical_Gas_oil_leak_comtamination
9/02/2017,4114,Chemical_Gas_oil_leak_comtamination
9/02/2017,4305,Chemical_Gas_oil_leak_comtamination
10/02/2017,4812,Chemical_Gas_oil_leak_comtamination
10/02/2017,4564,Chemical_Gas_oil_leak_comtamination
10/02/2017,4103,Chemical_Gas_oil_leak_comtamination
11/02/2017,4170,Chemical_Gas_oil_leak_comtamination
11/02/2017,4012,Chemical_Gas_oil_leak_comtamination
12/02/2017,4670,Chemical_Gas_oil_leak_comtamination
12/02/2017,4170,Chemical_Gas_oil_leak_comtamination
12/02/2017,4300,Chemical_Gas_oil_leak_comtamination
13/02/2017,4700,Chemical_Gas_oil_leak_comtamination
13/02/2017,4660,Chemical_Gas_oil_leak_comtamination
13/02/2017,4575,Chemical_Gas_oil_leak_comtamination
13/02/2017,4552,Hurricane
13/02/2017,4552,Hurricane
13/02/2017,4061,Chemical_Gas_oil_leak_comtamination
14/02/2017,4575,Chemical_Gas_oil_leak_comtamination
15/02/2017,4405,Chemical_Gas_oil_leak_comtamination
15/02/2017,4006,Chemical_Gas_oil_leak_comtamination
15/02/2017,4017,Chemical_Gas_oil_leak_comtamination
15/02/2017,4305,Chemical_Gas_oil_leak_comtamination
15/02/2017,4076,Chemical_Gas_oil_leak_comtamination
16/02/2017,4671,Chemical_Gas_oil_leak_comtamination
17/02/2017,4109,Chemical_Gas_oil_leak_comtamination
17/02/2017,4109,Chemical_Gas_oil_leak_comtamination
17/02/2017,4101,Bomb_suspicious_package
18/02/2017,4814,Chemical_Gas_oil_leak_comtamination
18/02/2017,4702,Chemical_Gas_oil_leak_comtamination
18/02/2017,4000,Chemical_Gas_oil_leak_comtamination
19/02/2017,4066,Chemical_Gas_oil_leak_comtamination
19/02/2017,4078,Chemical_Gas_oil_leak_comtamination
20/02/2017,4165,Chemical_Gas_oil_leak_comtamination
20/02/2017,4076,Chemical_Gas_oil_leak_comtamination
20/02/2017,4007,Chemical_Gas_oil_leak_comtamination
20/02/2017,4217,Chemical_Gas_oil_leak_comtamination
21/02/2017,4214,Chemical_Gas_oil_leak_comtamination
21/02/2017,4226,Chemical_Gas_oil_leak_comtamination
21/02/2017,4305,Chemical_Gas_oil_leak_comtamination
21/02/2017,4301,Chemical_Gas_oil_leak_comtamination
22/02/2017,4560,Chemical_Gas_oil_leak_comtamination
22/02/2017,4053,Chemical_Gas_oil_leak_comtamination
22/02/2017,4505,Chemical_Gas_oil_leak_comtamination
23/02/2017,4680,Chemical_Gas_oil_leak_comtamination
24/02/2017,4415,Chemical_Gas_oil_leak_comtamination
24/02/2017,4113,Chemical_Gas_oil_leak_comtamination
24/02/2017,4075,Bomb_suspicious_package
24/02/2017,4059,Chemical_Gas_oil_leak_comtamination
25/02/2017,4385,Extreme_weather_natural_disaster
25/02/2017,4054,Chemical_Gas_oil_leak_comtamination
25/02/2017,4010,Chemical_Gas_oil_leak_comtamination
26/02/2017,4572,Chemical_Gas_oil_leak_comtamination
26/02/2017,4105,Chemical_Gas_oil_leak_comtamination
26/02/2017,4505,Chemical_Gas_oil_leak_comtamination
27/02/2017,4179,Chemical_Gas_oil_leak_comtamination
28/02/2017,4811,Chemical_Gas_oil_leak_comtamination
28/02/2017,4680,Chemical_Gas_oil_leak_comtamination
28/02/2017,4650,Chemical_Gas_oil_leak_comtamination
28/02/2017,4301,Extreme_weather_natural_disaster
1/03/2017,4815,Bomb_suspicious_package
1/03/2017,4413,Chemical_Gas_oil_leak_comtamination
2/03/2017,4671,Chemical_Gas_oil_leak_comtamination
2/03/2017,4567,Extreme_weather_natural_disaster
2/03/2017,4560,Extreme_weather_natural_disaster
2/03/2017,4107,Chemical_Gas_oil_leak_comtamination
2/03/2017,4510,Chemical_Gas_oil_leak_comtamination
3/03/2017,4702,Chemical_Gas_oil_leak_comtamination
3/03/2017,4120,Chemical_Gas_oil_leak_comtamination
3/03/2017,4151,Chemical_Gas_oil_leak_comtamination
5/03/2017,4818,Chemical_Gas_oil_leak_comtamination
5/03/2017,4818,Chemical_Gas_oil_leak_comtamination
5/03/2017,4701,Chemical_Gas_oil_leak_comtamination
5/03/2017,4509,Chemical_Gas_oil_leak_comtamination
6/03/2017,4017,Chemical_Gas_oil_leak_comtamination
6/03/2017,4118,Chemical_Gas_oil_leak_comtamination
6/03/2017,4879,Chemical_Gas_oil_leak_comtamination
7/03/2017,4503,Chemical_Gas_oil_leak_comtamination
7/03/2017,4505,Chemical_Gas_oil_leak_comtamination
7/03/2017,4217,Chemical_Gas_oil_leak_comtamination
8/03/2017,4364,Chemical_Gas_oil_leak_comtamination
8/03/2017,4127,Chemical_Gas_oil_leak_comtamination
9/03/2017,4701,Chemical_Gas_oil_leak_comtamination
9/03/2017,4350,Chemical_Gas_oil_leak_comtamination
9/03/2017,4119,Bomb_suspicious_package
10/03/2017,4715,Chemical_Gas_oil_leak_comtamination
10/03/2017,4650,Chemical_Gas_oil_leak_comtamination
10/03/2017,4077,Chemical_Gas_oil_leak_comtamination
10/03/2017,4008,Chemical_Gas_oil_leak_comtamination
11/03/2017,4419,Chemical_Gas_oil_leak_comtamination
11/03/2017,4105,Chemical_Gas_oil_leak_comtamination
11/03/2017,4503,Chemical_Gas_oil_leak_comtamination
12/03/2017,4740,Chemical_Gas_oil_leak_comtamination
12/03/2017,4179,Chemical_Gas_oil_leak_comtamination
12/03/2017,4510,Chemical_Gas_oil_leak_comtamination
12/03/2017,4500,Chemical_Gas_oil_leak_comtamination
12/03/2017,4132,Chemical_Gas_oil_leak_comtamination
13/03/2017,4740,Chemical_Gas_oil_leak_comtamination
13/03/2017,4680,Chemical_Gas_oil_leak_comtamination
13/03/2017,4350,Extreme_weather_natural_disaster
13/03/2017,4405,Chemical_Gas_oil_leak_comtamination
13/03/2017,4170,Chemical_Gas_oil_leak_comtamination
13/03/2017,4077,Chemical_Gas_oil_leak_comtamination
13/03/2017,4007,Chemical_Gas_oil_leak_comtamination
13/03/2017,4017,Chemical_Gas_oil_leak_comtamination
13/03/2017,4217,Extreme_weather_natural_disaster
13/03/2017,4220,Chemical_Gas_oil_leak_comtamination
14/03/2017,4312,Hurricane
15/03/2017,4507,Chemical_Gas_oil_leak_comtamination
15/03/2017,4508,Chemical_Gas_oil_leak_comtamination
15/03/2017,4508,Chemical_Gas_oil_leak_comtamination
15/03/2017,4312,Extreme_weather_natural_disaster
16/03/2017,4009,Chemical_Gas_oil_leak_comtamination
16/03/2017,4500,Chemical_Gas_oil_leak_comtamination
17/03/2017,4416,Chemical_Gas_oil_leak_comtamination
17/03/2017,4671,Chemical_Gas_oil_leak_comtamination
17/03/2017,4065,Chemical_Gas_oil_leak_comtamination
17/03/2017,4021,Chemical_Gas_oil_leak_comtamination
17/03/2017,4508,Chemical_Gas_oil_leak_comtamination
18/03/2017,4575,Chemical_Gas_oil_leak_comtamination
18/03/2017,4551,Extreme_weather_natural_disaster
19/03/2017,4051,Chemical_Gas_oil_leak_comtamination
19/03/2017,4825,Extreme_weather_natural_disaster
20/03/2017,4157,Chemical_Gas_oil_leak_comtamination
20/03/2017,4209,Chemical_Gas_oil_leak_comtamination
21/03/2017,4825,Chemical_Gas_oil_leak_comtamination
21/03/2017,4077,Chemical_Gas_oil_leak_comtamination
21/03/2017,4032,Chemical_Gas_oil_leak_comtamination
21/03/2017,4305,Chemical_Gas_oil_leak_comtamination
22/03/2017,4700,Chemical_Gas_oil_leak_comtamination
22/03/2017,4562,Chemical_Gas_oil_leak_comtamination
24/03/2017,4350,Chemical_Gas_oil_leak_comtamination
24/03/2017,4152,Chemical_Gas_oil_leak_comtamination
25/03/2017,4455,Chemical_Gas_oil_leak_comtamination
25/03/2017,4561,Chemical_Gas_oil_leak_comtamination
25/03/2017,4220,Chemical_Gas_oil_leak_comtamination
26/03/2017,4561,Chemical_Gas_oil_leak_comtamination
26/03/2017,4075,Chemical_Gas_oil_leak_comtamination
26/03/2017,4215,Chemical_Gas_oil_leak_comtamination
26/03/2017,4217,Chemical_Gas_oil_leak_comtamination
26/03/2017,4131,Chemical_Gas_oil_leak_comtamination
26/03/2017,4341,Chemical_Gas_oil_leak_comtamination
27/03/2017,4740,Hurricane
27/03/2017,4152,Chemical_Gas_oil_leak_comtamination
27/03/2017,4053,Chemical_Gas_oil_leak_comtamination
27/03/2017,4220,Chemical_Gas_oil_leak_comtamination
27/03/2017,4816,Extreme_weather_natural_disaster
28/03/2017,4805,Extreme_weather_natural_disaster
28/03/2017,4805,Hurricane
28/03/2017,4805,Hurricane
28/03/2017,4805,Hurricane
28/03/2017,4740,Extreme_weather_natural_disaster
28/03/2017,4802,Chemical_Gas_oil_leak_comtamination
28/03/2017,4740,Hurricane
28/03/2017,4802,Extreme_weather_natural_disaster
28/03/2017,4802,Hurricane
28/03/2017,4807,Extreme_weather_natural_disaster
28/03/2017,4807,Extreme_weather_natural_disaster
28/03/2017,4217,Chemical_Gas_oil_leak_comtamination
28/03/2017,4226,Chemical_Gas_oil_leak_comtamination
28/03/2017,4208,Chemical_Gas_oil_leak_comtamination
28/03/2017,4816,Extreme_weather_natural_disaster
28/03/2017,4740,Hurricane
28/03/2017,4805,Extreme_weather_natural_disaster
28/03/2017,4809,Extreme_weather_natural_disaster
29/03/2017,4820,Hurricane
29/03/2017,4806,Hurricane
29/03/2017,4807,Hurricane
29/03/2017,4805,Hurricane
29/03/2017,4805,Extreme_weather_natural_disaster
29/03/2017,4805,Hurricane
29/03/2017,4805,Hurricane
29/03/2017,4805,Hurricane
29/03/2017,4805,Hurricane
29/03/2017,4805,Hurricane
29/03/2017,4805,Hurricane
29/03/2017,4805,Hurricane
29/03/2017,4805,Hurricane
29/03/2017,4805,Hurricane
29/03/2017,4805,Hurricane
29/03/2017,4805,Hurricane
29/03/2017,4805,Hurricane
29/03/2017,4805,Hurricane
29/03/2017,4805,Hurricane
29/03/2017,4805,Hurricane
29/03/2017,4805,Hurricane
29/03/2017,4805,Hurricane
29/03/2017,4805,Hurricane
29/03/2017,4805,Hurricane
29/03/2017,4804,Extreme_weather_natural_disaster
29/03/2017,4804,Extreme_weather_natural_disaster
29/03/2017,4804,Extreme_weather_natural_disaster
29/03/2017,4743,Extreme_weather_natural_disaster
29/03/2017,4740,Extreme_weather_natural_disaster
29/03/2017,4740,Extreme_weather_natural_disaster
29/03/2017,4740,Extreme_weather_natural_disaster
29/03/2017,4740,Extreme_weather_natural_disaster
29/03/2017,4740,Extreme_weather_natural_disaster
29/03/2017,4740,Extreme_weather_natural_disaster
29/03/2017,4740,Extreme_weather_natural_disaster
29/03/2017,4740,Hurricane
29/03/2017,4741,Hurricane
29/03/2017,4741,Hurricane
29/03/2017,4741,Hurricane
29/03/2017,4741,Hurricane
29/03/2017,4740,Hurricane
29/03/2017,4741,Hurricane
29/03/2017,4740,Hurricane
29/03/2017,4740,Hurricane
29/03/2017,4740,Hurricane
29/03/2017,4741,Hurricane
29/03/2017,4741,Hurricane
29/03/2017,4741,Hurricane
29/03/2017,4741,Hurricane
29/03/2017,4800,Hurricane
29/03/2017,4800,Hurricane
29/03/2017,4800,Hurricane
29/03/2017,4802,Hurricane
29/03/2017,4802,Hurricane
29/03/2017,4802,Hurricane
29/03/2017,4800,Hurricane
29/03/2017,4802,Hurricane
29/03/2017,4805,Hurricane
29/03/2017,4805,Extreme_weather_natural_disaster
29/03/2017,4805,Hurricane
29/03/2017,4000,Chemical_Gas_oil_leak_comtamination
29/03/2017,4118,Chemical_Gas_oil_leak_comtamination
29/03/2017,4132,Chemical_Gas_oil_leak_comtamination
29/03/2017,4305,Chemical_Gas_oil_leak_comtamination
29/03/2017,4740,Hurricane
29/03/2017,4740,Hurricane
29/03/2017,4805,Extreme_weather_natural_disaster
29/03/2017,4805,Hurricane
29/03/2017,4805,Hurricane
29/03/2017,4805,Extreme_weather_natural_disaster
29/03/2017,4805,Extreme_weather_natural_disaster
29/03/2017,4809,Extreme_weather_natural_disaster
29/03/2017,4740,Hurricane
29/03/2017,4740,Hurricane
29/03/2017,4816,Extreme_weather_natural_disaster
29/03/2017,4805,Extreme_weather_natural_disaster
29/03/2017,4805,Hurricane
29/03/2017,4737,Hurricane
29/03/2017,4798,Hurricane
30/03/2017,4215,Extreme_weather_natural_disaster
30/03/2017,4805,Hurricane
30/03/2017,4805,Extreme_weather_natural_disaster
30/03/2017,4804,Extreme_weather_natural_disaster
30/03/2017,4740,Extreme_weather_natural_disaster
30/03/2017,4740,Extreme_weather_natural_disaster
30/03/2017,4740,Chemical_Gas_oil_leak_comtamination
30/03/2017,4737,Extreme_weather_natural_disaster
30/03/2017,4741,Hurricane
30/03/2017,4680,Extreme_weather_natural_disaster
30/03/2017,4677,Extreme_weather_natural_disaster
30/03/2017,4677,Extreme_weather_natural_disaster
30/03/2017,4720,Chemical_Gas_oil_leak_comtamination
30/03/2017,4702,Extreme_weather_natural_disaster
30/03/2017,4802,Hurricane
30/03/2017,4740,Hurricane
30/03/2017,4741,Hurricane
30/03/2017,4741,Hurricane
30/03/2017,4800,Hurricane
30/03/2017,4800,Hurricane
30/03/2017,4800,Hurricane
30/03/2017,4800,Hurricane
30/03/2017,4802,Hurricane
30/03/2017,4802,Hurricane
30/03/2017,4802,Hurricane
30/03/2017,4802,Hurricane
30/03/2017,4802,Hurricane
30/03/2017,4802,Hurricane
30/03/2017,4802,Extreme_weather_natural_disaster
30/03/2017,4802,Extreme_weather_natural_disaster
30/03/2017,4802,Extreme_weather_natural_disaster
30/03/2017,4802,Extreme_weather_natural_disaster
30/03/2017,4802,Extreme_weather_natural_disaster
30/03/2017,4802,Extreme_weather_natural_disaster
30/03/2017,4802,Hurricane
30/03/2017,4802,Extreme_weather_natural_disaster
30/03/2017,4802,Extreme_weather_natural_disaster
30/03/2017,4802,Extreme_weather_natural_disaster
30/03/2017,4802,Hurricane
30/03/2017,4802,Extreme_weather_natural_disaster
30/03/2017,4802,Hurricane
30/03/2017,4802,Hurricane
30/03/2017,4802,Extreme_weather_natural_disaster
30/03/2017,4802,Hurricane
30/03/2017,4802,Hurricane
30/03/2017,4802,Hurricane
30/03/2017,4802,Extreme_weather_natural_disaster
30/03/2017,4802,Extreme_weather_natural_disaster
30/03/2017,4350,Extreme_weather_natural_disaster
30/03/2017,4671,Extreme_weather_natural_disaster
30/03/2017,4565,Hurricane
30/03/2017,4567,Hurricane
30/03/2017,4566,Extreme_weather_natural_disaster
30/03/2017,4567,Hurricane
30/03/2017,4563,Extreme_weather_natural_disaster
30/03/2017,4550,Extreme_weather_natural_disaster
30/03/2017,4550,Extreme_weather_natural_disaster
30/03/2017,4518,Extreme_weather_natural_disaster
30/03/2017,4519,Extreme_weather_natural_disaster
30/03/2017,4551,Extreme_weather_natural_disaster
30/03/2017,4556,Hurricane
30/03/2017,4573,Extreme_weather_natural_disaster
30/03/2017,4556,Extreme_weather_natural_disaster
30/03/2017,4561,Extreme_weather_natural_disaster
30/03/2017,4114,Chemical_Gas_oil_leak_comtamination
30/03/2017,4178,Extreme_weather_natural_disaster
30/03/2017,4184,Extreme_weather_natural_disaster
30/03/2017,4060,Chemical_Gas_oil_leak_comtamination
30/03/2017,4075,Extreme_weather_natural_disaster
30/03/2017,4060,Extreme_weather_natural_disaster
30/03/2017,4066,Extreme_weather_natural_disaster
30/03/2017,4000,Hurricane
30/03/2017,4503,Extreme_weather_natural_disaster
30/03/2017,4017,Extreme_weather_natural_disaster
30/03/2017,4069,Extreme_weather_natural_disaster
30/03/2017,4223,Extreme_weather_natural_disaster
30/03/2017,4225,Extreme_weather_natural_disaster
30/03/2017,4217,Extreme_weather_natural_disaster
30/03/2017,4272,Hurricane
30/03/2017,4213,Extreme_weather_natural_disaster
30/03/2017,4285,Extreme_weather_natural_disaster
30/03/2017,4309,Extreme_weather_natural_disaster
30/03/2017,4680,Extreme_weather_natural_disaster
30/03/2017,4560,Extreme_weather_natural_disaster
30/03/2017,4740,Hurricane
30/03/2017,4740,Hurricane
30/03/2017,4520,Extreme_weather_natural_disaster
30/03/2017,4306,Extreme_weather_natural_disaster
30/03/2017,4223,Extreme_weather_natural_disaster
30/03/2017,4562,Extreme_weather_natural_disaster
30/03/2017,4562,Extreme_weather_natural_disaster
30/03/2017,4677,Extreme_weather_natural_disaster
30/03/2017,4207,Extreme_weather_natural_disaster
30/03/2017,4184,Extreme_weather_natural_disaster
30/03/2017,4567,Extreme_weather_natural_disaster
30/03/2017,4754,Hurricane
30/03/2017,4670,Hurricane
30/03/2017,4670,Hurricane
30/03/2017,4571,Extreme_weather_natural_disaster
30/03/2017,4799,Hurricane
30/03/2017,4210,Extreme_weather_natural_disaster
30/03/2017,4215,Extreme_weather_natural_disaster
30/03/2017,4562,Extreme_weather_natural_disaster
30/03/2017,4562,Extreme_weather_natural_disaster
30/03/2017,4285,Extreme_weather_natural_disaster
30/03/2017,4741,Hurricane
30/03/2017,4563,Extreme_weather_natural_disaster
30/03/2017,4563,Extreme_weather_natural_disaster
30/03/2017,4699,Hurricane
30/03/2017,4342,Extreme_weather_natural_disaster
30/03/2017,4680,Extreme_weather_natural_disaster
30/03/2017,4680,Hurricane
31/03/2017,4744,Extreme_weather_natural_disaster
31/03/2017,4800,Extreme_weather_natural_disaster
31/03/2017,4740,Hurricane
31/03/2017,4741,Hurricane
31/03/2017,4802,Extreme_weather_natural_disaster
31/03/2017,4802,Extreme_weather_natural_disaster
31/03/2017,4802,Extreme_weather_natural_disaster
31/03/2017,4802,Extreme_weather_natural_disaster
31/03/2017,4802,Extreme_weather_natural_disaster
31/03/2017,4802,Extreme_weather_natural_disaster
31/03/2017,4802,Extreme_weather_natural_disaster
31/03/2017,4802,Extreme_weather_natural_disaster
31/03/2017,4802,Extreme_weather_natural_disaster
31/03/2017,4802,Extreme_weather_natural_disaster
31/03/2017,4802,Extreme_weather_natural_disaster
31/03/2017,4802,Hurricane
31/03/2017,4802,Extreme_weather_natural_disaster
31/03/2017,4802,Extreme_weather_natural_disaster
31/03/2017,4802,Extreme_weather_natural_disaster
31/03/2017,4800,Extreme_weather_natural_disaster
31/03/2017,4802,Extreme_weather_natural_disaster
31/03/2017,4802,Hurricane
31/03/2017,4802,Hurricane
31/03/2017,4802,Extreme_weather_natural_disaster
31/03/2017,4802,Extreme_weather_natural_disaster
31/03/2017,4802,Extreme_weather_natural_disaster
31/03/2017,4802,Extreme_weather_natural_disaster
31/03/2017,4802,Extreme_weather_natural_disaster
31/03/2017,4802,Extreme_weather_natural_disaster
31/03/2017,4802,Extreme_weather_natural_disaster
31/03/2017,4802,Extreme_weather_natural_disaster
31/03/2017,4802,Extreme_weather_natural_disaster
31/03/2017,4802,Extreme_weather_natural_disaster
31/03/2017,4802,Extreme_weather_natural_disaster
31/03/2017,4802,Hurricane
31/03/2017,4802,Extreme_weather_natural_disaster
31/03/2017,4802,Extreme_weather_natural_disaster
31/03/2017,4802,Hurricane
31/03/2017,4802,Extreme_weather_natural_disaster
31/03/2017,4802,Extreme_weather_natural_disaster
31/03/2017,4802,Extreme_weather_natural_disaster
31/03/2017,4802,Extreme_weather_natural_disaster
31/03/2017,4802,Extreme_weather_natural_disaster
31/03/2017,4802,Extreme_weather_natural_disaster
31/03/2017,4802,Hurricane
31/03/2017,4802,Hurricane
31/03/2017,4020,Extreme_weather_natural_disaster
31/03/2017,4020,Extreme_weather_natural_disaster
31/03/2017,4020,Extreme_weather_natural_disaster
31/03/2017,4172,Extreme_weather_natural_disaster
31/03/2017,4114,Chemical_Gas_oil_leak_comtamination
31/03/2017,4075,Chemical_Gas_oil_leak_comtamination
31/03/2017,4067,Extreme_weather_natural_disaster
31/03/2017,4512,Chemical_Gas_oil_leak_comtamination
31/03/2017,4502,Extreme_weather_natural_disaster
31/03/2017,4017,Chemical_Gas_oil_leak_comtamination
31/03/2017,4285,Chemical_Gas_oil_leak_comtamination
31/03/2017,4207,Chemical_Gas_oil_leak_comtamination
31/03/2017,4680,Hurricane
31/03/2017,4680,Hurricane
31/03/2017,4223,Extreme_weather_natural_disaster
31/03/2017,4560,Extreme_weather_natural_disaster
31/03/2017,4211,Extreme_weather_natural_disaster
31/03/2017,4215,Extreme_weather_natural_disaster
31/03/2017,4207,Extreme_weather_natural_disaster
31/03/2017,4280,Extreme_weather_natural_disaster
31/03/2017,4207,Extreme_weather_natural_disaster
31/03/2017,4133,Extreme_weather_natural_disaster
31/03/2017,4674,Hurricane
31/03/2017,4285,Extreme_weather_natural_disaster
31/03/2017,4285,Extreme_weather_natural_disaster
31/03/2017,4285,Extreme_weather_natural_disaster
31/03/2017,4280,Extreme_weather_natural_disaster
31/03/2017,4757,Hurricane
31/03/2017,4306,Extreme_weather_natural_disaster
31/03/2017,4737,Hurricane
1/04/2017,4740,Extreme_weather_natural_disaster
1/04/2017,4802,Extreme_weather_natural_disaster
1/04/2017,4800,Chemical_Gas_oil_leak_comtamination
1/04/2017,4701,Chemical_Gas_oil_leak_comtamination
1/04/2017,4800,Extreme_weather_natural_disaster
1/04/2017,4562,Hurricane
1/04/2017,4178,Chemical_Gas_oil_leak_comtamination
1/04/2017,4211,Chemical_Gas_oil_leak_comtamination
1/04/2017,4125,Extreme_weather_natural_disaster
1/04/2017,4133,Extreme_weather_natural_disaster
1/04/2017,4285,Chemical_Gas_oil_leak_comtamination
1/04/2017,4127,Chemical_Gas_oil_leak_comtamination
1/04/2017,4131,Chemical_Gas_oil_leak_comtamination
1/04/2017,4280,Chemical_Gas_oil_leak_comtamination
1/04/2017,4280,Chemical_Gas_oil_leak_comtamination
1/04/2017,4228,Extreme_weather_natural_disaster
1/04/2017,4573,Extreme_weather_natural_disaster
1/04/2017,4680,Hurricane
1/04/2017,4307,Extreme_weather_natural_disaster
1/04/2017,4754,Hurricane
1/04/2017,4756,Hurricane
1/04/2017,4704,Hurricane
1/04/2017,4207,Extreme_weather_natural_disaster
1/04/2017,4270,Extreme_weather_natural_disaster
1/04/2017,4270,Extreme_weather_natural_disaster
1/04/2017,4213,Extreme_weather_natural_disaster
1/04/2017,4805,Extreme_weather_natural_disaster
1/04/2017,4741,Hurricane
1/04/2017,4737,Hurricane
1/04/2017,4737,Hurricane
1/04/2017,4800,Extreme_weather_natural_disaster
2/04/2017,4740,Extreme_weather_natural_disaster
2/04/2017,4802,Extreme_weather_natural_disaster
2/04/2017,4744,Extreme_weather_natural_disaster
2/04/2017,4558,Chemical_Gas_oil_leak_comtamination
2/04/2017,4068,Chemical_Gas_oil_leak_comtamination
2/04/2017,4275,Extreme_weather_natural_disaster
2/04/2017,4127,Chemical_Gas_oil_leak_comtamination
2/04/2017,4700,Hurricane
2/04/2017,4704,Hurricane
2/04/2017,4740,Hurricane
2/04/2017,4802,Hurricane
3/04/2017,4798,Hurricane
3/04/2017,4701,Extreme_weather_natural_disaster
3/04/2017,4701,Extreme_weather_natural_disaster
3/04/2017,4700,Extreme_weather_natural_disaster
3/04/2017,4165,Chemical_Gas_oil_leak_comtamination
3/04/2017,4034,Chemical_Gas_oil_leak_comtamination
3/04/2017,4800,Hurricane
3/04/2017,4799,Hurricane
3/04/2017,4757,Extreme_weather_natural_disaster
3/04/2017,4741,Hurricane
4/04/2017,4700,Chemical_Gas_oil_leak_comtamination
4/04/2017,4076,Chemical_Gas_oil_leak_comtamination
4/04/2017,4225,Chemical_Gas_oil_leak_comtamination
5/04/2017,4700,Hurricane
5/04/2017,4350,Chemical_Gas_oil_leak_comtamination
5/04/2017,4422,Chemical_Gas_oil_leak_comtamination
5/04/2017,4650,Chemical_Gas_oil_leak_comtamination
5/04/2017,4114,Chemical_Gas_oil_leak_comtamination
6/04/2017,4306,Chemical_Gas_oil_leak_comtamination
7/04/2017,4814,Chemical_Gas_oil_leak_comtamination
7/04/2017,4701,Extreme_weather_natural_disaster
7/04/2017,4700,Extreme_weather_natural_disaster
7/04/2017,4415,Chemical_Gas_oil_leak_comtamination
7/04/2017,4508,Chemical_Gas_oil_leak_comtamination
7/04/2017,4701,Hurricane
8/04/2017,4700,Chemical_Gas_oil_leak_comtamination
8/04/2017,4700,Extreme_weather_natural_disaster
8/04/2017,4704,Extreme_weather_natural_disaster
8/04/2017,4700,Extreme_weather_natural_disaster
8/04/2017,4701,Extreme_weather_natural_disaster
8/04/2017,4700,Extreme_weather_natural_disaster
8/04/2017,4700,Extreme_weather_natural_disaster
8/04/2017,4703,Extreme_weather_natural_disaster
8/04/2017,4700,Extreme_weather_natural_disaster
8/04/2017,4700,Extreme_weather_natural_disaster
8/04/2017,4702,Extreme_weather_natural_disaster
8/04/2017,4701,Extreme_weather_natural_disaster
8/04/2017,4700,Extreme_weather_natural_disaster
8/04/2017,4701,Extreme_weather_natural_disaster
9/04/2017,4700,Chemical_Gas_oil_leak_comtamination
9/04/2017,4700,Extreme_weather_natural_disaster
9/04/2017,4701,Extreme_weather_natural_disaster
9/04/2017,4700,Extreme_weather_natural_disaster
9/04/2017,4704,Extreme_weather_natural_disaster
9/04/2017,4701,Extreme_weather_natural_disaster
9/04/2017,4701,Extreme_weather_natural_disaster
9/04/2017,4700,Extreme_weather_natural_disaster
9/04/2017,4701,Extreme_weather_natural_disaster
9/04/2017,4700,Extreme_weather_natural_disaster
9/04/2017,4700,Extreme_weather_natural_disaster
9/04/2017,4701,Extreme_weather_natural_disaster
9/04/2017,4700,Hurricane
9/04/2017,4700,Extreme_weather_natural_disaster
9/04/2017,4700,Extreme_weather_natural_disaster
9/04/2017,4700,Extreme_weather_natural_disaster
9/04/2017,4415,Chemical_Gas_oil_leak_comtamination
9/04/2017,4741,Hurricane
9/04/2017,4701,Extreme_weather_natural_disaster
9/04/2017,4701,Extreme_weather_natural_disaster
10/04/2017,4701,Extreme_weather_natural_disaster
10/04/2017,4700,Hurricane
10/04/2017,4700,Hurricane
10/04/2017,4700,Hurricane
10/04/2017,4700,Hurricane
10/04/2017,4700,Hurricane
10/04/2017,4700,Hurricane
10/04/2017,4700,Hurricane
10/04/2017,4700,Hurricane
10/04/2017,4700,Hurricane
10/04/2017,4700,Hurricane
10/04/2017,4700,Hurricane
10/04/2017,4700,Hurricane
10/04/2017,4700,Extreme_weather_natural_disaster
10/04/2017,4700,Extreme_weather_natural_disaster
10/04/2017,4700,Extreme_weather_natural_disaster
10/04/2017,4700,Extreme_weather_natural_disaster
10/04/2017,4700,Extreme_weather_natural_disaster
10/04/2017,4700,Extreme_weather_natural_disaster
10/04/2017,4700,Extreme_weather_natural_disaster
10/04/2017,4700,Extreme_weather_natural_disaster
10/04/2017,4700,Extreme_weather_natural_disaster
10/04/2017,4700,Extreme_weather_natural_disaster
10/04/2017,4700,Extreme_weather_natural_disaster
10/04/2017,4704,Extreme_weather_natural_disaster
10/04/2017,4700,Extreme_weather_natural_disaster
10/04/2017,4701,Extreme_weather_natural_disaster
10/04/2017,4701,Extreme_weather_natural_disaster
10/04/2017,4702,Extreme_weather_natural_disaster
10/04/2017,4567,Chemical_Gas_oil_leak_comtamination
10/04/2017,4210,Chemical_Gas_oil_leak_comtamination
11/04/2017,4810,Chemical_Gas_oil_leak_comtamination
11/04/2017,4701,Extreme_weather_natural_disaster
11/04/2017,4702,Extreme_weather_natural_disaster
11/04/2017,4701,Extreme_weather_natural_disaster
11/04/2017,4700,Extreme_weather_natural_disaster
11/04/2017,4700,Extreme_weather_natural_disaster
11/04/2017,4702,Extreme_weather_natural_disaster
11/04/2017,4700,Extreme_weather_natural_disaster
11/04/2017,4580,Chemical_Gas_oil_leak_comtamination
11/04/2017,4066,Chemical_Gas_oil_leak_comtamination
11/04/2017,4133,Chemical_Gas_oil_leak_comtamination
12/04/2017,4815,Chemical_Gas_oil_leak_comtamination
12/04/2017,4701,Extreme_weather_natural_disaster
12/04/2017,4700,Extreme_weather_natural_disaster
12/04/2017,4700,Extreme_weather_natural_disaster
12/04/2017,4700,Hurricane
12/04/2017,4700,Extreme_weather_natural_disaster
12/04/2017,4700,Extreme_weather_natural_disaster
12/04/2017,4700,Extreme_weather_natural_disaster
12/04/2017,4702,Hurricane
12/04/2017,4700,Extreme_weather_natural_disaster
12/04/2017,4702,Extreme_weather_natural_disaster
12/04/2017,4702,Extreme_weather_natural_disaster
12/04/2017,4702,Extreme_weather_natural_disaster
12/04/2017,4700,Extreme_weather_natural_disaster
12/04/2017,4127,Chemical_Gas_oil_leak_comtamination
13/04/2017,4702,Extreme_weather_natural_disaster
13/04/2017,4700,Extreme_weather_natural_disaster
13/04/2017,4702,Extreme_weather_natural_disaster
13/04/2017,4700,Extreme_weather_natural_disaster
13/04/2017,4700,Extreme_weather_natural_disaster
13/04/2017,4700,Extreme_weather_natural_disaster
13/04/2017,4702,Extreme_weather_natural_disaster
13/04/2017,4700,Extreme_weather_natural_disaster
13/04/2017,4700,Extreme_weather_natural_disaster
13/04/2017,4702,Extreme_weather_natural_disaster
13/04/2017,4702,Extreme_weather_natural_disaster
13/04/2017,4700,Extreme_weather_natural_disaster
13/04/2017,4700,Extreme_weather_natural_disaster
13/04/2017,4700,Extreme_weather_natural_disaster
13/04/2017,4700,Extreme_weather_natural_disaster
13/04/2017,4700,Extreme_weather_natural_disaster
13/04/2017,4702,Extreme_weather_natural_disaster
13/04/2017,4702,Extreme_weather_natural_disaster
13/04/2017,4700,Extreme_weather_natural_disaster
13/04/2017,4702,Extreme_weather_natural_disaster
13/04/2017,4702,Extreme_weather_natural_disaster
13/04/2017,4702,Extreme_weather_natural_disaster
13/04/2017,4702,Extreme_weather_natural_disaster
13/04/2017,4700,Extreme_weather_natural_disaster
13/04/2017,4701,Extreme_weather_natural_disaster
13/04/2017,4701,Extreme_weather_natural_disaster
13/04/2017,4702,Extreme_weather_natural_disaster
13/04/2017,4700,Extreme_weather_natural_disaster
13/04/2017,4670,Chemical_Gas_oil_leak_comtamination
13/04/2017,4000,Chemical_Gas_oil_leak_comtamination
13/04/2017,4053,Chemical_Gas_oil_leak_comtamination
14/04/2017,4510,Chemical_Gas_oil_leak_comtamination
15/04/2017,4510,Chemical_Gas_oil_leak_comtamination
15/04/2017,4500,Bomb_suspicious_package
16/04/2017,4737,Chemical_Gas_oil_leak_comtamination
16/04/2017,4551,Chemical_Gas_oil_leak_comtamination
17/04/2017,4570,Chemical_Gas_oil_leak_comtamination
17/04/2017,4226,Chemical_Gas_oil_leak_comtamination
17/04/2017,4868,Chemical_Gas_oil_leak_comtamination
18/04/2017,4850,Chemical_Gas_oil_leak_comtamination
18/04/2017,4005,Chemical_Gas_oil_leak_comtamination
18/04/2017,4000,Chemical_Gas_oil_leak_comtamination
18/04/2017,4500,Chemical_Gas_oil_leak_comtamination
18/04/2017,4131,Chemical_Gas_oil_leak_comtamination
18/04/2017,4133,Extreme_weather_natural_disaster
19/04/2017,4814,Chemical_Gas_oil_leak_comtamination
19/04/2017,4800,Chemical_Gas_oil_leak_comtamination
19/04/2017,4350,Chemical_Gas_oil_leak_comtamination
19/04/2017,4510,Chemical_Gas_oil_leak_comtamination
19/04/2017,4032,Chemical_Gas_oil_leak_comtamination
20/04/2017,4170,Chemical_Gas_oil_leak_comtamination
20/04/2017,4017,Chemical_Gas_oil_leak_comtamination
20/04/2017,4133,Chemical_Gas_oil_leak_comtamination
21/04/2017,4655,Chemical_Gas_oil_leak_comtamination
21/04/2017,4505,Chemical_Gas_oil_leak_comtamination
21/04/2017,4119,Chemical_Gas_oil_leak_comtamination
21/04/2017,4879,Chemical_Gas_oil_leak_comtamination
22/04/2017,4510,Chemical_Gas_oil_leak_comtamination
22/04/2017,4275,Chemical_Gas_oil_leak_comtamination
22/04/2017,4879,Chemical_Gas_oil_leak_comtamination
23/04/2017,4301,Chemical_Gas_oil_leak_comtamination
23/04/2017,4870,Chemical_Gas_oil_leak_comtamination
24/04/2017,4350,Chemical_Gas_oil_leak_comtamination
25/04/2017,4153,Chemical_Gas_oil_leak_comtamination
25/04/2017,4152,Chemical_Gas_oil_leak_comtamination
25/04/2017,4211,Chemical_Gas_oil_leak_comtamination
25/04/2017,4300,Chemical_Gas_oil_leak_comtamination
25/04/2017,4560,Extreme_weather_natural_disaster
26/04/2017,4812,Chemical_Gas_oil_leak_comtamination
26/04/2017,4503,Chemical_Gas_oil_leak_comtamination
26/04/2017,4020,Chemical_Gas_oil_leak_comtamination
26/04/2017,4209,Chemical_Gas_oil_leak_comtamination
26/04/2017,4210,Chemical_Gas_oil_leak_comtamination
26/04/2017,4305,Chemical_Gas_oil_leak_comtamination
27/04/2017,4012,Chemical_Gas_oil_leak_comtamination
27/04/2017,4508,Chemical_Gas_oil_leak_comtamination
28/04/2017,4551,Chemical_Gas_oil_leak_comtamination
28/04/2017,4503,Chemical_Gas_oil_leak_comtamination
28/04/2017,4226,Chemical_Gas_oil_leak_comtamination
29/04/2017,4214,Chemical_Gas_oil_leak_comtamination
30/04/2017,4157,Chemical_Gas_oil_leak_comtamination
30/04/2017,4503,Chemical_Gas_oil_leak_comtamination
30/04/2017,4019,Chemical_Gas_oil_leak_comtamination
30/04/2017,4211,Chemical_Gas_oil_leak_comtamination
1/05/2017,4806,Chemical_Gas_oil_leak_comtamination
1/05/2017,4405,Chemical_Gas_oil_leak_comtamination
1/05/2017,4551,Chemical_Gas_oil_leak_comtamination
1/05/2017,4118,Chemical_Gas_oil_leak_comtamination
1/05/2017,4301,Chemical_Gas_oil_leak_comtamination
2/05/2017,4113,Chemical_Gas_oil_leak_comtamination
2/05/2017,4208,Chemical_Gas_oil_leak_comtamination
3/05/2017,4110,Chemical_Gas_oil_leak_comtamination
4/05/2017,4017,Chemical_Gas_oil_leak_comtamination
5/05/2017,4355,Chemical_Gas_oil_leak_comtamination
5/05/2017,4401,Chemical_Gas_oil_leak_comtamination
5/05/2017,4350,Chemical_Gas_oil_leak_comtamination
5/05/2017,4655,Chemical_Gas_oil_leak_comtamination
5/05/2017,4566,Chemical_Gas_oil_leak_comtamination
5/05/2017,4556,Chemical_Gas_oil_leak_comtamination
5/05/2017,4006,Chemical_Gas_oil_leak_comtamination
5/05/2017,4165,Chemical_Gas_oil_leak_comtamination
5/05/2017,4007,Chemical_Gas_oil_leak_comtamination
5/05/2017,4207,Chemical_Gas_oil_leak_comtamination
5/05/2017,4310,Chemical_Gas_oil_leak_comtamination
6/05/2017,4570,Chemical_Gas_oil_leak_comtamination
6/05/2017,4211,Chemical_Gas_oil_leak_comtamination
7/05/2017,4076,Chemical_Gas_oil_leak_comtamination
8/05/2017,4670,Chemical_Gas_oil_leak_comtamination
8/05/2017,4170,Chemical_Gas_oil_leak_comtamination
8/05/2017,4152,Chemical_Gas_oil_leak_comtamination
8/05/2017,4035,Chemical_Gas_oil_leak_comtamination
8/05/2017,4301,Chemical_Gas_oil_leak_comtamination
8/05/2017,4869,Chemical_Gas_oil_leak_comtamination
9/05/2017,4560,Chemical_Gas_oil_leak_comtamination
10/05/2017,4078,Chemical_Gas_oil_leak_comtamination
10/05/2017,4051,Chemical_Gas_oil_leak_comtamination
10/05/2017,4014,Chemical_Gas_oil_leak_comtamination
11/05/2017,4122,Chemical_Gas_oil_leak_comtamination
12/05/2017,4413,Chemical_Gas_oil_leak_comtamination
12/05/2017,4119,Chemical_Gas_oil_leak_comtamination
13/05/2017,4304,Chemical_Gas_oil_leak_comtamination
14/05/2017,4655,Chemical_Gas_oil_leak_comtamination
15/05/2017,4575,Chemical_Gas_oil_leak_comtamination
15/05/2017,4508,Chemical_Gas_oil_leak_comtamination
15/05/2017,4214,Chemical_Gas_oil_leak_comtamination
16/05/2017,4701,Chemical_Gas_oil_leak_comtamination
16/05/2017,4352,Chemical_Gas_oil_leak_comtamination
16/05/2017,4551,Chemical_Gas_oil_leak_comtamination
16/05/2017,4014,Chemical_Gas_oil_leak_comtamination
16/05/2017,4854,Chemical_Gas_oil_leak_comtamination
17/05/2017,4825,Chemical_Gas_oil_leak_comtamination
17/05/2017,4006,Chemical_Gas_oil_leak_comtamination
18/05/2017,4178,Chemical_Gas_oil_leak_comtamination
19/05/2017,4810,Chemical_Gas_oil_leak_comtamination
19/05/2017,4357,Chemical_Gas_oil_leak_comtamination
19/05/2017,4421,Chemical_Gas_oil_leak_comtamination
19/05/2017,4655,Chemical_Gas_oil_leak_comtamination
19/05/2017,4503,Chemical_Gas_oil_leak_comtamination
19/05/2017,4207,Chemical_Gas_oil_leak_comtamination
20/05/2017,4114,Chemical_Gas_oil_leak_comtamination
21/05/2017,4815,Chemical_Gas_oil_leak_comtamination
21/05/2017,4122,Chemical_Gas_oil_leak_comtamination
21/05/2017,4053,Chemical_Gas_oil_leak_comtamination
21/05/2017,4113,Chemical_Gas_oil_leak_comtamination
22/05/2017,4815,Chemical_Gas_oil_leak_comtamination
22/05/2017,4556,Chemical_Gas_oil_leak_comtamination
22/05/2017,4207,Chemical_Gas_oil_leak_comtamination
22/05/2017,4305,Chemical_Gas_oil_leak_comtamination
22/05/2017,4300,Chemical_Gas_oil_leak_comtamination
23/05/2017,4805,Chemical_Gas_oil_leak_comtamination
24/05/2017,4710,Chemical_Gas_oil_leak_comtamination
24/05/2017,4720,Chemical_Gas_oil_leak_comtamination
24/05/2017,4870,Chemical_Gas_oil_leak_comtamination
25/05/2017,4566,Chemical_Gas_oil_leak_comtamination
26/05/2017,4810,Chemical_Gas_oil_leak_comtamination
26/05/2017,4350,Chemical_Gas_oil_leak_comtamination
27/05/2017,4568,Chemical_Gas_oil_leak_comtamination
28/05/2017,4573,Chemical_Gas_oil_leak_comtamination
29/05/2017,4818,Bomb_suspicious_package
29/05/2017,4122,Chemical_Gas_oil_leak_comtamination
29/05/2017,4163,Chemical_Gas_oil_leak_comtamination
29/05/2017,4184,Chemical_Gas_oil_leak_comtamination
29/05/2017,4505,Chemical_Gas_oil_leak_comtamination
30/05/2017,4680,Chemical_Gas_oil_leak_comtamination
30/05/2017,4006,Chemical_Gas_oil_leak_comtamination
30/05/2017,4178,Chemical_Gas_oil_leak_comtamination
30/05/2017,4519,Chemical_Gas_oil_leak_comtamination
31/05/2017,4811,Chemical_Gas_oil_leak_comtamination
31/05/2017,4350,Chemical_Gas_oil_leak_comtamination
31/05/2017,4415,Chemical_Gas_oil_leak_comtamination
31/05/2017,4565,Chemical_Gas_oil_leak_comtamination
31/05/2017,4560,Chemical_Gas_oil_leak_comtamination
31/05/2017,4123,Chemical_Gas_oil_leak_comtamination
31/05/2017,4178,Chemical_Gas_oil_leak_comtamination
2/06/2017,4700,Chemical_Gas_oil_leak_comtamination
2/06/2017,4101,Chemical_Gas_oil_leak_comtamination
2/06/2017,4216,Chemical_Gas_oil_leak_comtamination
2/06/2017,4217,Chemical_Gas_oil_leak_comtamination
3/06/2017,4812,Chemical_Gas_oil_leak_comtamination
4/06/2017,4680,Chemical_Gas_oil_leak_comtamination
4/06/2017,4109,Chemical_Gas_oil_leak_comtamination
4/06/2017,4300,Chemical_Gas_oil_leak_comtamination
5/06/2017,4802,Chemical_Gas_oil_leak_comtamination
5/06/2017,4173,Chemical_Gas_oil_leak_comtamination
6/06/2017,4701,Chemical_Gas_oil_leak_comtamination
6/06/2017,4172,Chemical_Gas_oil_leak_comtamination
6/06/2017,4068,Chemical_Gas_oil_leak_comtamination
7/06/2017,4810,Bomb_suspicious_package
7/06/2017,4726,Chemical_Gas_oil_leak_comtamination
7/06/2017,4556,Chemical_Gas_oil_leak_comtamination
7/06/2017,4019,Chemical_Gas_oil_leak_comtamination
7/06/2017,4214,Chemical_Gas_oil_leak_comtamination
7/06/2017,4214,Chemical_Gas_oil_leak_comtamination
8/06/2017,4817,Chemical_Gas_oil_leak_comtamination
8/06/2017,4151,Chemical_Gas_oil_leak_comtamination
8/06/2017,4151,Chemical_Gas_oil_leak_comtamination
8/06/2017,4215,Chemical_Gas_oil_leak_comtamination
8/06/2017,4217,Chemical_Gas_oil_leak_comtamination
8/06/2017,4313,Chemical_Gas_oil_leak_comtamination
9/06/2017,4551,Chemical_Gas_oil_leak_comtamination
9/06/2017,4509,Chemical_Gas_oil_leak_comtamination
10/06/2017,4670,Chemical_Gas_oil_leak_comtamination
11/06/2017,4030,Chemical_Gas_oil_leak_comtamination
12/06/2017,4850,Chemical_Gas_oil_leak_comtamination
12/06/2017,4401,Chemical_Gas_oil_leak_comtamination
12/06/2017,4102,Chemical_Gas_oil_leak_comtamination
12/06/2017,4218,Chemical_Gas_oil_leak_comtamination
12/06/2017,4214,Chemical_Gas_oil_leak_comtamination
12/06/2017,4119,Chemical_Gas_oil_leak_comtamination
12/06/2017,4870,Chemical_Gas_oil_leak_comtamination
13/06/2017,4171,Chemical_Gas_oil_leak_comtamination
13/06/2017,4069,Chemical_Gas_oil_leak_comtamination
13/06/2017,4220,Extreme_weather_natural_disaster
13/06/2017,4217,Extreme_weather_natural_disaster
13/06/2017,4883,Chemical_Gas_oil_leak_comtamination
14/06/2017,4217,Extreme_weather_natural_disaster
14/06/2017,4218,Extreme_weather_natural_disaster
14/06/2017,4229,Hurricane
14/06/2017,4877,Chemical_Gas_oil_leak_comtamination
15/06/2017,4825,Chemical_Gas_oil_leak_comtamination
15/06/2017,4121,Chemical_Gas_oil_leak_comtamination
15/06/2017,4064,Chemical_Gas_oil_leak_comtamination
15/06/2017,4007,Chemical_Gas_oil_leak_comtamination
15/06/2017,4305,Chemical_Gas_oil_leak_comtamination
15/06/2017,4870,Chemical_Gas_oil_leak_comtamination
16/06/2017,4812,Chemical_Gas_oil_leak_comtamination
16/06/2017,4494,Chemical_Gas_oil_leak_comtamination
16/06/2017,4556,Chemical_Gas_oil_leak_comtamination
16/06/2017,4122,Chemical_Gas_oil_leak_comtamination
16/06/2017,4017,Chemical_Gas_oil_leak_comtamination
16/06/2017,4125,Chemical_Gas_oil_leak_comtamination
17/06/2017,4519,Chemical_Gas_oil_leak_comtamination
17/06/2017,4110,Chemical_Gas_oil_leak_comtamination
17/06/2017,4053,Chemical_Gas_oil_leak_comtamination
17/06/2017,4512,Chemical_Gas_oil_leak_comtamination
18/06/2017,4014,Chemical_Gas_oil_leak_comtamination
19/06/2017,4214,Chemical_Gas_oil_leak_comtamination
19/06/2017,4305,Chemical_Gas_oil_leak_comtamination
20/06/2017,4700,Chemical_Gas_oil_leak_comtamination
20/06/2017,4650,Chemical_Gas_oil_leak_comtamination
20/06/2017,4215,Chemical_Gas_oil_leak_comtamination
21/06/2017,4174,Chemical_Gas_oil_leak_comtamination
21/06/2017,4508,Chemical_Gas_oil_leak_comtamination
21/06/2017,4215,Chemical_Gas_oil_leak_comtamination
21/06/2017,4220,Bomb_suspicious_package
21/06/2017,4305,Chemical_Gas_oil_leak_comtamination
22/06/2017,4701,Bomb_suspicious_package
22/06/2017,4472,Chemical_Gas_oil_leak_comtamination
22/06/2017,4271,Chemical_Gas_oil_leak_comtamination
23/06/2017,4659,Chemical_Gas_oil_leak_comtamination
23/06/2017,4218,Chemical_Gas_oil_leak_comtamination
23/06/2017,4112,Chemical_Gas_oil_leak_comtamination
24/06/2017,4102,Chemical_Gas_oil_leak_comtamination
25/06/2017,4615,Chemical_Gas_oil_leak_comtamination
25/06/2017,4560,Chemical_Gas_oil_leak_comtamination
25/06/2017,4173,Chemical_Gas_oil_leak_comtamination
25/06/2017,4883,Chemical_Gas_oil_leak_comtamination
26/06/2017,4006,Chemical_Gas_oil_leak_comtamination
26/06/2017,4059,Chemical_Gas_oil_leak_comtamination
26/06/2017,4503,Chemical_Gas_oil_leak_comtamination
26/06/2017,4300,Chemical_Gas_oil_leak_comtamination
27/06/2017,4350,Chemical_Gas_oil_leak_comtamination
27/06/2017,4066,Chemical_Gas_oil_leak_comtamination
27/06/2017,4216,Chemical_Gas_oil_leak_comtamination
27/06/2017,4303,Chemical_Gas_oil_leak_comtamination
28/06/2017,4570,Chemical_Gas_oil_leak_comtamination
28/06/2017,4007,Chemical_Gas_oil_leak_comtamination
28/06/2017,4114,Chemical_Gas_oil_leak_comtamination
29/06/2017,4715,Chemical_Gas_oil_leak_comtamination
29/06/2017,4059,Chemical_Gas_oil_leak_comtamination
29/06/2017,4205,Chemical_Gas_oil_leak_comtamination
30/06/2017,4005,Chemical_Gas_oil_leak_comtamination
1/07/2017,4405,Chemical_Gas_oil_leak_comtamination
1/07/2017,4670,Chemical_Gas_oil_leak_comtamination
1/07/2017,4659,Chemical_Gas_oil_leak_comtamination
2/07/2017,4561,Chemical_Gas_oil_leak_comtamination
2/07/2017,4122,Chemical_Gas_oil_leak_comtamination
2/07/2017,4051,Chemical_Gas_oil_leak_comtamination
2/07/2017,4504,Chemical_Gas_oil_leak_comtamination
2/07/2017,4220,Chemical_Gas_oil_leak_comtamination
2/07/2017,4305,Chemical_Gas_oil_leak_comtamination
2/07/2017,4860,Chemical_Gas_oil_leak_comtamination
3/07/2017,4017,Chemical_Gas_oil_leak_comtamination
3/07/2017,4876,Chemical_Gas_oil_leak_comtamination
4/07/2017,4000,Chemical_Gas_oil_leak_comtamination
5/07/2017,4270,Chemical_Gas_oil_leak_comtamination
5/07/2017,4868,Chemical_Gas_oil_leak_comtamination
6/07/2017,4170,Chemical_Gas_oil_leak_comtamination
6/07/2017,4217,Chemical_Gas_oil_leak_comtamination
7/07/2017,4031,Chemical_Gas_oil_leak_comtamination
7/07/2017,4129,Chemical_Gas_oil_leak_comtamination
7/07/2017,4870,Chemical_Gas_oil_leak_comtamination
8/07/2017,4812,Chemical_Gas_oil_leak_comtamination
8/07/2017,4701,Chemical_Gas_oil_leak_comtamination
8/07/2017,4455,Chemical_Gas_oil_leak_comtamination
8/07/2017,4173,Chemical_Gas_oil_leak_comtamination
9/07/2017,4350,Chemical_Gas_oil_leak_comtamination
9/07/2017,4006,Chemical_Gas_oil_leak_comtamination
9/07/2017,4217,Chemical_Gas_oil_leak_comtamination
10/07/2017,4655,Bomb_suspicious_package
10/07/2017,4650,Chemical_Gas_oil_leak_comtamination
10/07/2017,4113,Chemical_Gas_oil_leak_comtamination
10/07/2017,4000,Chemical_Gas_oil_leak_comtamination
10/07/2017,4034,Chemical_Gas_oil_leak_comtamination
11/07/2017,4819,Chemical_Gas_oil_leak_comtamination
11/07/2017,4370,Chemical_Gas_oil_leak_comtamination
11/07/2017,4053,Chemical_Gas_oil_leak_comtamination
11/07/2017,4019,Chemical_Gas_oil_leak_comtamination
11/07/2017,4860,Chemical_Gas_oil_leak_comtamination
12/07/2017,4650,Chemical_Gas_oil_leak_comtamination
12/07/2017,4006,Chemical_Gas_oil_leak_comtamination
12/07/2017,4075,Chemical_Gas_oil_leak_comtamination
13/07/2017,4720,Chemical_Gas_oil_leak_comtamination
13/07/2017,4008,Chemical_Gas_oil_leak_comtamination
13/07/2017,4031,Chemical_Gas_oil_leak_comtamination
13/07/2017,4032,Chemical_Gas_oil_leak_comtamination
13/07/2017,4019,Chemical_Gas_oil_leak_comtamination
14/07/2017,4680,Bomb_suspicious_package
14/07/2017,4218,Chemical_Gas_oil_leak_comtamination
16/07/2017,4740,Chemical_Gas_oil_leak_comtamination
16/07/2017,4220,Chemical_Gas_oil_leak_comtamination
17/07/2017,4700,Chemical_Gas_oil_leak_comtamination
17/07/2017,4700,Chemical_Gas_oil_leak_comtamination
17/07/2017,4680,Chemical_Gas_oil_leak_comtamination
17/07/2017,4660,Chemical_Gas_oil_leak_comtamination
17/07/2017,4507,Chemical_Gas_oil_leak_comtamination
17/07/2017,4305,Chemical_Gas_oil_leak_comtamination
18/07/2017,4005,Chemical_Gas_oil_leak_comtamination
18/07/2017,4505,Chemical_Gas_oil_leak_comtamination
19/07/2017,4557,Chemical_Gas_oil_leak_comtamination
19/07/2017,4169,Chemical_Gas_oil_leak_comtamination
19/07/2017,4169,Chemical_Gas_oil_leak_comtamination
19/07/2017,4051,Chemical_Gas_oil_leak_comtamination
19/07/2017,4215,Chemical_Gas_oil_leak_comtamination
20/07/2017,4151,Chemical_Gas_oil_leak_comtamination
21/07/2017,4173,Chemical_Gas_oil_leak_comtamination
21/07/2017,4132,Chemical_Gas_oil_leak_comtamination
22/07/2017,4715,Chemical_Gas_oil_leak_comtamination
22/07/2017,4680,Chemical_Gas_oil_leak_comtamination
23/07/2017,4702,Chemical_Gas_oil_leak_comtamination
23/07/2017,4680,Chemical_Gas_oil_leak_comtamination
23/07/2017,4113,Chemical_Gas_oil_leak_comtamination
23/07/2017,4075,Chemical_Gas_oil_leak_comtamination
23/07/2017,4215,Chemical_Gas_oil_leak_comtamination
24/07/2017,4754,Chemical_Gas_oil_leak_comtamination
24/07/2017,4680,Chemical_Gas_oil_leak_comtamination
24/07/2017,4510,Chemical_Gas_oil_leak_comtamination
24/07/2017,4223,Chemical_Gas_oil_leak_comtamination
24/07/2017,4216,Chemical_Gas_oil_leak_comtamination
25/07/2017,4740,Chemical_Gas_oil_leak_comtamination
25/07/2017,4107,Chemical_Gas_oil_leak_comtamination
25/07/2017,4870,Chemical_Gas_oil_leak_comtamination
26/07/2017,4650,Chemical_Gas_oil_leak_comtamination
26/07/2017,4650,Chemical_Gas_oil_leak_comtamination
26/07/2017,4115,Chemical_Gas_oil_leak_comtamination
26/07/2017,4005,Chemical_Gas_oil_leak_comtamination
28/07/2017,4817,Chemical_Gas_oil_leak_comtamination
28/07/2017,4218,Chemical_Gas_oil_leak_comtamination
28/07/2017,4870,Chemical_Gas_oil_leak_comtamination
29/07/2017,4680,Chemical_Gas_oil_leak_comtamination
29/07/2017,4558,Chemical_Gas_oil_leak_comtamination
29/07/2017,4510,Chemical_Gas_oil_leak_comtamination
29/07/2017,4510,Chemical_Gas_oil_leak_comtamination
30/07/2017,4370,Chemical_Gas_oil_leak_comtamination
30/07/2017,4567,Chemical_Gas_oil_leak_comtamination
30/07/2017,4075,Chemical_Gas_oil_leak_comtamination
30/07/2017,4210,Chemical_Gas_oil_leak_comtamination
30/07/2017,4300,Chemical_Gas_oil_leak_comtamination
31/07/2017,4814,Chemical_Gas_oil_leak_comtamination
31/07/2017,4509,Chemical_Gas_oil_leak_comtamination
31/07/2017,4069,Chemical_Gas_oil_leak_comtamination
1/08/2017,4825,Chemical_Gas_oil_leak_comtamination
1/08/2017,4694,Chemical_Gas_oil_leak_comtamination
1/08/2017,4650,Chemical_Gas_oil_leak_comtamination
1/08/2017,4007,Chemical_Gas_oil_leak_comtamination
1/08/2017,4000,Chemical_Gas_oil_leak_comtamination
1/08/2017,4030,Chemical_Gas_oil_leak_comtamination
1/08/2017,4216,Chemical_Gas_oil_leak_comtamination
2/08/2017,4740,Chemical_Gas_oil_leak_comtamination
2/08/2017,4570,Chemical_Gas_oil_leak_comtamination
2/08/2017,4163,Chemical_Gas_oil_leak_comtamination
3/08/2017,4730,Chemical_Gas_oil_leak_comtamination
4/08/2017,4680,Chemical_Gas_oil_leak_comtamination
4/08/2017,4680,Chemical_Gas_oil_leak_comtamination
4/08/2017,4551,Chemical_Gas_oil_leak_comtamination
4/08/2017,4114,Chemical_Gas_oil_leak_comtamination
5/08/2017,4077,Chemical_Gas_oil_leak_comtamination
5/08/2017,4510,Chemical_Gas_oil_leak_comtamination
5/08/2017,4207,Chemical_Gas_oil_leak_comtamination
5/08/2017,4118,Chemical_Gas_oil_leak_comtamination
6/08/2017,4810,Chemical_Gas_oil_leak_comtamination
6/08/2017,4727,Chemical_Gas_oil_leak_comtamination
6/08/2017,4370,Chemical_Gas_oil_leak_comtamination
6/08/2017,4514,Chemical_Gas_oil_leak_comtamination
7/08/2017,4680,Chemical_Gas_oil_leak_comtamination
7/08/2017,4035,Chemical_Gas_oil_leak_comtamination
8/08/2017,4680,Chemical_Gas_oil_leak_comtamination
8/08/2017,4005,Chemical_Gas_oil_leak_comtamination
8/08/2017,4133,Chemical_Gas_oil_leak_comtamination
9/08/2017,4415,Chemical_Gas_oil_leak_comtamination
9/08/2017,4470,Chemical_Gas_oil_leak_comtamination
9/08/2017,4207,Chemical_Gas_oil_leak_comtamination
10/08/2017,4218,Chemical_Gas_oil_leak_comtamination
11/08/2017,4810,Chemical_Gas_oil_leak_comtamination
11/08/2017,4207,Chemical_Gas_oil_leak_comtamination
12/08/2017,4108,Chemical_Gas_oil_leak_comtamination
13/08/2017,4500,Chemical_Gas_oil_leak_comtamination
14/08/2017,4012,Chemical_Gas_oil_leak_comtamination
14/08/2017,4072,Chemical_Gas_oil_leak_comtamination
14/08/2017,4508,Chemical_Gas_oil_leak_comtamination
14/08/2017,4211,Chemical_Gas_oil_leak_comtamination
15/08/2017,4825,Chemical_Gas_oil_leak_comtamination
15/08/2017,4610,Chemical_Gas_oil_leak_comtamination
15/08/2017,4119,Chemical_Gas_oil_leak_comtamination
16/08/2017,4680,Chemical_Gas_oil_leak_comtamination
16/08/2017,4060,Chemical_Gas_oil_leak_comtamination
17/08/2017,4370,Chemical_Gas_oil_leak_comtamination
17/08/2017,4061,Chemical_Gas_oil_leak_comtamination
17/08/2017,4068,Chemical_Gas_oil_leak_comtamination
18/08/2017,4806,Chemical_Gas_oil_leak_comtamination
18/08/2017,4505,Chemical_Gas_oil_leak_comtamination
18/08/2017,4300,Chemical_Gas_oil_leak_comtamination
19/08/2017,4753,Chemical_Gas_oil_leak_comtamination
19/08/2017,4703,Chemical_Gas_oil_leak_comtamination
19/08/2017,4650,Chemical_Gas_oil_leak_comtamination
21/08/2017,4703,Chemical_Gas_oil_leak_comtamination
21/08/2017,4655,Chemical_Gas_oil_leak_comtamination
21/08/2017,4101,Chemical_Gas_oil_leak_comtamination
21/08/2017,4053,Chemical_Gas_oil_leak_comtamination
21/08/2017,4306,Chemical_Gas_oil_leak_comtamination
22/08/2017,4570,Chemical_Gas_oil_leak_comtamination
22/08/2017,4870,Chemical_Gas_oil_leak_comtamination
23/08/2017,4740,Chemical_Gas_oil_leak_comtamination
23/08/2017,4350,Chemical_Gas_oil_leak_comtamination
23/08/2017,4178,Chemical_Gas_oil_leak_comtamination
23/08/2017,4000,Chemical_Gas_oil_leak_comtamination
23/08/2017,4505,Chemical_Gas_oil_leak_comtamination
24/08/2017,4677,Chemical_Gas_oil_leak_comtamination
24/08/2017,4051,Extreme_weather_natural_disaster
24/08/2017,4216,Chemical_Gas_oil_leak_comtamination
24/08/2017,4215,Chemical_Gas_oil_leak_comtamination
25/08/2017,4575,Chemical_Gas_oil_leak_comtamination
25/08/2017,4560,Chemical_Gas_oil_leak_comtamination
25/08/2017,4075,Chemical_Gas_oil_leak_comtamination
25/08/2017,4285,Chemical_Gas_oil_leak_comtamination
25/08/2017,4341,Chemical_Gas_oil_leak_comtamination
25/08/2017,4311,Chemical_Gas_oil_leak_comtamination
27/08/2017,4650,Chemical_Gas_oil_leak_comtamination
27/08/2017,4570,Chemical_Gas_oil_leak_comtamination
27/08/2017,4655,Chemical_Gas_oil_leak_comtamination
28/08/2017,4701,Chemical_Gas_oil_leak_comtamination
28/08/2017,4650,Chemical_Gas_oil_leak_comtamination
28/08/2017,4570,Chemical_Gas_oil_leak_comtamination
28/08/2017,4570,Chemical_Gas_oil_leak_comtamination
28/08/2017,4012,Chemical_Gas_oil_leak_comtamination
28/08/2017,4502,Chemical_Gas_oil_leak_comtamination
28/08/2017,4019,Chemical_Gas_oil_leak_comtamination
28/08/2017,4504,Chemical_Gas_oil_leak_comtamination
28/08/2017,4879,Chemical_Gas_oil_leak_comtamination
29/08/2017,4701,Chemical_Gas_oil_leak_comtamination
29/08/2017,4370,Chemical_Gas_oil_leak_comtamination
29/08/2017,4077,Chemical_Gas_oil_leak_comtamination
29/08/2017,4101,Chemical_Gas_oil_leak_comtamination
30/08/2017,4825,Chemical_Gas_oil_leak_comtamination
30/08/2017,4725,Chemical_Gas_oil_leak_comtamination
30/08/2017,4505,Chemical_Gas_oil_leak_comtamination
31/08/2017,4006,Chemical_Gas_oil_leak_comtamination
31/08/2017,4000,Chemical_Gas_oil_leak_comtamination
31/08/2017,4118,Chemical_Gas_oil_leak_comtamination
1/09/2017,4740,Chemical_Gas_oil_leak_comtamination
1/09/2017,4701,Chemical_Gas_oil_leak_comtamination
1/09/2017,4171,Chemical_Gas_oil_leak_comtamination
1/09/2017,4070,Chemical_Gas_oil_leak_comtamination
4/09/2017,4805,Chemical_Gas_oil_leak_comtamination
4/09/2017,4007,Chemical_Gas_oil_leak_comtamination
4/09/2017,4115,Chemical_Gas_oil_leak_comtamination
4/09/2017,4880,Chemical_Gas_oil_leak_comtamination
5/09/2017,4807,Chemical_Gas_oil_leak_comtamination
5/09/2017,4350,Chemical_Gas_oil_leak_comtamination
5/09/2017,4556,Chemical_Gas_oil_leak_comtamination
5/09/2017,4059,Chemical_Gas_oil_leak_comtamination
6/09/2017,4560,Bomb_suspicious_package
6/09/2017,4119,Bomb_suspicious_package
6/09/2017,4352,Chemical_Gas_oil_leak_comtamination
7/09/2017,4017,Chemical_Gas_oil_leak_comtamination
8/09/2017,4680,Chemical_Gas_oil_leak_comtamination
8/09/2017,4510,Chemical_Gas_oil_leak_comtamination
8/09/2017,4504,Chemical_Gas_oil_leak_comtamination
9/09/2017,4825,Chemical_Gas_oil_leak_comtamination
11/09/2017,4744,Chemical_Gas_oil_leak_comtamination
12/09/2017,4127,Bomb_suspicious_package
12/09/2017,4510,Chemical_Gas_oil_leak_comtamination
12/09/2017,4214,Chemical_Gas_oil_leak_comtamination
12/09/2017,4285,Chemical_Gas_oil_leak_comtamination
12/09/2017,4114,Bomb_suspicious_package
12/09/2017,4300,Chemical_Gas_oil_leak_comtamination
13/09/2017,4680,Chemical_Gas_oil_leak_comtamination
13/09/2017,4178,Chemical_Gas_oil_leak_comtamination
13/09/2017,4870,Chemical_Gas_oil_leak_comtamination
14/09/2017,4551,Extreme_weather_natural_disaster
14/09/2017,4064,Chemical_Gas_oil_leak_comtamination
14/09/2017,4208,Chemical_Gas_oil_leak_comtamination
14/09/2017,4300,Chemical_Gas_oil_leak_comtamination
15/09/2017,4751,Chemical_Gas_oil_leak_comtamination
15/09/2017,4701,Chemical_Gas_oil_leak_comtamination
15/09/2017,4701,Chemical_Gas_oil_leak_comtamination
16/09/2017,4802,Chemical_Gas_oil_leak_comtamination
16/09/2017,4109,Chemical_Gas_oil_leak_comtamination
16/09/2017,4101,Chemical_Gas_oil_leak_comtamination
16/09/2017,4870,Chemical_Gas_oil_leak_comtamination
18/09/2017,4178,Chemical_Gas_oil_leak_comtamination
18/09/2017,4077,Chemical_Gas_oil_leak_comtamination
19/09/2017,4700,Chemical_Gas_oil_leak_comtamination
19/09/2017,4108,Chemical_Gas_oil_leak_comtamination
20/09/2017,4560,Chemical_Gas_oil_leak_comtamination
20/09/2017,4000,Chemical_Gas_oil_leak_comtamination
20/09/2017,4870,Chemical_Gas_oil_leak_comtamination
21/09/2017,4680,Chemical_Gas_oil_leak_comtamination
21/09/2017,4566,Chemical_Gas_oil_leak_comtamination
22/09/2017,4350,Extreme_weather_natural_disaster
22/09/2017,4568,Hurricane
22/09/2017,4169,Chemical_Gas_oil_leak_comtamination
22/09/2017,4510,Chemical_Gas_oil_leak_comtamination
22/09/2017,4510,Extreme_weather_natural_disaster
22/09/2017,4562,Extreme_weather_natural_disaster
23/09/2017,4352,Chemical_Gas_oil_leak_comtamination
23/09/2017,4405,Chemical_Gas_oil_leak_comtamination
23/09/2017,4000,Chemical_Gas_oil_leak_comtamination
23/09/2017,4032,Chemical_Gas_oil_leak_comtamination
23/09/2017,4210,Chemical_Gas_oil_leak_comtamination
23/09/2017,4207,Chemical_Gas_oil_leak_comtamination
24/09/2017,4184,Chemical_Gas_oil_leak_comtamination
24/09/2017,4170,Chemical_Gas_oil_leak_comtamination
24/09/2017,4101,Chemical_Gas_oil_leak_comtamination
24/09/2017,4305,Chemical_Gas_oil_leak_comtamination
25/09/2017,4744,Chemical_Gas_oil_leak_comtamination
25/09/2017,4465,Chemical_Gas_oil_leak_comtamination
25/09/2017,4164,Chemical_Gas_oil_leak_comtamination
25/09/2017,4860,Chemical_Gas_oil_leak_comtamination
26/09/2017,4362,Chemical_Gas_oil_leak_comtamination
26/09/2017,4877,Chemical_Gas_oil_leak_comtamination
27/09/2017,4670,Chemical_Gas_oil_leak_comtamination
28/09/2017,4352,Chemical_Gas_oil_leak_comtamination
28/09/2017,4350,Chemical_Gas_oil_leak_comtamination
28/09/2017,4059,Chemical_Gas_oil_leak_comtamination
30/09/2017,4574,Chemical_Gas_oil_leak_comtamination
30/09/2017,4051,Chemical_Gas_oil_leak_comtamination
30/09/2017,4019,Chemical_Gas_oil_leak_comtamination
30/09/2017,4114,Chemical_Gas_oil_leak_comtamination
1/10/2017,4650,Chemical_Gas_oil_leak_comtamination
1/10/2017,4280,Chemical_Gas_oil_leak_comtamination
2/10/2017,4670,Extreme_weather_natural_disaster
2/10/2017,4655,Hurricane
3/10/2017,4740,Chemical_Gas_oil_leak_comtamination
3/10/2017,4670,Hurricane
4/10/2017,4211,Chemical_Gas_oil_leak_comtamination
5/10/2017,4102,Chemical_Gas_oil_leak_comtamination
5/10/2017,4178,Chemical_Gas_oil_leak_comtamination
5/10/2017,4504,Chemical_Gas_oil_leak_comtamination
5/10/2017,4305,Chemical_Gas_oil_leak_comtamination
7/10/2017,4220,Chemical_Gas_oil_leak_comtamination
8/10/2017,4505,Chemical_Gas_oil_leak_comtamination
8/10/2017,4868,Chemical_Gas_oil_leak_comtamination
8/10/2017,4818,Chemical_Gas_oil_leak_comtamination
9/10/2017,4118,Chemical_Gas_oil_leak_comtamination
9/10/2017,4119,Chemical_Gas_oil_leak_comtamination
10/10/2017,4341,Chemical_Gas_oil_leak_comtamination
11/10/2017,4740,Chemical_Gas_oil_leak_comtamination
12/10/2017,4740,Chemical_Gas_oil_leak_comtamination
13/10/2017,4077,Chemical_Gas_oil_leak_comtamination
13/10/2017,4873,Chemical_Gas_oil_leak_comtamination
14/10/2017,4076,Chemical_Gas_oil_leak_comtamination
15/10/2017,4000,Chemical_Gas_oil_leak_comtamination
15/10/2017,4020,Extreme_weather_natural_disaster
15/10/2017,4215,Extreme_weather_natural_disaster
15/10/2017,4301,Chemical_Gas_oil_leak_comtamination
15/10/2017,4300,Chemical_Gas_oil_leak_comtamination
15/10/2017,4184,Hurricane
16/10/2017,4825,Chemical_Gas_oil_leak_comtamination
16/10/2017,4560,Chemical_Gas_oil_leak_comtamination
16/10/2017,4301,Chemical_Gas_oil_leak_comtamination
17/10/2017,4811,Chemical_Gas_oil_leak_comtamination
17/10/2017,4061,Extreme_weather_natural_disaster
17/10/2017,4343,Chemical_Gas_oil_leak_comtamination
18/10/2017,4575,Chemical_Gas_oil_leak_comtamination
18/10/2017,4860,Chemical_Gas_oil_leak_comtamination
19/10/2017,4551,Chemical_Gas_oil_leak_comtamination
19/10/2017,4034,Chemical_Gas_oil_leak_comtamination
19/10/2017,4132,Chemical_Gas_oil_leak_comtamination
20/10/2017,4034,Chemical_Gas_oil_leak_comtamination
20/10/2017,4674,Extreme_weather_natural_disaster
22/10/2017,4814,Chemical_Gas_oil_leak_comtamination
22/10/2017,4125,Chemical_Gas_oil_leak_comtamination
23/10/2017,4350,Chemical_Gas_oil_leak_comtamination
23/10/2017,4655,Chemical_Gas_oil_leak_comtamination
23/10/2017,4154,Chemical_Gas_oil_leak_comtamination
23/10/2017,4077,Chemical_Gas_oil_leak_comtamination
23/10/2017,4008,Chemical_Gas_oil_leak_comtamination
23/10/2017,4217,Extreme_weather_natural_disaster
23/10/2017,4865,Chemical_Gas_oil_leak_comtamination
23/10/2017,4674,Extreme_weather_natural_disaster
23/10/2017,4674,Extreme_weather_natural_disaster
23/10/2017,4674,Extreme_weather_natural_disaster
23/10/2017,4674,Extreme_weather_natural_disaster
23/10/2017,4674,Extreme_weather_natural_disaster
23/10/2017,4674,Extreme_weather_natural_disaster
23/10/2017,4674,Extreme_weather_natural_disaster
23/10/2017,4674,Extreme_weather_natural_disaster
24/10/2017,4350,Chemical_Gas_oil_leak_comtamination
24/10/2017,4172,Chemical_Gas_oil_leak_comtamination
24/10/2017,4178,Chemical_Gas_oil_leak_comtamination
25/10/2017,4575,Chemical_Gas_oil_leak_comtamination
25/10/2017,4014,Chemical_Gas_oil_leak_comtamination
25/10/2017,4214,Chemical_Gas_oil_leak_comtamination
25/10/2017,4878,Chemical_Gas_oil_leak_comtamination
26/10/2017,4503,Chemical_Gas_oil_leak_comtamination
26/10/2017,4020,Chemical_Gas_oil_leak_comtamination
26/10/2017,4285,Chemical_Gas_oil_leak_comtamination
27/10/2017,4510,Chemical_Gas_oil_leak_comtamination
27/10/2017,4503,Chemical_Gas_oil_leak_comtamination
27/10/2017,4069,Extreme_weather_natural_disaster
28/10/2017,4710,Chemical_Gas_oil_leak_comtamination
28/10/2017,4108,Chemical_Gas_oil_leak_comtamination
28/10/2017,4285,Chemical_Gas_oil_leak_comtamination
29/10/2017,4207,Chemical_Gas_oil_leak_comtamination
29/10/2017,4124,Extreme_weather_natural_disaster
30/10/2017,4703,Extreme_weather_natural_disaster
30/10/2017,4715,Extreme_weather_natural_disaster
30/10/2017,4390,Chemical_Gas_oil_leak_comtamination
30/10/2017,4630,Extreme_weather_natural_disaster
30/10/2017,4573,Chemical_Gas_oil_leak_comtamination
30/10/2017,4123,Chemical_Gas_oil_leak_comtamination
30/10/2017,4881,Chemical_Gas_oil_leak_comtamination
31/10/2017,4701,Chemical_Gas_oil_leak_comtamination
31/10/2017,4670,Chemical_Gas_oil_leak_comtamination
31/10/2017,4014,Chemical_Gas_oil_leak_comtamination
1/11/2017,4720,Chemical_Gas_oil_leak_comtamination
1/11/2017,4871,Hurricane
1/11/2017,4872,Extreme_weather_natural_disaster
1/11/2017,4888,Extreme_weather_natural_disaster
1/11/2017,4888,Extreme_weather_natural_disaster
1/11/2017,4888,Extreme_weather_natural_disaster
2/11/2017,4370,Chemical_Gas_oil_leak_comtamination
3/11/2017,4700,Chemical_Gas_oil_leak_comtamination
3/11/2017,4306,Chemical_Gas_oil_leak_comtamination
4/11/2017,4680,Chemical_Gas_oil_leak_comtamination
4/11/2017,4565,Chemical_Gas_oil_leak_comtamination
4/11/2017,4155,Chemical_Gas_oil_leak_comtamination
4/11/2017,4059,Chemical_Gas_oil_leak_comtamination
4/11/2017,4500,Chemical_Gas_oil_leak_comtamination
5/11/2017,4510,Chemical_Gas_oil_leak_comtamination
5/11/2017,4209,Chemical_Gas_oil_leak_comtamination
6/11/2017,4380,Extreme_weather_natural_disaster
6/11/2017,4380,Extreme_weather_natural_disaster
6/11/2017,4383,Extreme_weather_natural_disaster
6/11/2017,4124,Chemical_Gas_oil_leak_comtamination
6/11/2017,4343,Chemical_Gas_oil_leak_comtamination
6/11/2017,4870,Chemical_Gas_oil_leak_comtamination
7/11/2017,4825,Chemical_Gas_oil_leak_comtamination
7/11/2017,4487,Chemical_Gas_oil_leak_comtamination
7/11/2017,4670,Extreme_weather_natural_disaster
7/11/2017,4670,Extreme_weather_natural_disaster
7/11/2017,4670,Extreme_weather_natural_disaster
7/11/2017,4670,Extreme_weather_natural_disaster
7/11/2017,4670,Extreme_weather_natural_disaster
7/11/2017,4670,Extreme_weather_natural_disaster
8/11/2017,4870,Chemical_Gas_oil_leak_comtamination
9/11/2017,4870,Chemical_Gas_oil_leak_comtamination
10/11/2017,4212,Chemical_Gas_oil_leak_comtamination
11/11/2017,4350,Chemical_Gas_oil_leak_comtamination
11/11/2017,4035,Chemical_Gas_oil_leak_comtamination
11/11/2017,4018,Chemical_Gas_oil_leak_comtamination
11/11/2017,4209,Chemical_Gas_oil_leak_comtamination
12/11/2017,4178,Chemical_Gas_oil_leak_comtamination
12/11/2017,4030,Chemical_Gas_oil_leak_comtamination
14/11/2017,4012,Chemical_Gas_oil_leak_comtamination
14/11/2017,4503,Chemical_Gas_oil_leak_comtamination
15/11/2017,4567,Chemical_Gas_oil_leak_comtamination
16/11/2017,4680,Chemical_Gas_oil_leak_comtamination
17/11/2017,4567,Chemical_Gas_oil_leak_comtamination
17/11/2017,4560,Chemical_Gas_oil_leak_comtamination
17/11/2017,4178,Bomb_suspicious_package
17/11/2017,4521,Chemical_Gas_oil_leak_comtamination
18/11/2017,4053,Chemical_Gas_oil_leak_comtamination
18/11/2017,4507,Chemical_Gas_oil_leak_comtamination
18/11/2017,4211,Chemical_Gas_oil_leak_comtamination
18/11/2017,4211,Chemical_Gas_oil_leak_comtamination
18/11/2017,4116,Chemical_Gas_oil_leak_comtamination
19/11/2017,4655,Chemical_Gas_oil_leak_comtamination
19/11/2017,4500,Chemical_Gas_oil_leak_comtamination
19/11/2017,4341,Chemical_Gas_oil_leak_comtamination
20/11/2017,4655,Chemical_Gas_oil_leak_comtamination
20/11/2017,4883,Chemical_Gas_oil_leak_comtamination
21/11/2017,4814,Chemical_Gas_oil_leak_comtamination
21/11/2017,4825,Extreme_weather_natural_disaster
21/11/2017,4000,Chemical_Gas_oil_leak_comtamination
21/11/2017,4017,Chemical_Gas_oil_leak_comtamination
22/11/2017,4655,Chemical_Gas_oil_leak_comtamination
23/11/2017,4825,Chemical_Gas_oil_leak_comtamination
23/11/2017,4650,Chemical_Gas_oil_leak_comtamination
23/11/2017,4123,Chemical_Gas_oil_leak_comtamination
24/11/2017,4610,Chemical_Gas_oil_leak_comtamination
24/11/2017,4300,Chemical_Gas_oil_leak_comtamination
25/11/2017,4151,Chemical_Gas_oil_leak_comtamination
25/11/2017,4060,Chemical_Gas_oil_leak_comtamination
26/11/2017,4740,Chemical_Gas_oil_leak_comtamination
27/11/2017,4504,Chemical_Gas_oil_leak_comtamination
29/11/2017,4161,Chemical_Gas_oil_leak_comtamination
29/11/2017,4006,Chemical_Gas_oil_leak_comtamination
1/12/2017,4077,Chemical_Gas_oil_leak_comtamination
1/12/2017,4078,Chemical_Gas_oil_leak_comtamination
1/12/2017,4210,Chemical_Gas_oil_leak_comtamination
1/12/2017,4226,Chemical_Gas_oil_leak_comtamination
2/12/2017,4677,Chemical_Gas_oil_leak_comtamination
2/12/2017,4627,Chemical_Gas_oil_leak_comtamination
2/12/2017,4051,Chemical_Gas_oil_leak_comtamination
2/12/2017,4895,Chemical_Gas_oil_leak_comtamination
3/12/2017,4405,Chemical_Gas_oil_leak_comtamination
4/12/2017,4361,Extreme_weather_natural_disaster
4/12/2017,4350,Chemical_Gas_oil_leak_comtamination
4/12/2017,4173,Chemical_Gas_oil_leak_comtamination
4/12/2017,4110,Extreme_weather_natural_disaster
4/12/2017,4017,Chemical_Gas_oil_leak_comtamination
4/12/2017,4508,Chemical_Gas_oil_leak_comtamination
4/12/2017,4216,Chemical_Gas_oil_leak_comtamination
5/12/2017,4556,Hurricane
5/12/2017,4559,Extreme_weather_natural_disaster
5/12/2017,4129,Chemical_Gas_oil_leak_comtamination
6/12/2017,4740,Chemical_Gas_oil_leak_comtamination
6/12/2017,4012,Chemical_Gas_oil_leak_comtamination
6/12/2017,4209,Chemical_Gas_oil_leak_comtamination
7/12/2017,4172,Chemical_Gas_oil_leak_comtamination
7/12/2017,4506,Chemical_Gas_oil_leak_comtamination
7/12/2017,4305,Chemical_Gas_oil_leak_comtamination
8/12/2017,4605,Extreme_weather_natural_disaster
8/12/2017,4011,Chemical_Gas_oil_leak_comtamination
8/12/2017,4223,Chemical_Gas_oil_leak_comtamination
8/12/2017,4870,Chemical_Gas_oil_leak_comtamination
9/12/2017,4703,Chemical_Gas_oil_leak_comtamination
9/12/2017,4550,Extreme_weather_natural_disaster
9/12/2017,4550,Extreme_weather_natural_disaster
9/12/2017,4519,Extreme_weather_natural_disaster
9/12/2017,4550,Extreme_weather_natural_disaster
9/12/2017,4556,Extreme_weather_natural_disaster
9/12/2017,4551,Extreme_weather_natural_disaster
9/12/2017,4556,Extreme_weather_natural_disaster
9/12/2017,4520,Extreme_weather_natural_disaster
9/12/2017,4550,Extreme_weather_natural_disaster
9/12/2017,4550,Extreme_weather_natural_disaster
9/12/2017,4520,Extreme_weather_natural_disaster
9/12/2017,4311,Extreme_weather_natural_disaster
10/12/2017,4455,Chemical_Gas_oil_leak_comtamination
10/12/2017,4059,Chemical_Gas_oil_leak_comtamination
10/12/2017,4519,Extreme_weather_natural_disaster
10/12/2017,4519,Extreme_weather_natural_disaster
10/12/2017,4556,Extreme_weather_natural_disaster
11/12/2017,4700,Chemical_Gas_oil_leak_comtamination
11/12/2017,4009,Chemical_Gas_oil_leak_comtamination
12/12/2017,4034,Chemical_Gas_oil_leak_comtamination
12/12/2017,4114,Chemical_Gas_oil_leak_comtamination
12/12/2017,4352,Chemical_Gas_oil_leak_comtamination
12/12/2017,4877,Chemical_Gas_oil_leak_comtamination
13/12/2017,4700,Chemical_Gas_oil_leak_comtamination
14/12/2017,4006,Chemical_Gas_oil_leak_comtamination
14/12/2017,4127,Chemical_Gas_oil_leak_comtamination
15/12/2017,4509,Chemical_Gas_oil_leak_comtamination
16/12/2017,4600,Chemical_Gas_oil_leak_comtamination
16/12/2017,4108,Chemical_Gas_oil_leak_comtamination
16/12/2017,4550,Extreme_weather_natural_disaster
17/12/2017,4553,Extreme_weather_natural_disaster
18/12/2017,4680,Chemical_Gas_oil_leak_comtamination
18/12/2017,4557,Chemical_Gas_oil_leak_comtamination
18/12/2017,4285,Chemical_Gas_oil_leak_comtamination
19/12/2017,4655,Chemical_Gas_oil_leak_comtamination
19/12/2017,4650,Chemical_Gas_oil_leak_comtamination
19/12/2017,4650,Chemical_Gas_oil_leak_comtamination
21/12/2017,4170,Chemical_Gas_oil_leak_comtamination
21/12/2017,4034,Chemical_Gas_oil_leak_comtamination
23/12/2017,4068,Chemical_Gas_oil_leak_comtamination
24/12/2017,4163,Chemical_Gas_oil_leak_comtamination
24/12/2017,4017,Chemical_Gas_oil_leak_comtamination
25/12/2017,4380,Extreme_weather_natural_disaster
25/12/2017,4380,Hurricane
25/12/2017,4518,Extreme_weather_natural_disaster
25/12/2017,4518,Extreme_weather_natural_disaster
25/12/2017,4550,Extreme_weather_natural_disaster
25/12/2017,4070,Chemical_Gas_oil_leak_comtamination
25/12/2017,4070,Extreme_weather_natural_disaster
25/12/2017,4221,Extreme_weather_natural_disaster
25/12/2017,4275,Hurricane
25/12/2017,4227,Extreme_weather_natural_disaster
25/12/2017,4310,Hurricane
25/12/2017,4303,Chemical_Gas_oil_leak_comtamination
26/12/2017,4350,Extreme_weather_natural_disaster
26/12/2017,4610,Extreme_weather_natural_disaster
26/12/2017,4610,Extreme_weather_natural_disaster
26/12/2017,4610,Extreme_weather_natural_disaster
26/12/2017,4365,Extreme_weather_natural_disaster
26/12/2017,4610,Extreme_weather_natural_disaster
26/12/2017,4610,Extreme_weather_natural_disaster
26/12/2017,4611,Extreme_weather_natural_disaster
27/12/2017,4815,Chemical_Gas_oil_leak_comtamination
27/12/2017,4660,Chemical_Gas_oil_leak_comtamination
27/12/2017,4610,Extreme_weather_natural_disaster
30/12/2017,4216,Chemical_Gas_oil_leak_comtamination
31/12/2017,4565,Chemical_Gas_oil_leak_comtamination
31/12/2017,4102,Chemical_Gas_oil_leak_comtamination
31/12/2017,4156,Chemical_Gas_oil_leak_comtamination
31/12/2017,4285,Extreme_weather_natural_disaster
31/12/2017,4128,Chemical_Gas_oil_leak_comtamination
