"","SED_NAME_2018","SED_CODE_2018","SED_JK_June","SED_JK_May","SED_JK_April"
"1","Sydney",10080,16538.0910933,16435.4943605,15842.7153645
"2","Newtown",10059,4851.4419124,4827.7997895,4650.5065665
"3","Balmain",10004,4740.2326285,4667.9617027,4446.5756158
"4","Heffron",10035,5624.2594976,5572.5728353,5399.2044171
"5","Maroubra",10051,3786.361892,3750.8597616,3551.3533704
"6","Vaucluse",10086,5588.303534,5554.5872996,5348.6592196
"7","Coogee",10021,4754.5533403,4708.4752349,4531.7343877
"8","Summer Hill",10078,3556.9208713,3548.2808999,3394.006367
"9","Drummoyne",10025,3940.269046,3912.2613392,3714.7206919
"10","North Shore",10060,5578.0304482,5511.54077,5231.2461772
"11","Willoughby",10090,5284.3409962,5230.1357423,5020.1108123
"12","Lane Cove",10044,4358.021681,4331.1561837,4132.4082326
"13","Davidson",10024,3727.2224915,3695.3090857,3516.0737151
"14","Ku-ring-gai",10041,3332.2377547,3331.4636149,3173.6567724
"15","Hornsby",10037,3375.6724528,3354.4483337,3163.6790552
"16","Gosford",10030,2768.1578525,2746.2467977,2587.4111833
"17","Pittwater",10067,5018.3329659,4942.4810308,4660.1936599
"18","Wakehurst",10088,4653.3610647,4583.0933153,4318.9617539
"19","Manly",10050,4575.8708776,4539.8903755,4282.119321
"20","Ryde",10073,4026.4612328,3990.717853,3830.4480334
"21","Parramatta",10065,5152.852752,5078.1478071,4858.8117872
"22","Baulkham Hills",10008,3959.7327192,3904.781256,3702.8692271
"23","Epping",10028,3200.4419861,3160.9907732,3031.4608893
"24","Auburn",10002,5588.3113515,5471.5440219,5275.8413501
"25","Strathfield",10077,4701.4412209,4639.9730769,4481.1367414
"26","Granville",10032,3953.999436,3877.6392454,3754.5370777
"27","Bankstown",10005,3965.8139661,3888.8104956,3739.3421029
"28","Seven Hills",10074,3242.0360085,3188.850169,3045.0361432
"29","Prospect",10070,3373.4650631,3311.6231491,3180.3552129
"30","Blacktown",10010,2885.3767264,2850.2532206,2738.0313034
"31","Castle Hill",10016,3831.4297373,3779.8104893,3579.4554783
"32","Riverstone",10071,3242.720005,3204.7869812,3046.4189704
"33","Hawkesbury",10033,3440.2468737,3356.1665153,3129.8502075
"34","Fairfield",10029,3345.0477968,3251.8528345,3155.4888777
"35","Mulgoa",10055,2641.9926248,2562.1673242,2427.4540506
"36","Cabramatta",10012,2626.1574581,2573.5837391,2503.6709886
"37","Macquarie Fields",10048,3042.1663721,2995.4660561,2854.7708462
"38","Liverpool",10046,2829.4282138,2762.604356,2685.113426
"39","Holsworthy",10036,3115.8490284,3050.8927793,2957.1893947
"40","Camden",10013,3989.3929693,3897.7238109,3653.6980779
"41","Lakemba",10043,4885.9122931,4779.7499961,4676.0087877
"42","Canterbury",10015,4141.3746813,4063.4209335,3974.4973989
"43","East Hills",10027,3358.1442649,3321.8870526,3186.7341695
"44","Rockdale",10072,3821.0875844,3768.1050818,3635.9492132
"45","Kogarah",10040,3954.5280278,3888.8346294,3747.3711981
"46","Oatley",10062,2968.6761038,2943.8988372,2789.7301267
"47","Miranda",10052,3259.7200321,3209.3850471,3049.6302549
"48","Cronulla",10023,4216.1497613,4151.5314753,3934.7014171
"49","Heathcote",10034,2816.2123372,2759.0981418,2589.1080808
"50","Terrigal",10082,3259.8496975,3222.2662048,3031.6283604
"51","Cessnock",10017,1841.2953177,1821.170537,1735.7478576
"52","The Entrance",10083,2587.1212633,2560.2470726,2396.1706997
"53","Wyong",10093,2211.2485503,2180.5500089,2070.7498018
"54","Swansea",10079,2046.9259429,2015.7547597,1929.9034468
"55","Lake Macquarie",10042,2156.2496112,2102.9361043,2001.2757807
"56","Charlestown",10018,2580.9803815,2552.0530325,2388.7229321
"57","Wallsend",10089,1961.7207291,1938.4188489,1839.6703434
"58","Newcastle",10058,3722.063009,3688.9703539,3498.9864533
"59","Upper Hunter",10085,2221.8282493,2166.0480629,2040.4405973
"60","Myall Lakes",10057,2012.1401395,1960.4337831,1827.5261307
"61","Port Stephens",10069,2243.2867055,2214.1597624,2099.1983085
"62","Maitland",10049,2341.8358718,2320.6524855,2209.494371
"63","Barwon",10006,2981.1841304,2874.1658543,2674.3036426
"64","Tamworth",10081,2859.6815638,2772.6811024,2583.3137515
"65","Northern Tablelands",10061,3333.3732145,3223.0106178,2991.3645962
"66","Clarence",10019,2042.5566512,2010.2451772,1890.5326754
"67","Lismore",10045,2942.0800899,2879.3533271,2686.3189839
"68","Warrego",30090,1807.3991277,1739.5963229,1556.8983844
"69","Southern Downs",30077,2061.6832729,2016.4302744,1825.5914406
"70","Port Macquarie",10068,2696.3766093,2658.2725733,2556.0245509
"71","Oxley",10064,2303.9717379,2254.866091,2131.9926589
"72","Coffs Harbour",10020,2888.1500817,2833.9472742,2673.1901408
"73","Ballina",10003,5339.8891626,5286.1928816,4979.4040608
"74","Tweed",10084,3339.862899,3277.481117,3120.8110134
"75","Keira",10038,2718.2308344,2701.3607339,2577.5009484
"76","Wollongong",10092,2698.0677341,2670.1074642,2546.4991786
"77","Shellharbour",10075,1854.3587846,1841.5722585,1733.5341519
"78","Kiama",10039,2573.985606,2534.074407,2400.8629758
"79","Goulburn",10031,2844.8153182,2770.4677159,2561.1897747
"80","Bega",10009,2793.6143778,2767.9957731,2617.8200525
"81","South Coast",10076,2425.7157577,2377.7524239,2248.0227475
"82","Unclassified (OT)",99191,241.19916,239.981785,229.39922
"83","Campbelltown",10014,1873.6402666,1850.1305681,1778.7270945
"84","Wollondilly",10091,3174.3357891,3121.857249,2899.7949284
"85","Bathurst",10007,2172.5150382,2103.5789489,1979.968818
"86","Monaro",10053,2687.6008229,2611.0926513,2433.5278775
"87","Cootamundra",10022,2819.441831,2725.479026,2454.0332608
"88","Kurrajong",80003,3380.576555,3379.949544,3250.8614955
"89","Murrumbidgee",80004,1767.6997836,1720.7021935,1666.7326439
"90","Wagga Wagga",10087,2672.5722392,2598.4097579,2354.0396095
"91","Brindabella",80001,1145.9066038,1129.7557839,1097.4826899
"92","Ginninderra",80002,1309.3274702,1300.6431946,1245.326852
"93","Yerrabi",80005,2208.9875316,2160.8846794,2072.0045468
"94","Albury",10001,2952.1844228,2832.882107,2621.7234736
"95","Murray",10056,3107.0214789,2962.2295306,2701.0794548
"96","Penrith",10066,2634.9986725,2586.2027495,2441.1005643
"97","Londonderry",10047,2213.0212046,2162.4377919,2068.9856016
"98","Blue Mountains",10011,2583.2933218,2571.6822166,2434.7433743
"99","Mount Druitt",10054,1906.2919044,1875.9645352,1798.2096872
"100","Orange",10063,2816.9339151,2745.6354125,2576.5869069
"101","Dubbo",10026,3012.0306477,2939.785398,2757.5340909
"102","Melbourne (Northern Metropolitan)",24703,11879.5345119,11697.0155442,11204.2715762
"103","Albert Park (Southern Metropolitan)",20106,6475.6993758,6393.7439064,6121.2468457
"104","Prahran (Southern Metropolitan)",26806,5630.7546634,5553.7527873,5314.1883302
"105","Footscray (Western Metropolitan)",23007,3727.2044543,3611.0850781,3464.3627221
"106","Williamstown (Western Metropolitan)",28607,3376.7370214,3283.5132733,3110.3266385
"107","Altona (Western Metropolitan)",20207,2954.7089888,2890.8868,2779.331328
"108","St Albans (Western Metropolitan)",27807,2510.0952855,2408.5255796,2317.169881
"109","Kororoit (Western Metropolitan)",24207,2822.3724849,2712.7480995,2610.6828785
"110","Sydenham (Western Metropolitan)",28007,2398.2492535,2358.7491085,2247.9759215
"111","Werribee (Western Metropolitan)",28507,2250.7116186,2217.57539,2123.5993384
"112","Tarneit (Western Metropolitan)",28107,4773.2211811,4650.2291384,4501.6553317
"113","Essendon (Western Metropolitan)",22607,3141.1571195,3063.0763242,2922.2331066
"114","Niddrie (Western Metropolitan)",26207,2572.7074268,2498.1332452,2350.9513073
"115","Sunbury (Western Metropolitan)",27907,2480.9764701,2396.058396,2225.80717
"116","Pascoe Vale (Northern Metropolitan)",26603,3052.959048,2936.1093036,2818.4912958
"117","Brunswick (Northern Metropolitan)",21303,3692.3592876,3597.1009743,3457.7591397
"118","Broadmeadows (Northern Metropolitan)",21203,3815.5355572,3694.165086,3524.6136793
"119","Yuroke (Northern Metropolitan)",28803,3769.7315093,3626.3844093,3461.8130519
"120","Preston (Northern Metropolitan)",26903,2672.4896046,2580.193182,2472.0590514
"121","Yan Yean (Northern Victoria)",28704,2829.6728571,2732.6571239,2572.823677
"122","Richmond (Northern Metropolitan)",27003,6421.4199872,6308.9156224,6049.346272
"123","Northcote (Northern Metropolitan)",26303,3312.7124411,3228.6493808,3055.0422207
"124","Thomastown (Northern Metropolitan)",28203,3100.2332319,3001.3774288,2823.8656047
"125","Mill Park (Northern Metropolitan)",25003,2446.795162,2366.0339619,2228.1175107
"126","Ivanhoe (Eastern Metropolitan)",23901,2761.6190294,2713.5256671,2543.7700553
"127","Bundoora (Northern Metropolitan)",21503,2039.7361992,1979.6394436,1876.2132088
"128","Eltham (Eastern Metropolitan)",22501,2520.2513078,2452.1783475,2300.2388517
"129","Eildon (Northern Victoria)",22404,2781.9412959,2719.7331873,2540.9666271
"130","Kew (Southern Metropolitan)",24006,3395.1577894,3306.1135101,3167.6870251
"131","Box Hill (Eastern Metropolitan)",21001,3250.4038654,3181.0765345,3038.0798853
"132","Bulleen (Eastern Metropolitan)",21401,2884.6023936,2801.164784,2669.1660112
"133","Warrandyte (Eastern Metropolitan)",28301,2837.0458156,2752.8980322,2613.7381432
"134","Ringwood (Eastern Metropolitan)",27101,2728.4368905,2642.5331426,2501.2558881
"135","Croydon (Eastern Metropolitan)",22201,2151.8179546,2069.0410275,1930.5316301
"136","Evelyn (Eastern Victoria)",22802,2328.4598452,2233.190266,2071.3398777
"137","Hawthorn (Southern Metropolitan)",23806,3589.4094017,3526.8870455,3362.4735658
"138","Burwood (Southern Metropolitan)",21706,3049.5348979,2997.2061034,2866.6362945
"139","Forest Hill (Eastern Metropolitan)",23101,2450.4180314,2396.9444473,2248.7152994
"140","Bayswater (Eastern Metropolitan)",20401,2758.2287787,2658.3683326,2471.8401202
"141","Monbulk (Eastern Victoria)",25102,2359.0022879,2262.5838859,2109.4791144
"142","Gembrook (Eastern Victoria)",23402,2625.3006493,2534.0612022,2364.3277644
"143","Malvern (Southern Metropolitan)",24606,3269.859093,3229.4285761,3090.3058982
"144","Caulfield (Southern Metropolitan)",21906,3779.7370805,3726.6504328,3590.7264432
"145","Oakleigh (Southern Metropolitan)",26406,3159.5510375,3085.6268651,2928.8852046
"146","Mount Waverley (Eastern Metropolitan)",25501,2804.7279903,2741.8714112,2590.8094634
"147","Mulgrave (South-Eastern Metropolitan)",25605,2693.3394494,2634.27848,2510.2939822
"148","Ferntree Gully (Eastern Metropolitan)",22901,2224.6441749,2168.5460185,2040.7324395
"149","Rowville (South-Eastern Metropolitan)",27305,2233.8770413,2180.5315988,2051.6572684
"150","Bentleigh (Southern Metropolitan)",20906,3408.2126881,3320.698774,3158.0865712
"151","Clarinda (South-Eastern Metropolitan)",22005,3542.4124858,3455.6839133,3270.2412196
"152","Keysborough (South-Eastern Metropolitan)",24105,2568.544994,2479.2642735,2361.0975366
"153","Dandenong (South-Eastern Metropolitan)",22305,4282.2831882,4111.0788379,3890.1636799
"154","Mordialloc (South-Eastern Metropolitan)",25205,3002.8010502,2932.1660558,2749.1717921
"155","Carrum (South-Eastern Metropolitan)",21805,2736.4189916,2654.5055669,2497.9052457
"156","Brighton (Southern Metropolitan)",21106,3486.3672278,3398.1078154,3259.2226516
"157","Sandringham (Southern Metropolitan)",27406,3045.4781264,2963.1879153,2775.3088327
"158","Frankston (South-Eastern Metropolitan)",23205,2118.0626043,2028.4220387,1902.8244765
"159","Lara (Western Victoria)",24308,1582.4054311,1527.048783,1430.2161475
"160","Buninyong (Western Victoria)",21608,2042.32932,1975.5851931,1845.9706542
"161","Polwarth (Western Victoria)",26708,2149.0336804,2100.9340511,1958.5746619
"162","Geelong (Western Victoria)",23308,3064.4007068,2982.3430511,2760.8009154
"163","South Barwon (Western Victoria)",27608,2850.1493606,2791.9542369,2613.2259415
"164","Bellarine (Western Victoria)",20508,2382.9789307,2305.0998902,2143.5426685
"165","South-West Coast (Western Victoria)",27708,1884.7007081,1827.6434901,1695.8076334
"166","Lowan (Western Victoria)",24408,1369.3157467,1298.1998689,1209.8384741
"167","Macedon (Northern Victoria)",24504,2655.7171838,2582.5145849,2405.5137785
"168","Melton (Western Victoria)",24808,2170.7927496,2089.0316267,1954.5113366
"169","Ripon (Western Victoria)",27208,1797.4825852,1722.4627055,1585.49762
"170","Wendouree (Western Victoria)",28408,2021.4582427,1978.6593403,1855.8095156
"171","Bendigo West (Northern Victoria)",20804,1886.4897137,1839.352668,1726.6651357
"172","Mildura (Northern Victoria)",24904,1966.2516243,1888.7596103,1756.2431119
"173","Euroa (Northern Victoria)",22704,1892.7729554,1842.3771564,1710.5552513
"174","Bendigo East (Northern Victoria)",20704,1910.1138563,1882.3674079,1739.6719113
"175","Murray Plains (Northern Victoria)",25704,2248.3868187,2148.3496273,1960.9491711
"176","Shepparton (Northern Victoria)",27504,2289.8563798,2218.0184557,2032.917743
"177","Ovens Valley (Northern Victoria)",26504,2291.716498,2217.478527,2075.0359723
"178","Benambra (Northern Victoria)",20604,2081.2025332,2005.3725312,1857.5712413
"179","Narre Warren North (South-Eastern Metropolitan)",25905,2819.6302662,2725.939029,2557.4762364
"180","Narre Warren South (South-Eastern Metropolitan)",26005,2608.8087399,2523.8768213,2414.3165164
"181","Bass (Eastern Victoria)",20302,2832.7950548,2761.3542685,2562.3457323
"182","Narracan (Eastern Victoria)",25802,2194.3244274,2113.9586712,1928.8415758
"183","Morwell (Eastern Victoria)",25402,1414.3041307,1362.0660839,1284.9168059
"184","Gippsland South (Eastern Victoria)",23602,1703.3029489,1650.130648,1529.5871405
"185","Gippsland East (Eastern Victoria)",23502,1890.4748556,1868.5554898,1735.6819354
"186","Hastings (Eastern Victoria)",23702,2409.3030727,2292.6218784,2143.8176766
"187","Mornington (Eastern Victoria)",25302,3221.5361564,3136.2924328,2954.1611532
"188","Nepean (Eastern Victoria)",26102,2961.8005392,2880.1466082,2690.7970315
"189","Cranbourne (South-Eastern Metropolitan)",22105,3576.7316187,3465.0212554,3307.238359
"190","McConnel",30052,6170.6246752,6107.9078216,5843.752767
"191","Clayfield",30019,2804.6021436,2782.9177043,2643.418286
"192","Stafford",30080,1860.0154436,1847.1259769,1740.547616
"193","Nudgee",30067,2025.7811492,2024.0382721,1927.3368181
"194","Sandgate",30074,1297.1956259,1282.1956259,1239.9639561
"195","Redcliffe",30071,1517.8280365,1498.0224529,1402.2029103
"196","Murrumba",30062,1254.7883181,1245.5098008,1181.4063015
"197","Bancroft",30003,1348.2183717,1312.8319706,1270.2620971
"198","Aspley",30002,1631.7976953,1630.0425589,1532.4692304
"199","Everton",30025,1659.6850001,1646.950045,1546.7053956
"200","Cooper",30023,2561.9713209,2561.3923474,2434.2672921
"201","Ferny Grove",30026,1405.2263925,1400.444077,1339.4649638
"202","Maiwar",30048,2122.8425753,2110.4106816,2007.7883637
"203","Moggill",30056,1770.6017674,1760.379999,1673.8997662
"204","Miller",30054,1796.0143035,1772.2022427,1694.2584429
"205","Mount Ommaney",30058,1919.3553056,1887.7053,1790.4178024
"206","Inala",30036,1595.955712,1574.2148753,1515.9814433
"207","Algester",30001,2069.9895101,2054.6038241,1991.1957987
"208","South Brisbane",30076,2840.047114,2827.7644463,2688.7704667
"209","Greenslopes",30030,2092.289133,2067.5828946,1968.7572377
"210","Toohey",30085,3003.1147362,2981.0958029,2853.1683126
"211","Stretton",30081,2458.6200857,2445.7392543,2372.9460138
"212","Woodridge",30093,1538.30516,1510.2209238,1426.9363681
"213","Waterford",30091,2275.945747,2225.0466087,2121.5096955
"214","Logan",30044,1563.3742644,1529.2252109,1425.5911669
"215","Mansfield",30049,1941.1653811,1911.7717931,1824.8624105
"216","Springwood",30079,2002.5928079,1954.217819,1855.4899729
"217","Jordan",30039,1511.9099196,1499.5718509,1410.0243663
"218","Macalister",30046,1955.6330424,1904.9705397,1805.892075
"219","Bulimba",30008,2490.8633244,2466.911735,2329.4172852
"220","Chatsworth",30018,1768.8383104,1771.0814075,1669.5974112
"221","Redlands",30072,1409.6333118,1373.1020678,1299.9963736
"222","Capalaba",30017,1704.0443853,1695.5780777,1606.682589
"223","Oodgeroo",30068,1614.1577934,1604.969794,1529.8756941
"224","Lytton",30045,1781.9210291,1776.5938948,1664.5259075
"225","Coomera",30022,2256.117714,2205.69538,2084.3813825
"226","Theodore",30083,2505.3154762,2465.78378,2347.191557
"227","Gaven",30027,2154.5288241,2109.8721648,1993.9555069
"228","Surfers Paradise",30082,3714.1043608,3686.2575499,3539.4908215
"229","Scenic Rim",30075,1839.6296047,1779.2069666,1656.0232094
"230","Mudgeeraba",30059,2799.5931054,2758.003578,2601.5641134
"231","Broadwater",30006,2298.223581,2261.1304564,2165.1057078
"232","Bonney",30005,2799.1391939,2763.2883099,2639.4966281
"233","Southport",30078,3113.2455512,3077.2222803,2943.781451
"234","Mermaid Beach",30053,3248.1908371,3230.6278827,3076.4804624
"235","Burleigh",30012,3135.1076492,3098.6837025,2937.5512597
"236","Currumbin",30024,2756.2271669,2721.1615907,2581.9104758
"237","Bundamba",30010,1121.029227,1113.7987452,1076.738581
"238","Ipswich",30037,908.8821378,891.4208056,837.9014691
"239","Ipswich West",30038,1104.1227895,1075.322912,1001.4971965
"240","Nanango",30063,1367.4427882,1314.2142853,1214.3326142
"241","Lockyer",30043,1291.4411881,1259.418658,1174.3541758
"242","Condamine",30020,1634.6025486,1571.6501529,1462.8391042
"243","Toowoomba North",30086,1559.3638437,1523.7528111,1419.8934702
"244","Toowoomba South",30087,1670.2867491,1636.7488953,1525.4641986
"245","Callide",30015,1350.3008735,1292.0688209,1153.8672664
"246","Gregory",30031,1056.3541028,1017.764763,923.6349534
"247","Kurwongbah",30042,1370.2457061,1347.6422593,1259.8698817
"248","Pine Rivers",30069,2047.5761551,2012.6198987,1884.3736467
"249","Morayfield",30057,1156.9342395,1138.8832663,1064.5933239
"250","Glass House",30029,1743.4121209,1716.1399535,1613.1153009
"251","Pumicestone",30070,1060.6748449,1044.4615642,992.1486219
"252","Caloundra",30016,1833.2268134,1820.4230138,1720.0628668
"253","Kawana",30040,2418.2903233,2403.8456534,2283.7624063
"254","Buderim",30007,2472.7602869,2447.0107301,2303.1271894
"255","Nicklin",30064,1967.8875621,1932.0883868,1828.9454515
"256","Ninderry",30065,2740.3864745,2698.3639725,2557.5881132
"257","Maroochydore",30050,2890.3460412,2852.6094263,2699.1606265
"258","Noosa",30066,3214.7398375,3185.1656791,3049.9025043
"259","Gympie",30032,1481.5752013,1439.9342762,1352.1840633
"260","Maryborough",30051,931.7075385,917.4047102,864.1373239
"261","Hervey Bay",30033,1240.5624255,1233.2696875,1156.237068
"262","Burnett",30013,1085.2356717,1073.0368649,1009.4031405
"263","Bundaberg",30009,1067.9538786,1057.5378052,999.9430464
"264","Gladstone",30028,886.6725824,882.1401792,841.283744
"265","Mirani",30055,971.0834862,947.2985774,873.1043083
"266","Rockhampton",30073,1323.8770449,1303.8065293,1216.678801
"267","Keppel",30041,1152.2469905,1133.3552757,1061.8353808
"268","Burdekin",30011,1062.2723491,1017.6661318,927.1507382
"269","Mackay",30047,1265.0367512,1230.631986,1164.468976
"270","Whitsunday",30092,1818.484393,1786.8909931,1709.3512047
"271","Traeger",30089,700.9378255,698.8465002,647.1192012
"272","Townsville",30088,1790.6040689,1794.869543,1735.2328575
"273","Mundingburra",30061,1178.8938069,1179.6128771,1125.5697517
"274","Thuringowa",30084,828.1794275,833.5787678,787.3805773
"275","Hinchinbrook",30035,1250.96262,1162.6852226,1075.3882653
"276","Barkly",70004,6.1847307,6.2809911,5.9681448
"277","Hill",30034,1834.0993807,1816.9445307,1697.2672054
"278","Mulgrave",30060,1334.9575348,1321.2735892,1228.2411912
"279","Cairns",30014,3077.101281,3057.0157635,2933.2889757
"280","Barron River",30004,2363.898719,2357.9842365,2275.7110243
"281","Cook",30021,1624.1899181,1614.6527829,1554.9300923
"282","Adelaide",40001,4559.3099315,4500.6895383,4318.5570034
"283","Croydon",40008,1433.789854,1406.2230712,1341.883938
"284","West Torrens",40046,1722.2168804,1695.3119006,1589.0043309
"285","Cheltenham",40006,1302.6809091,1257.5875214,1160.3796365
"286","Port Adelaide",40037,1197.3652632,1176.923572,1071.5520067
"287","Lee",40027,1022.2316367,1003.5854985,955.9574002
"288","Colton",40007,1286.5556012,1259.8942877,1187.896305
"289","Badcoe",40002,1473.0576133,1446.5080119,1374.6656413
"290","Unley",40044,2206.7472675,2195.3548893,2091.3429703
"291","Morphett",40032,1233.7197045,1213.7793855,1135.8620263
"292","Elder",40011,1216.8349369,1203.593262,1151.0293394
"293","Davenport",40009,832.9670448,815.1407624,775.2672293
"294","Gibson",40018,1036.1703212,1030.6710626,967.8911755
"295","Black",40003,1060.9101644,1044.9290957,967.5376207
"296","Waite",40045,1185.3078636,1181.3621553,1118.7769188
"297","Bragg",40004,1636.8213601,1615.6511976,1525.3546912
"298","Dunstan",40010,2384.0536266,2318.1247478,2171.1551087
"299","Hartley",40021,1215.6828407,1176.0954577,1082.3942067
"300","Morialta",40031,1123.3163698,1087.0107651,1015.6205711
"301","Torrens",40043,1222.426639,1187.2619319,1112.7001895
"302","Enfield",40013,1333.5805999,1321.6890525,1242.281641
"303","Florey",40016,921.0468186,907.8574001,867.3883522
"304","Newland",40035,845.3131317,819.7957248,767.4740627
"305","Wright",40047,818.0291428,801.8004572,749.6860828
"306","Playford",40036,1098.5967623,1087.2278514,1016.3841135
"307","Ramsay",40038,646.8320516,626.182508,583.0725124
"308","Taylor",40042,853.7245818,806.8029347,742.4082039
"309","King",40026,733.3361027,723.051753,677.6178844
"310","Elizabeth",40012,520.6190905,513.0461299,491.0207394
"311","Light",40028,740.7483944,728.4489949,685.4804445
"312","Schubert",40040,1232.2061354,1222.6293197,1140.7132513
"313","Kavel",40025,1237.2736734,1201.1679061,1101.861895
"314","Heysen",40022,1307.6760548,1278.7910714,1196.2332707
"315","Hurtle Vale",40023,701.8944528,686.0627901,648.3024979
"316","Reynell",40039,911.6227994,891.9396971,833.962425
"317","Kaurna",40024,821.282831,808.8376963,749.1657591
"318","Mawson",40030,1444.7300164,1411.9122216,1304.1981879
"319","Finniss",40014,942.6909651,931.0524793,876.9657893
"320","Hammond",40020,772.0074145,750.123409,690.5939099
"321","Chaffey",40005,882.1710003,846.1454269,797.2619447
"322","Mackillop",40029,892.8963022,855.1808792,787.3982309
"323","Mount Gambier",40033,826.3781506,804.5856314,750.4341614
"324","Stuart (SA)",40041,885.6695404,839.7057452,749.2684308
"325","Frome",40017,841.7467007,825.5274298,733.1632058
"326","Giles",40019,528.0565402,520.1170622,493.394613
"327","Narungga",40034,937.6684179,895.4660231,805.3149761
"328","Flinders",40015,1444.0363835,1393.1541909,1258.1250154
"329","Perth (North Metropolitan)",54304,5172.1673017,5131.222212,4866.2605978
"330","Mount Lawley (East Metropolitan)",53902,1547.4186587,1551.0779018,1479.7371204
"331","Nedlands (North Metropolitan)",54104,2756.711015,2729.755879,2621.688427
"332","Churchlands (North Metropolitan)",51504,1825.3655309,1814.6653186,1732.1544886
"333","Cottesloe (North Metropolitan)",51804,1947.231799,1949.0961534,1860.8270226
"334","Scarborough (North Metropolitan)",54804,1519.2171958,1511.0413069,1441.7443214
"335","Balcatta (North Metropolitan)",50304,2795.9509836,2763.5953654,2623.5159346
"336","Carine (North Metropolitan)",51304,1417.2848037,1416.8980429,1351.4271501
"337","Hillarys (North Metropolitan)",52504,1347.9605756,1329.2596499,1278.7849248
"338","Kingsley (North Metropolitan)",53104,1063,1047,987
"339","Joondalup (North Metropolitan)",52704,1542.5124098,1535.5448491,1455.4713626
"340","Burns Beach (North Metropolitan)",51004,1460.0883599,1439.7723558,1372.2030302
"341","Butler (North Metropolitan)",51104,1426.3742872,1412.6992294,1360.9131864
"342","West Swan (East Metropolitan)",55802,2195.9302921,2159.7808146,1999.8960578
"343","Wanneroo (North Metropolitan)",55504,1777.3376705,1747.143364,1650.7046983
"344","Moore (Agricultural)",53701,1400.5992625,1354.1566073,1262.2825814
"345","Maylands (East Metropolitan)",53402,1581.0958299,1576.1578274,1484.5785662
"346","Bassendean (East Metropolitan)",50502,1200.7272464,1187.5142002,1138.8133436
"347","Midland (East Metropolitan)",53502,1340.1655463,1306.2560788,1216.3635715
"348","Belmont (East Metropolitan)",50702,1627.3342631,1597.5339745,1518.48056
"349","Forrestfield (East Metropolitan)",52102,1024.0206409,1014.0358554,968.8568948
"350","Kalamunda (East Metropolitan)",52802,1210.8637684,1205.5050337,1115.2036649
"351","Mirrabooka (East Metropolitan)",53602,1330.0221358,1321.9925933,1280.5979394
"352","Morley (East Metropolitan)",53802,1346.0302224,1328.4811464,1281.513656
"353","Girrawheen (North Metropolitan)",52404,1602.6996312,1570.4908773,1482.9349824
"354","Swan Hills (East Metropolitan)",55102,1276.1391512,1260.9687218,1204.6558471
"355","Darling Range (East Metropolitan)",51902,1217.185997,1182.832034,1081.4247251
"356","Victoria Park (South Metropolitan)",55405,1788.8337636,1783.9444775,1704.078988
"357","Cannington (South Metropolitan)",51205,1771.1939658,1743.6934246,1649.4449965
"358","South Perth (South Metropolitan)",54905,1614.9546768,1605.9556563,1525.9612136
"359","Thornlie (East Metropolitan)",55202,1287.8449656,1275.1769909,1205.7484873
"360","Southern River (South Metropolitan)",55005,1384.9866522,1375.7399514,1301.2532534
"361","Armadale (East Metropolitan)",50202,1043.7296574,1026.645495,970.230204
"362","Jandakot (South Metropolitan)",52605,1412.632557,1400.0742168,1331.5113225
"363","Murray-Wellington (South West)",54006,784.185861,756.0089991,722.797295
"364","Riverton (South Metropolitan)",54505,1319.9154093,1310.8094262,1247.9443736
"365","Willagee (South Metropolitan)",55905,1392.7103118,1379.5365098,1316.2906357
"366","Bateman (South Metropolitan)",50605,1728.051905,1717.5395977,1639.7252497
"367","Bicton (South Metropolitan)",50805,1521.5100919,1518.7905315,1419.9010442
"368","Fremantle (South Metropolitan)",52205,2207.3563436,2195.710133,2086.7668617
"369","Cockburn (South Metropolitan)",51605,1463.9280989,1457.4864474,1376.3027265
"370","Kwinana (South Metropolitan)",53205,1092.1640908,1076.7008539,1021.224426
"371","Baldivis (South Metropolitan)",50405,976.9239643,971.9508694,926.3480832
"372","Rockingham (South Metropolitan)",54605,743.3606423,734.1150068,689.3150848
"373","Warnbro (South Metropolitan)",55605,881.5034709,858.419342,810.0944293
"374","Mandurah (South West)",53306,962.9845538,960.1724576,906.7993503
"375","Dawesville (South West)",52006,962.989341,965.9562874,917.7165202
"376","Roe (Agricultural)",54701,1697.9112428,1598.4822894,1369.1962593
"377","Warren-Blackwood (South West)",55706,2184.7602329,2140.0211827,1985.969247
"378","Collie-Preston (South West)",51706,847.1975976,839.2840182,776.8503167
"379","Bunbury (South West)",50906,1200.384602,1190.384908,1130.520184
"380","Vasse (South West)",55306,2195.093778,2164.9773167,2040.3764347
"381","Central Wheatbelt (Agricultural)",51401,1407.1313869,1339.026638,1170.6341969
"382","Albany (South West)",50106,1304.7769736,1257.0153792,1161.4020082
"383","Kalgoorlie (Mining and Pastoral)",52903,591.544502,609.544502,580.544502
"384","North West Central (Mining and Pastoral)",54203,488.8476565,491.5024346,461.4263083
"385","Geraldton (Agricultural)",52301,1186.1571615,1180.8573006,1121.5913758
"386","Pilbara (Mining and Pastoral)",54403,502,493,476
"387","Kimberley (Mining and Pastoral)",53003,914.9999932,907.9999928,874.9999932
"388","Clark (Hobart)",60303,2121.8093736,2113.0245087,2024.5691428
"389","Lyons (Derwent)",60501,353.928431,345.4577791,315.1708991
"390","Clark (Nelson)",60310,714.1430813,707.3007977,682.8301511
"391","Clark (Elwick)",60302,927.3065222,926.8885177,882.1007032
"392","Clark (Derwent)",60301,187.9258354,184.7142577,179.4251077
"393","Franklin (Pembroke)",60411,700.3157472,688.9460808,655.5970236
"394","Franklin (Rumney)",60414,667.0506012,652.2931729,623.0233965
"395","Lyons (Prosser)",60512,861.8816271,845.8919,800.331142
"396","Lyons (Rumney)",60514,225.7097116,220.657408,205.5613997
"397","Franklin (Huon)",60404,1080.3891008,1065.7691807,1018.6320211
"398","Franklin (Nelson)",60410,408.0411965,405.5272233,382.1747684
"399","Lyons (McIntyre)",60506,901.9117713,892.7126428,841.3908547
"400","Lyons (Launceston)",60505,314.982318,309.5950009,289.65881
"401","Bass (Windermere)",60115,985.8464608,970.8036171,920.3700645
"402","Bass (Rosevears)",60113,1125.3222608,1103.1198395,1032.0849636
"403","Bass (Launceston)",60105,754.0184797,731.7514129,681.4829422
"404","Bass (McIntyre)",60106,249.290274,234.3780483,216.3780483
"405","Braddon (Murchison)",60209,900.0642369,871.2485497,827.0707642
"406","Braddon (Mersey)",60207,931.1959578,934.7659012,875.995252
"407","Lyons (Montgomery)",60508,155.2724062,151.543662,142.8991819
"408","Braddon (Montgomery)",60208,747.5945673,746.6104613,717.253328
