SED_2018,Owned_outright,Owned_mortgage,Purchased_under_shared_equity_scheme,Rented,Occupied_rent-free,Occupied_life_tenure_scheme,Total_tenure
Ninderry,5743,6389,22,3805,127,49,16132
Buderim,5026,5811,41,4774,84,729,16469
Traeger,4936,3801,9,5509,727,24,15003
Nicklin,5365,5846,24,3884,129,184,15433
Kawana,5916,5424,24,5260,95,208,16934
Caloundra,6372,4921,10,5426,121,43,16889
Maroochydore,5946,4751,35,7636,126,173,18663
Noosa,7409,5592,31,4707,162,216,18115
Toowoomba South,6242,5661,33,7442,98,258,19736
Toowoomba North,5878,5775,12,6852,94,69,18677
Townsville,4392,5301,14,9480,161,50,19396
Mundingburra,4537,5551,10,6441,107,83,16732
Thuringowa,3826,6568,16,6407,75,206,17092
Bundaberg,6549,4850,12,6731,122,148,18408
Gympie,7742,5905,21,4853,233,44,18795
Hervey Bay,8509,4447,32,6391,136,279,19795
Maryborough,7910,5490,17,4546,170,58,18199
Migratory - Offshore - Shipping (Qld),0,0,0,0,0,0,0
Capalaba,5189,7749,29,4284,77,53,17376
Oodgeroo,5651,5367,19,4141,79,203,15446
Chatsworth,5463,6663,10,4157,90,40,16428
Redlands,5472,6267,29,3981,94,351,16199
Springwood,4723,8201,17,3725,78,100,16846
Pine Rivers,4792,8152,10,3772,91,37,16856
Murrumba,3891,6789,36,7488,53,256,18508
Redcliffe,6304,5550,37,7618,125,161,19795
Kurwongbah,3896,7840,17,4565,72,45,16432
Glass House,6020,6317,17,2412,219,46,15029
Morayfield,3727,5602,51,7622,61,84,17143
Bancroft,4056,6326,21,6702,56,120,17290
Pumicestone,7174,4671,22,5317,105,134,17423
Whitsunday,4820,6218,17,5335,214,28,16622
Mackay,5439,6388,14,7182,163,221,19406
Burdekin,6489,4419,8,7342,602,42,18900
Waterford,4155,6304,35,6829,93,67,17482
Woodridge,3348,6496,57,9526,112,29,19578
Logan,4109,6777,16,3296,88,81,14366
Macalister,4374,6579,26,7040,88,45,18149
Ipswich,4174,5416,14,6336,95,41,16080
Bundamba,3108,5656,32,8285,68,26,17181
Ipswich West,4459,5951,12,5533,99,28,16087
Lockyer,5278,6331,19,4179,177,32,16003
Inala,3875,6154,29,7212,108,153,17522
Southport,4929,5206,28,8474,154,150,18937
Coomera,2644,6746,8,7574,74,16,17070
Gaven,4020,7117,32,5034,74,170,16445
Scenic Rim,6034,6887,16,3637,272,38,16892
Theodore,3190,7722,26,5791,71,121,16919
Mudgeeraba,4612,7765,22,4855,123,47,17423
Broadwater,6620,5259,13,4925,133,90,17039
Bonney,4675,5122,31,9086,112,33,19049
Currumbin,5756,5700,14,4642,124,46,16282
Mermaid Beach,5304,5841,12,6984,128,31,18296
Burleigh,5630,5810,14,6302,137,31,17925
Surfers Paradise,6345,4706,22,8641,237,74,20022
Gladstone,3918,6465,14,6470,159,23,17050
Burnett,7964,5503,18,3613,267,123,17482
Keppel,6126,6284,8,5043,167,86,17715
Mirani,5824,6523,11,3145,398,14,15914
Gregory,4675,3505,7,5290,827,36,14345
Rockhampton,5248,6058,9,7004,212,100,18632
Condamine,5920,6935,10,3213,296,32,16411
Nanango,7954,5512,19,5018,416,42,18967
Southern Downs,7254,5123,25,5076,515,78,18066
Callide,6909,5056,16,5088,762,36,17862
Warrego,5604,4289,19,4690,767,26,15394
Cook,5012,3315,16,7906,617,25,16891
Hinchinbrook,5437,6414,16,4762,222,19,16870
Hill,9010,5244,18,5773,421,54,20515
Mulgrave,4266,6489,19,6034,136,48,16993
Barron River,5064,7165,10,6293,158,12,18702
Cairns,4853,5488,26,9949,133,161,20607
McConnel,3316,4224,31,14567,207,51,22390
Cooper,5227,6315,8,5624,111,44,17327
Ferny Grove,4885,6904,14,4745,76,172,16799
Maiwar,5638,4967,16,9907,194,77,20806
Moggill,5882,7314,9,2232,124,54,15612
Mount Ommaney,5475,7003,19,4084,107,64,16739
Jordan,2293,8336,8,5213,49,9,15899
Stretton,5642,6721,29,4693,139,84,17306
Algester,3998,7578,35,5504,87,42,17239
Toohey,5890,5522,36,6679,168,38,18338
Miller,4897,5860,11,6014,93,67,16946
South Brisbane,3332,3673,14,11169,185,41,18417
Mansfield,5277,6097,19,4951,110,74,16522
Greenslopes,4301,6149,13,7790,93,93,18439
Clayfield,4656,5790,11,9541,145,54,20203
Nudgee,4734,6625,29,8305,118,60,19869
Stafford,4833,6100,24,8416,117,174,19673
Everton,5262,7553,20,4121,80,128,17164
Sandgate,5451,7422,27,5389,86,134,18505
Aspley,6504,6487,21,4045,75,202,17328
Bulimba,4446,6841,9,7326,94,40,18750
Lytton,5400,6935,25,5654,96,138,18237
