Australian Bureau of Statistics

"2016 Census - Counting Persons, Place of Usual Residence (MB)"
"SED (UR) by ASSNP Core Activity Need for Assistance"
"Counting: Persons Place of Usual Residence"

Filters:
"Default Summation","Persons Place of Usual Residence"

"Counting","SED (UR)","ASSNP Core Activity Need for Assistance","Count",
"Persons Place of Usual Residence","Albert","Has need for assistance with core activities",2905
"Persons Place of Usual Residence","Albert","Does not have need for assistance with core activities",62568
"Persons Place of Usual Residence","Albert","Total",65468
"Persons Place of Usual Residence","Algester","Has need for assistance with core activities",2661
"Persons Place of Usual Residence","Algester","Does not have need for assistance with core activities",49095
"Persons Place of Usual Residence","Algester","Total",51756
"Persons Place of Usual Residence","Ashgrove","Has need for assistance with core activities",1465
"Persons Place of Usual Residence","Ashgrove","Does not have need for assistance with core activities",42960
"Persons Place of Usual Residence","Ashgrove","Total",44427
"Persons Place of Usual Residence","Aspley","Has need for assistance with core activities",2125
"Persons Place of Usual Residence","Aspley","Does not have need for assistance with core activities",40379
"Persons Place of Usual Residence","Aspley","Total",42502
"Persons Place of Usual Residence","Barron River","Has need for assistance with core activities",2270
"Persons Place of Usual Residence","Barron River","Does not have need for assistance with core activities",53726
"Persons Place of Usual Residence","Barron River","Total",55994
"Persons Place of Usual Residence","Beaudesert","Has need for assistance with core activities",3191
"Persons Place of Usual Residence","Beaudesert","Does not have need for assistance with core activities",49931
"Persons Place of Usual Residence","Beaudesert","Total",53124
"Persons Place of Usual Residence","Brisbane Central","Has need for assistance with core activities",1488
"Persons Place of Usual Residence","Brisbane Central","Does not have need for assistance with core activities",53541
"Persons Place of Usual Residence","Brisbane Central","Total",55030
"Persons Place of Usual Residence","Broadwater","Has need for assistance with core activities",3458
"Persons Place of Usual Residence","Broadwater","Does not have need for assistance with core activities",43694
"Persons Place of Usual Residence","Broadwater","Total",47155
"Persons Place of Usual Residence","Buderim","Has need for assistance with core activities",2431
"Persons Place of Usual Residence","Buderim","Does not have need for assistance with core activities",44800
"Persons Place of Usual Residence","Buderim","Total",47234
"Persons Place of Usual Residence","Bulimba","Has need for assistance with core activities",1730
"Persons Place of Usual Residence","Bulimba","Does not have need for assistance with core activities",47197
"Persons Place of Usual Residence","Bulimba","Total",48925
"Persons Place of Usual Residence","Bundaberg","Has need for assistance with core activities",4188
"Persons Place of Usual Residence","Bundaberg","Does not have need for assistance with core activities",36099
"Persons Place of Usual Residence","Bundaberg","Total",40284
"Persons Place of Usual Residence","Bundamba","Has need for assistance with core activities",3530
"Persons Place of Usual Residence","Bundamba","Does not have need for assistance with core activities",70279
"Persons Place of Usual Residence","Bundamba","Total",73808
"Persons Place of Usual Residence","Burdekin","Has need for assistance with core activities",2341
"Persons Place of Usual Residence","Burdekin","Does not have need for assistance with core activities",40302
"Persons Place of Usual Residence","Burdekin","Total",42645
"Persons Place of Usual Residence","Burleigh","Has need for assistance with core activities",2402
"Persons Place of Usual Residence","Burleigh","Does not have need for assistance with core activities",45282
"Persons Place of Usual Residence","Burleigh","Total",47677
"Persons Place of Usual Residence","Burnett","Has need for assistance with core activities",3305
"Persons Place of Usual Residence","Burnett","Does not have need for assistance with core activities",41453
"Persons Place of Usual Residence","Burnett","Total",44765
"Persons Place of Usual Residence","Cairns","Has need for assistance with core activities",2983
"Persons Place of Usual Residence","Cairns","Does not have need for assistance with core activities",49768
"Persons Place of Usual Residence","Cairns","Total",52748
"Persons Place of Usual Residence","Callide","Has need for assistance with core activities",3004
"Persons Place of Usual Residence","Callide","Does not have need for assistance with core activities",38416
"Persons Place of Usual Residence","Callide","Total",41415
"Persons Place of Usual Residence","Caloundra","Has need for assistance with core activities",3317
"Persons Place of Usual Residence","Caloundra","Does not have need for assistance with core activities",44516
"Persons Place of Usual Residence","Caloundra","Total",47836
"Persons Place of Usual Residence","Capalaba","Has need for assistance with core activities",2518
"Persons Place of Usual Residence","Capalaba","Does not have need for assistance with core activities",42789
"Persons Place of Usual Residence","Capalaba","Total",45305
"Persons Place of Usual Residence","Chatsworth","Has need for assistance with core activities",1820
"Persons Place of Usual Residence","Chatsworth","Does not have need for assistance with core activities",47025
"Persons Place of Usual Residence","Chatsworth","Total",48845
"Persons Place of Usual Residence","Clayfield","Has need for assistance with core activities",1614
"Persons Place of Usual Residence","Clayfield","Does not have need for assistance with core activities",46740
"Persons Place of Usual Residence","Clayfield","Total",48348
"Persons Place of Usual Residence","Cleveland","Has need for assistance with core activities",2394
"Persons Place of Usual Residence","Cleveland","Does not have need for assistance with core activities",45109
"Persons Place of Usual Residence","Cleveland","Total",47499
"Persons Place of Usual Residence","Condamine","Has need for assistance with core activities",2633
"Persons Place of Usual Residence","Condamine","Does not have need for assistance with core activities",50487
"Persons Place of Usual Residence","Condamine","Total",53120
"Persons Place of Usual Residence","Cook","Has need for assistance with core activities",1907
"Persons Place of Usual Residence","Cook","Does not have need for assistance with core activities",43782
"Persons Place of Usual Residence","Cook","Total",45688
"Persons Place of Usual Residence","Coomera","Has need for assistance with core activities",3857
"Persons Place of Usual Residence","Coomera","Does not have need for assistance with core activities",64701
"Persons Place of Usual Residence","Coomera","Total",68561
"Persons Place of Usual Residence","Currumbin","Has need for assistance with core activities",2701
"Persons Place of Usual Residence","Currumbin","Does not have need for assistance with core activities",42128
"Persons Place of Usual Residence","Currumbin","Total",44832
"Persons Place of Usual Residence","Dalrymple","Has need for assistance with core activities",2472
"Persons Place of Usual Residence","Dalrymple","Does not have need for assistance with core activities",40141
"Persons Place of Usual Residence","Dalrymple","Total",42611
"Persons Place of Usual Residence","Everton","Has need for assistance with core activities",1824
"Persons Place of Usual Residence","Everton","Does not have need for assistance with core activities",42400
"Persons Place of Usual Residence","Everton","Total",44225
"Persons Place of Usual Residence","Ferny Grove","Has need for assistance with core activities",1754
"Persons Place of Usual Residence","Ferny Grove","Does not have need for assistance with core activities",42035
"Persons Place of Usual Residence","Ferny Grove","Total",43788
"Persons Place of Usual Residence","Gaven","Has need for assistance with core activities",2940
"Persons Place of Usual Residence","Gaven","Does not have need for assistance with core activities",51872
"Persons Place of Usual Residence","Gaven","Total",54808
"Persons Place of Usual Residence","Gladstone","Has need for assistance with core activities",2064
"Persons Place of Usual Residence","Gladstone","Does not have need for assistance with core activities",49121
"Persons Place of Usual Residence","Gladstone","Total",51188
"Persons Place of Usual Residence","Glass House","Has need for assistance with core activities",2928
"Persons Place of Usual Residence","Glass House","Does not have need for assistance with core activities",47673
"Persons Place of Usual Residence","Glass House","Total",50597
"Persons Place of Usual Residence","Greenslopes","Has need for assistance with core activities",2018
"Persons Place of Usual Residence","Greenslopes","Does not have need for assistance with core activities",42574
"Persons Place of Usual Residence","Greenslopes","Total",44593
"Persons Place of Usual Residence","Gregory","Has need for assistance with core activities",1284
"Persons Place of Usual Residence","Gregory","Does not have need for assistance with core activities",35315
"Persons Place of Usual Residence","Gregory","Total",36599
"Persons Place of Usual Residence","Gympie","Has need for assistance with core activities",3686
"Persons Place of Usual Residence","Gympie","Does not have need for assistance with core activities",41383
"Persons Place of Usual Residence","Gympie","Total",45065
"Persons Place of Usual Residence","Hervey Bay","Has need for assistance with core activities",5202
"Persons Place of Usual Residence","Hervey Bay","Does not have need for assistance with core activities",43562
"Persons Place of Usual Residence","Hervey Bay","Total",48761
"Persons Place of Usual Residence","Hinchinbrook","Has need for assistance with core activities",2631
"Persons Place of Usual Residence","Hinchinbrook","Does not have need for assistance with core activities",45761
"Persons Place of Usual Residence","Hinchinbrook","Total",48390
"Persons Place of Usual Residence","Inala","Has need for assistance with core activities",3233
"Persons Place of Usual Residence","Inala","Does not have need for assistance with core activities",47540
"Persons Place of Usual Residence","Inala","Total",50772
"Persons Place of Usual Residence","Indooroopilly","Has need for assistance with core activities",1222
"Persons Place of Usual Residence","Indooroopilly","Does not have need for assistance with core activities",46075
"Persons Place of Usual Residence","Indooroopilly","Total",47306
"Persons Place of Usual Residence","Ipswich","Has need for assistance with core activities",3727
"Persons Place of Usual Residence","Ipswich","Does not have need for assistance with core activities",44802
"Persons Place of Usual Residence","Ipswich","Total",48526
"Persons Place of Usual Residence","Ipswich West","Has need for assistance with core activities",3743
"Persons Place of Usual Residence","Ipswich West","Does not have need for assistance with core activities",46829
"Persons Place of Usual Residence","Ipswich West","Total",50570
"Persons Place of Usual Residence","Kallangur","Has need for assistance with core activities",2895
"Persons Place of Usual Residence","Kallangur","Does not have need for assistance with core activities",47058
"Persons Place of Usual Residence","Kallangur","Total",49954
"Persons Place of Usual Residence","Kawana","Has need for assistance with core activities",3297
"Persons Place of Usual Residence","Kawana","Does not have need for assistance with core activities",47181
"Persons Place of Usual Residence","Kawana","Total",50478
"Persons Place of Usual Residence","Keppel","Has need for assistance with core activities",2776
"Persons Place of Usual Residence","Keppel","Does not have need for assistance with core activities",47410
"Persons Place of Usual Residence","Keppel","Total",50177
"Persons Place of Usual Residence","Lockyer","Has need for assistance with core activities",3123
"Persons Place of Usual Residence","Lockyer","Does not have need for assistance with core activities",47321
"Persons Place of Usual Residence","Lockyer","Total",50443
"Persons Place of Usual Residence","Logan","Has need for assistance with core activities",2641
"Persons Place of Usual Residence","Logan","Does not have need for assistance with core activities",44431
"Persons Place of Usual Residence","Logan","Total",47081
"Persons Place of Usual Residence","Lytton","Has need for assistance with core activities",2540
"Persons Place of Usual Residence","Lytton","Does not have need for assistance with core activities",44107
"Persons Place of Usual Residence","Lytton","Total",46645
"Persons Place of Usual Residence","Mackay","Has need for assistance with core activities",2503
"Persons Place of Usual Residence","Mackay","Does not have need for assistance with core activities",37205
"Persons Place of Usual Residence","Mackay","Total",39709
"Persons Place of Usual Residence","Mansfield","Has need for assistance with core activities",2138
"Persons Place of Usual Residence","Mansfield","Does not have need for assistance with core activities",42542
"Persons Place of Usual Residence","Mansfield","Total",44685
"Persons Place of Usual Residence","Maroochydore","Has need for assistance with core activities",2806
"Persons Place of Usual Residence","Maroochydore","Does not have need for assistance with core activities",45569
"Persons Place of Usual Residence","Maroochydore","Total",48371
"Persons Place of Usual Residence","Maryborough","Has need for assistance with core activities",4864
"Persons Place of Usual Residence","Maryborough","Does not have need for assistance with core activities",41296
"Persons Place of Usual Residence","Maryborough","Total",46158
"Persons Place of Usual Residence","Mermaid Beach","Has need for assistance with core activities",2375
"Persons Place of Usual Residence","Mermaid Beach","Does not have need for assistance with core activities",47612
"Persons Place of Usual Residence","Mermaid Beach","Total",49981
"Persons Place of Usual Residence","Mirani","Has need for assistance with core activities",2036
"Persons Place of Usual Residence","Mirani","Does not have need for assistance with core activities",45190
"Persons Place of Usual Residence","Mirani","Total",47229
"Persons Place of Usual Residence","Moggill","Has need for assistance with core activities",1833
"Persons Place of Usual Residence","Moggill","Does not have need for assistance with core activities",43779
"Persons Place of Usual Residence","Moggill","Total",45614
"Persons Place of Usual Residence","Morayfield","Has need for assistance with core activities",3224
"Persons Place of Usual Residence","Morayfield","Does not have need for assistance with core activities",49306
"Persons Place of Usual Residence","Morayfield","Total",52528
"Persons Place of Usual Residence","Mount Coot-tha","Has need for assistance with core activities",1167
"Persons Place of Usual Residence","Mount Coot-tha","Does not have need for assistance with core activities",41637
"Persons Place of Usual Residence","Mount Coot-tha","Total",42802
"Persons Place of Usual Residence","Mount Isa","Has need for assistance with core activities",867
"Persons Place of Usual Residence","Mount Isa","Does not have need for assistance with core activities",27726
"Persons Place of Usual Residence","Mount Isa","Total",28594
"Persons Place of Usual Residence","Mount Ommaney","Has need for assistance with core activities",2225
"Persons Place of Usual Residence","Mount Ommaney","Does not have need for assistance with core activities",42343
"Persons Place of Usual Residence","Mount Ommaney","Total",44568
"Persons Place of Usual Residence","Mudgeeraba","Has need for assistance with core activities",2645
"Persons Place of Usual Residence","Mudgeeraba","Does not have need for assistance with core activities",49821
"Persons Place of Usual Residence","Mudgeeraba","Total",52472
"Persons Place of Usual Residence","Mulgrave","Has need for assistance with core activities",2726
"Persons Place of Usual Residence","Mulgrave","Does not have need for assistance with core activities",45362
"Persons Place of Usual Residence","Mulgrave","Total",48092
"Persons Place of Usual Residence","Mundingburra","Has need for assistance with core activities",2599
"Persons Place of Usual Residence","Mundingburra","Does not have need for assistance with core activities",39375
"Persons Place of Usual Residence","Mundingburra","Total",41974
"Persons Place of Usual Residence","Murrumba","Has need for assistance with core activities",4198
"Persons Place of Usual Residence","Murrumba","Does not have need for assistance with core activities",64447
"Persons Place of Usual Residence","Murrumba","Total",68642
"Persons Place of Usual Residence","Nanango","Has need for assistance with core activities",3960
"Persons Place of Usual Residence","Nanango","Does not have need for assistance with core activities",42317
"Persons Place of Usual Residence","Nanango","Total",46275
"Persons Place of Usual Residence","Nicklin","Has need for assistance with core activities",3419
"Persons Place of Usual Residence","Nicklin","Does not have need for assistance with core activities",44658
"Persons Place of Usual Residence","Nicklin","Total",48075
"Persons Place of Usual Residence","Noosa","Has need for assistance with core activities",2504
"Persons Place of Usual Residence","Noosa","Does not have need for assistance with core activities",46009
"Persons Place of Usual Residence","Noosa","Total",48512
"Persons Place of Usual Residence","Nudgee","Has need for assistance with core activities",2521
"Persons Place of Usual Residence","Nudgee","Does not have need for assistance with core activities",49057
"Persons Place of Usual Residence","Nudgee","Total",51583
"Persons Place of Usual Residence","Pine Rivers","Has need for assistance with core activities",2317
"Persons Place of Usual Residence","Pine Rivers","Does not have need for assistance with core activities",48528
"Persons Place of Usual Residence","Pine Rivers","Total",50849
"Persons Place of Usual Residence","Pumicestone","Has need for assistance with core activities",4559
"Persons Place of Usual Residence","Pumicestone","Does not have need for assistance with core activities",45686
"Persons Place of Usual Residence","Pumicestone","Total",50244
"Persons Place of Usual Residence","Redcliffe","Has need for assistance with core activities",3414
"Persons Place of Usual Residence","Redcliffe","Does not have need for assistance with core activities",42398
"Persons Place of Usual Residence","Redcliffe","Total",45808
"Persons Place of Usual Residence","Redlands","Has need for assistance with core activities",3312
"Persons Place of Usual Residence","Redlands","Does not have need for assistance with core activities",45688
"Persons Place of Usual Residence","Redlands","Total",49002
"Persons Place of Usual Residence","Rockhampton","Has need for assistance with core activities",3401
"Persons Place of Usual Residence","Rockhampton","Does not have need for assistance with core activities",42133
"Persons Place of Usual Residence","Rockhampton","Total",45530
"Persons Place of Usual Residence","Sandgate","Has need for assistance with core activities",2938
"Persons Place of Usual Residence","Sandgate","Does not have need for assistance with core activities",44495
"Persons Place of Usual Residence","Sandgate","Total",47436
"Persons Place of Usual Residence","South Brisbane","Has need for assistance with core activities",1769
"Persons Place of Usual Residence","South Brisbane","Does not have need for assistance with core activities",48930
"Persons Place of Usual Residence","South Brisbane","Total",50697
"Persons Place of Usual Residence","Southern Downs","Has need for assistance with core activities",3217
"Persons Place of Usual Residence","Southern Downs","Does not have need for assistance with core activities",41838
"Persons Place of Usual Residence","Southern Downs","Total",45056
"Persons Place of Usual Residence","Southport","Has need for assistance with core activities",3833
"Persons Place of Usual Residence","Southport","Does not have need for assistance with core activities",50726
"Persons Place of Usual Residence","Southport","Total",54565
"Persons Place of Usual Residence","Springwood","Has need for assistance with core activities",1832
"Persons Place of Usual Residence","Springwood","Does not have need for assistance with core activities",45042
"Persons Place of Usual Residence","Springwood","Total",46875
"Persons Place of Usual Residence","Stafford","Has need for assistance with core activities",1871
"Persons Place of Usual Residence","Stafford","Does not have need for assistance with core activities",42482
"Persons Place of Usual Residence","Stafford","Total",44352
"Persons Place of Usual Residence","Stretton","Has need for assistance with core activities",2332
"Persons Place of Usual Residence","Stretton","Does not have need for assistance with core activities",54192
"Persons Place of Usual Residence","Stretton","Total",56522
"Persons Place of Usual Residence","Sunnybank","Has need for assistance with core activities",2583
"Persons Place of Usual Residence","Sunnybank","Does not have need for assistance with core activities",48954
"Persons Place of Usual Residence","Sunnybank","Total",51533
"Persons Place of Usual Residence","Surfers Paradise","Has need for assistance with core activities",2125
"Persons Place of Usual Residence","Surfers Paradise","Does not have need for assistance with core activities",49228
"Persons Place of Usual Residence","Surfers Paradise","Total",51357
"Persons Place of Usual Residence","Thuringowa","Has need for assistance with core activities",2795
"Persons Place of Usual Residence","Thuringowa","Does not have need for assistance with core activities",46437
"Persons Place of Usual Residence","Thuringowa","Total",49229
"Persons Place of Usual Residence","Toowoomba North","Has need for assistance with core activities",3033
"Persons Place of Usual Residence","Toowoomba North","Does not have need for assistance with core activities",43692
"Persons Place of Usual Residence","Toowoomba North","Total",46725
"Persons Place of Usual Residence","Toowoomba South","Has need for assistance with core activities",3507
"Persons Place of Usual Residence","Toowoomba South","Does not have need for assistance with core activities",43958
"Persons Place of Usual Residence","Toowoomba South","Total",47467
"Persons Place of Usual Residence","Townsville","Has need for assistance with core activities",2336
"Persons Place of Usual Residence","Townsville","Does not have need for assistance with core activities",42786
"Persons Place of Usual Residence","Townsville","Total",45117
"Persons Place of Usual Residence","Warrego","Has need for assistance with core activities",2010
"Persons Place of Usual Residence","Warrego","Does not have need for assistance with core activities",34278
"Persons Place of Usual Residence","Warrego","Total",36289
"Persons Place of Usual Residence","Waterford","Has need for assistance with core activities",4569
"Persons Place of Usual Residence","Waterford","Does not have need for assistance with core activities",54638
"Persons Place of Usual Residence","Waterford","Total",59205
"Persons Place of Usual Residence","Whitsunday","Has need for assistance with core activities",2107
"Persons Place of Usual Residence","Whitsunday","Does not have need for assistance with core activities",51621
"Persons Place of Usual Residence","Whitsunday","Total",53724
"Persons Place of Usual Residence","Woodridge","Has need for assistance with core activities",3823
"Persons Place of Usual Residence","Woodridge","Does not have need for assistance with core activities",54102
"Persons Place of Usual Residence","Woodridge","Total",57928
"Persons Place of Usual Residence","Yeerongpilly","Has need for assistance with core activities",2151
"Persons Place of Usual Residence","Yeerongpilly","Does not have need for assistance with core activities",45842
"Persons Place of Usual Residence","Yeerongpilly","Total",47994
"Persons Place of Usual Residence","No usual address (Qld)","Has need for assistance with core activities",626
"Persons Place of Usual Residence","No usual address (Qld)","Does not have need for assistance with core activities",9265
"Persons Place of Usual Residence","No usual address (Qld)","Total",9891
"Persons Place of Usual Residence","Migratory - Offshore - Shipping (Qld)","Has need for assistance with core activities",3
"Persons Place of Usual Residence","Migratory - Offshore - Shipping (Qld)","Does not have need for assistance with core activities",126
"Persons Place of Usual Residence","Migratory - Offshore - Shipping (Qld)","Total",136
"Persons Place of Usual Residence","Total","Has need for assistance with core activities",243262
"Persons Place of Usual Residence","Total","Does not have need for assistance with core activities",4103667
"Persons Place of Usual Residence","Total","Total",4346934

"Data Source: Census of Population and Housing, 2016, TableBuilder"

"INFO","Cells in this table have been randomly adjusted to avoid the release of confidential data. No reliance should be placed on small cells."


"Copyright Commonwealth of Australia, 2018, see abs.gov.au/copyright"
"ABS data licensed under Creative Commons, see abs.gov.au/ccby"
