"","Industry","Ind_count_qld","Pct_ind_qld"
"1","Health.Care.and.Social.Assistance",276948,5.88851146200283
"2","Retail.Trade",211780,4.50289930753412
"3","Education.and.Training",192147,4.08545940714306
"4","Construction",191338,4.06825832328342
"5","Accommodation.and.Food.Services",156672,3.33118443814329
