SED_2018,Separate_house,Semi-detached_1_storey,Semi-detached_2+_storeys,Flat_apartment_1_or_2_storey,Flat_apartment_3_storey,Flat_apartment_4+_storey,Flat_apartment_attached_house,Caravan,Cabin_houseboat,Improvised_home,House_flat_attached_shop_office,Total_dwell_struct
Ninderry,15578,965,686,259,378,319,26,556,208,25,12,19018
Buderim,13962,2238,913,1340,206,354,3,13,32,6,0,19065
Traeger,15029,1539,224,1100,101,5,7,1801,87,272,112,20274
Nicklin,15051,706,652,919,60,3,7,295,193,57,17,17953
Kawana,14720,2419,582,294,218,1130,3,39,204,0,9,19620
Caloundra,13184,1485,893,862,1118,3142,15,500,110,11,36,21347
Maroochydore,10115,1343,3137,2702,2044,3584,8,811,99,19,14,23876
Noosa,17271,1185,2258,1527,1015,218,3,360,64,90,12,23996
Toowoomba South,17295,3476,894,1444,0,8,0,69,21,8,127,23333
Toowoomba North,17405,2579,878,1444,73,102,0,36,26,18,20,22572
Townsville,13906,2499,2472,2204,1316,2105,8,355,214,39,55,25166
Mundingburra,16158,1369,676,720,675,28,3,186,15,9,10,19845
Thuringowa,18277,1159,394,239,57,8,0,73,3,5,6,20228
Bundaberg,17496,1866,512,1758,0,0,0,388,187,22,51,22278
Gympie,20496,696,413,481,64,0,3,638,235,284,57,23366
Hervey Bay,18115,1671,1368,630,307,324,4,1065,294,162,24,23967
Maryborough,20006,769,172,541,8,16,0,607,121,99,16,22356
Migratory - Offshore - Shipping (Qld),0,0,0,0,0,0,0,0,0,0,0,0
Capalaba,16020,1017,1558,313,41,0,0,86,227,7,5,19276
Oodgeroo,13987,1205,1282,1186,240,279,0,74,21,47,24,18342
Chatsworth,14661,448,2490,355,261,132,0,12,20,0,25,18410
Redlands,17651,616,114,794,40,3,0,17,13,24,4,19271
Springwood,16228,406,1345,567,0,44,4,101,0,0,3,18705
Pine Rivers,16426,870,1008,423,25,0,3,34,11,14,9,18812
Murrumba,15527,2217,2802,373,105,4,0,147,81,5,3,21248
Redcliffe,15719,885,1201,2447,930,2013,7,186,152,33,42,23620
Kurwongbah,16439,868,766,256,0,0,0,7,0,3,3,18343
Glass House,16932,167,49,48,4,0,17,131,73,63,39,17514
Morayfield,16254,1555,914,785,85,52,0,27,70,24,0,19769
Bancroft,17099,634,1337,268,110,231,0,101,25,0,3,19818
Pumicestone,16122,2065,1167,427,359,206,19,541,205,14,21,21152
Whitsunday,17006,714,863,1030,263,111,6,902,186,157,52,21276
Mackay,17752,2426,1285,1815,54,487,0,317,115,8,8,24274
Burdekin,21698,630,629,1706,67,16,51,1230,137,142,71,26388
Waterford,16567,1003,2011,697,61,0,7,41,30,0,4,20429
Woodridge,18894,948,2544,735,36,0,85,3,9,0,162,23418
Logan,15715,431,180,19,0,0,3,85,130,13,7,16581
Macalister,17042,1082,1823,778,180,7,5,142,5,8,4,21068
Ipswich,16108,1145,661,670,88,61,11,5,0,17,25,18784
Bundamba,17732,1354,1004,193,16,4,0,12,3,3,18,20338
Ipswich West,16963,1245,307,119,32,0,0,77,50,12,14,18823
Lockyer,17802,382,49,306,0,0,9,171,112,44,223,19093
Inala,16714,524,2306,453,81,5,0,133,0,3,134,20351
Southport,10398,2535,3182,1114,1429,4449,10,19,109,42,20,23303
Coomera,17231,1083,913,80,0,3,0,39,82,14,14,19454
Gaven,13289,962,2985,613,325,172,4,391,106,15,6,18862
Scenic Rim,18819,529,131,249,58,3,3,316,55,88,56,20300
Theodore,14026,2233,2387,273,32,73,6,152,19,11,4,19206
Mudgeeraba,13835,964,3838,372,254,372,3,105,11,24,21,19799
Broadwater,12487,1955,2958,400,1080,1985,4,68,149,6,8,21098
Bonney,8850,3033,3472,1266,3086,2421,0,476,66,19,4,22693
Currumbin,10975,1138,2124,1578,2054,2006,8,214,6,40,23,20172
Mermaid Beach,10415,1609,4075,1457,2815,1644,3,86,103,6,15,22239
Burleigh,10769,1668,3079,1332,2306,2109,11,296,30,25,23,21656
Surfers Paradise,7931,265,1586,2101,4000,13100,7,129,84,103,9,29314
Gladstone,17861,578,1008,1580,266,527,0,384,73,45,16,22328
Burnett,19549,536,115,548,131,242,9,1316,150,183,52,22823
Keppel,18367,924,237,1190,143,137,0,739,256,79,19,22099
Mirani,18795,257,57,352,0,0,3,618,53,218,38,20391
Gregory,15863,563,135,1344,0,5,0,1668,163,218,75,20040
Rockhampton,19383,1444,628,1237,58,137,9,305,110,40,26,23388
Condamine,18261,268,37,339,0,4,4,135,20,42,35,19145
Nanango,22025,483,26,628,0,4,5,482,80,189,67,23989
Southern Downs,20202,862,109,816,0,4,3,348,153,115,63,22682
Callide,21168,560,68,1040,5,23,3,999,209,219,88,24380
Warrego,18799,667,45,477,0,9,5,681,97,83,77,20940
Cook,16496,983,881,1196,198,124,4,1453,224,736,109,22402
Hinchinbrook,18739,325,56,510,33,0,9,1009,62,95,37,20871
Hill,22138,555,99,1491,20,33,4,1199,171,242,235,26176
Mulgrave,16933,751,383,1179,276,95,0,414,29,78,30,20174
Barron River,17180,956,1082,1401,1344,367,3,405,130,47,8,22924
Cairns,13226,1905,1699,4577,2792,1320,13,234,283,103,99,26258
McConnel,3436,52,1153,2585,4512,17448,21,0,9,180,18,29421
Cooper,14853,161,1113,1571,1293,1031,8,109,14,4,42,20202
Ferny Grove,15553,370,1069,916,687,148,8,0,0,3,6,18767
Maiwar,10490,130,1340,2585,5586,4281,5,0,0,0,14,24440
Moggill,16495,327,337,72,15,4,0,0,0,0,13,17275
Mount Ommaney,16205,284,1383,456,202,157,0,0,0,0,11,18707
Jordan,16771,213,654,14,16,0,0,81,4,4,4,17761
Stretton,15936,456,2768,122,0,0,5,4,77,0,10,19387
Algester,16222,321,2480,185,16,0,3,39,30,8,9,19315
Toohey,15843,746,2447,874,495,184,0,136,373,9,16,21122
Miller,12911,138,2153,2246,1519,551,7,0,9,3,20,19556
South Brisbane,6501,176,842,3201,3498,9017,21,0,36,18,103,23408
Mansfield,14899,252,1524,741,735,435,3,24,76,0,10,18699
Greenslopes,12367,115,1655,2749,3738,632,13,0,4,0,116,21393
Clayfield,10956,257,1571,3811,4627,3538,9,4,34,4,41,24858
Nudgee,14385,605,1903,2619,2058,1295,5,5,0,0,20,22887
Stafford,14694,364,2108,2097,2214,1486,0,0,0,0,19,22983
Everton,15574,457,1340,1046,496,156,5,0,0,0,0,19070
Sandgate,16491,1266,1566,978,222,94,0,22,119,16,43,20821
Aspley,16321,1092,1369,211,21,83,0,155,107,5,5,19360
Bulimba,13428,339,3625,1866,2050,724,0,125,44,0,20,22217
Lytton,16214,1267,2060,862,361,53,7,0,146,5,12,20990
