Postcode,April Application Count,May Application Count,,,,,,,,,,,
0800,413,429,,,,,,,,,,,
0801,15,15,,,,,,,,,,,
0810,773,787,,,,,,,,,,,
0812,316,325,,,,,,,,,,,
0820,740,754,,,,,,,,,,,
0821,11,11,,,,,,,,,,,
0822,184,197,,,,,,,,,,,
0828,141,148,,,,,,,,,,,
0829,43,44,,,,,,,,,,,
0830,304,303,,,,,,,,,,,
0831,13,14,,,,,,,,,,,
0832,160,170,,,,,,,,,,,
0834,54,59,,,,,,,,,,,
0835,86,94,,,,,,,,,,,
0836,191,204,,,,,,,,,,,
0837,22,21,,,,,,,,,,,
0838,26,33,,,,,,,,,,,
0839,21,18,,,,,,,,,,,
0840,12,12,,,,,,,,,,,
0841,15,15,,,,,,,,,,,
0845,12,12,,,,,,,,,,,
0846,5,6,,,,,,,,,,,
0850,176,180,,,,,,,,,,,
0851,24,24,,,,,,,,,,,
0852,47,56,,,,,,,,,,,
0854,9,10,,,,,,,,,,,
0860,23,25,,,,,,,,,,,
0862,8,8,,,,,,,,,,,
0870,575,592,,,,,,,,,,,
0871,40,39,,,,,,,,,,,
0872,54,56,,,,,,,,,,,
0873,20,22,,,,,,,,,,,
0875,14,14,,,,,,,,,,,
0880,35,31,,,,,,,,,,,
0881,10,10,,,,,,,,,,,
0885,8,8,,,,,,,,,,,
0886,15,16,,,,,,,,,,,
1230,13,14,,,,,,,,,,,
1335,6,6,,,,,,,,,,,
1340,11,11,,,,,,,,,,,
1355,11,10,,,,,,,,,,,
1470,6,5,,,,,,,,,,,
1490,5,5,,,,,,,,,,,
1565,5,5,,,,,,,,,,,
1595,5,5,,,,,,,,,,,
1655,5,5,,,,,,,,,,,
1885,6,6,,,,,,,,,,,
2000,"10,447","10,837",,,,,,,,,,,
2001,33,35,,,,,,,,,,,
2006,11,11,,,,,,,,,,,
2007,532,544,,,,,,,,,,,
2008,480,497,,,,,,,,,,,
2009,882,906,,,,,,,,,,,
2010,"3,012","3,109",,,,,,,,,,,
2011,"1,206","1,259",,,,,,,,,,,
2015,"1,298","1,335",,,,,,,,,,,
2016,697,708,,,,,,,,,,,
2017,952,993,,,,,,,,,,,
2018,894,909,,,,,,,,,,,
2019,786,833,,,,,,,,,,,
2020,838,851,,,,,,,,,,,
2021,"1,052","1,076",,,,,,,,,,,
2022,"1,306","1,353",,,,,,,,,,,
2023,583,597,,,,,,,,,,,
2024,612,639,,,,,,,,,,,
2025,502,519,,,,,,,,,,,
2026,"2,111","2,188",,,,,,,,,,,
2027,551,580,,,,,,,,,,,
2028,560,581,,,,,,,,,,,
2029,664,685,,,,,,,,,,,
2030,812,844,,,,,,,,,,,
2031,"1,533","1,589",,,,,,,,,,,
2032,459,474,,,,,,,,,,,
2033,424,442,,,,,,,,,,,
2034,863,896,,,,,,,,,,,
2035,"1,423","1,478",,,,,,,,,,,
2036,"1,148","1,230",,,,,,,,,,,
2037,665,688,,,,,,,,,,,
2038,510,530,,,,,,,,,,,
2039,532,558,,,,,,,,,,,
2040,"1,211","1,258",,,,,,,,,,,
2041,923,988,,,,,,,,,,,
2042,"1,068","1,120",,,,,,,,,,,
2043,317,338,,,,,,,,,,,
2044,555,577,,,,,,,,,,,
2045,286,301,,,,,,,,,,,
2046,"1,318","1,382",,,,,,,,,,,
2047,643,671,,,,,,,,,,,
2048,330,336,,,,,,,,,,,
2049,480,504,,,,,,,,,,,
2050,417,441,,,,,,,,,,,
2052,8,8,,,,,,,,,,,
2057,12,11,,,,,,,,,,,
2059,5,5,,,,,,,,,,,
2060,"1,764","1,860",,,,,,,,,,,
2061,378,404,,,,,,,,,,,
2062,346,357,,,,,,,,,,,
2063,308,320,,,,,,,,,,,
2064,705,725,,,,,,,,,,,
2065,"2,027","2,101",,,,,,,,,,,
2066,"1,428","1,478",,,,,,,,,,,
2067,"1,982","2,051",,,,,,,,,,,
2068,714,748,,,,,,,,,,,
2069,660,701,,,,,,,,,,,
2070,584,596,,,,,,,,,,,
2071,497,518,,,,,,,,,,,
2072,468,497,,,,,,,,,,,
2073,713,735,,,,,,,,,,,
2074,793,820,,,,,,,,,,,
2075,893,937,,,,,,,,,,,
2076,888,941,,,,,,,,,,,
2077,"1,516","1,596",,,,,,,,,,,
2079,199,217,,,,,,,,,,,
2080,126,134,,,,,,,,,,,
2081,164,186,,,,,,,,,,,
2082,161,170,,,,,,,,,,,
2083,87,88,,,,,,,,,,,
2084,219,237,,,,,,,,,,,
2085,525,553,,,,,,,,,,,
2086,684,731,,,,,,,,,,,
2087,532,565,,,,,,,,,,,
2088,"1,383","1,451",,,,,,,,,,,
2089,747,781,,,,,,,,,,,
2090,567,600,,,,,,,,,,,
2092,368,386,,,,,,,,,,,
2093,"1,133","1,204",,,,,,,,,,,
2094,248,270,,,,,,,,,,,
2095,"1,051","1,116",,,,,,,,,,,
2096,709,745,,,,,,,,,,,
2097,725,769,,,,,,,,,,,
2099,"1,866","1,966",,,,,,,,,,,
2100,"1,707","1,802",,,,,,,,,,,
2101,957,"1,022",,,,,,,,,,,
2102,553,566,,,,,,,,,,,
2103,795,842,,,,,,,,,,,
2104,184,195,,,,,,,,,,,
2105,118,126,,,,,,,,,,,
2106,604,638,,,,,,,,,,,
2107,"1,078","1,131",,,,,,,,,,,
2108,118,125,,,,,,,,,,,
2109,5,6,,,,,,,,,,,
2110,469,483,,,,,,,,,,,
2111,756,810,,,,,,,,,,,
2112,"1,318","1,368",,,,,,,,,,,
2113,"1,072","1,116",,,,,,,,,,,
2114,901,935,,,,,,,,,,,
2115,399,426,,,,,,,,,,,
2116,427,461,,,,,,,,,,,
2117,758,791,,,,,,,,,,,
2118,"1,056","1,104",,,,,,,,,,,
2119,440,455,,,,,,,,,,,
2120,753,806,,,,,,,,,,,
2121,"1,064","1,102",,,,,,,,,,,
2122,"1,281","1,341",,,,,,,,,,,
2124,24,25,,,,,,,,,,,
2125,642,676,,,,,,,,,,,
2126,536,564,,,,,,,,,,,
2127,811,845,,,,,,,,,,,
2128,467,482,,,,,,,,,,,
2129,34,35,,,,,,,,,,,
2130,318,332,,,,,,,,,,,
2131,746,775,,,,,,,,,,,
2132,410,427,,,,,,,,,,,
2133,399,409,,,,,,,,,,,
2134,"1,068","1,099",,,,,,,,,,,
2135,"1,069","1,107",,,,,,,,,,,
2136,391,404,,,,,,,,,,,
2137,"1,254","1,312",,,,,,,,,,,
2138,744,784,,,,,,,,,,,
2140,746,783,,,,,,,,,,,
2141,"1,223","1,271",,,,,,,,,,,
2142,"1,157","1,182",,,,,,,,,,,
2143,405,419,,,,,,,,,,,
2144,"1,916","1,985",,,,,,,,,,,
2145,"2,583","2,661",,,,,,,,,,,
2146,455,468,,,,,,,,,,,
2147,"1,330","1,399",,,,,,,,,,,
2148,"2,295","2,381",,,,,,,,,,,
2150,"1,955","2,036",,,,,,,,,,,
2151,839,862,,,,,,,,,,,
2152,354,375,,,,,,,,,,,
2153,"2,888","3,037",,,,,,,,,,,
2154,"1,907","2,009",,,,,,,,,,,
2155,"2,184","2,290",,,,,,,,,,,
2156,647,683,,,,,,,,,,,
2157,241,264,,,,,,,,,,,
2158,555,573,,,,,,,,,,,
2159,276,291,,,,,,,,,,,
2160,"1,598","1,649",,,,,,,,,,,
2161,"1,393","1,444",,,,,,,,,,,
2162,671,699,,,,,,,,,,,
2163,328,335,,,,,,,,,,,
2164,"1,520","1,598",,,,,,,,,,,
2165,"1,290","1,313",,,,,,,,,,,
2166,"1,700","1,736",,,,,,,,,,,
2167,223,229,,,,,,,,,,,
2168,950,973,,,,,,,,,,,
2170,"4,061","4,172",,,,,,,,,,,
2171,"1,137","1,171",,,,,,,,,,,
2172,87,93,,,,,,,,,,,
2173,290,295,,,,,,,,,,,
2174,224,233,,,,,,,,,,,
2175,147,158,,,,,,,,,,,
2176,"1,383","1,425",,,,,,,,,,,
2177,383,394,,,,,,,,,,,
2178,235,250,,,,,,,,,,,
2179,359,379,,,,,,,,,,,
2190,"1,407","1,443",,,,,,,,,,,
2191,245,256,,,,,,,,,,,
2192,627,636,,,,,,,,,,,
2193,603,621,,,,,,,,,,,
2194,"1,135","1,141",,,,,,,,,,,
2195,"1,542","1,542",,,,,,,,,,,
2196,"1,503","1,539",,,,,,,,,,,
2197,394,414,,,,,,,,,,,
2198,298,314,,,,,,,,,,,
2199,681,714,,,,,,,,,,,
2200,"2,397","2,466",,,,,,,,,,,
2203,428,447,,,,,,,,,,,
2204,"1,510","1,579",,,,,,,,,,,
2205,759,779,,,,,,,,,,,
2206,822,847,,,,,,,,,,,
2207,"1,003","1,038",,,,,,,,,,,
2208,637,676,,,,,,,,,,,
2209,565,582,,,,,,,,,,,
2210,"1,220","1,287",,,,,,,,,,,
2211,742,764,,,,,,,,,,,
2212,682,706,,,,,,,,,,,
2213,599,632,,,,,,,,,,,
2214,241,256,,,,,,,,,,,
2216,"1,265","1,313",,,,,,,,,,,
2217,"1,243","1,270",,,,,,,,,,,
2218,526,536,,,,,,,,,,,
2219,542,574,,,,,,,,,,,
2220,"1,492","1,550",,,,,,,,,,,
2221,664,701,,,,,,,,,,,
2222,374,388,,,,,,,,,,,
2223,710,754,,,,,,,,,,,
2224,644,673,,,,,,,,,,,
2225,179,196,,,,,,,,,,,
2226,364,373,,,,,,,,,,,
2227,531,561,,,,,,,,,,,
2228,948,"1,000",,,,,,,,,,,
2229,"1,865","1,953",,,,,,,,,,,
2230,"1,455","1,542",,,,,,,,,,,
2231,141,150,,,,,,,,,,,
2232,"1,318","1,377",,,,,,,,,,,
2233,781,856,,,,,,,,,,,
2234,"1,045","1,096",,,,,,,,,,,
2250,"2,747","2,890",,,,,,,,,,,
2251,"1,218","1,286",,,,,,,,,,,
2256,393,415,,,,,,,,,,,
2257,913,982,,,,,,,,,,,
2258,193,203,,,,,,,,,,,
2259,"1,776","1,855",,,,,,,,,,,
2260,"1,161","1,235",,,,,,,,,,,
2261,"1,516","1,624",,,,,,,,,,,
2262,360,380,,,,,,,,,,,
2263,556,583,,,,,,,,,,,
2264,423,448,,,,,,,,,,,
2265,160,169,,,,,,,,,,,
2267,73,76,,,,,,,,,,,
2278,56,62,,,,,,,,,,,
2280,768,806,,,,,,,,,,,
2281,427,432,,,,,,,,,,,
2282,517,545,,,,,,,,,,,
2283,601,630,,,,,,,,,,,
2284,328,338,,,,,,,,,,,
2285,796,840,,,,,,,,,,,
2286,79,83,,,,,,,,,,,
2287,726,759,,,,,,,,,,,
2289,638,686,,,,,,,,,,,
2290,"1,151","1,220",,,,,,,,,,,
2291,678,707,,,,,,,,,,,
2292,195,201,,,,,,,,,,,
2293,156,162,,,,,,,,,,,
2294,99,109,,,,,,,,,,,
2295,127,132,,,,,,,,,,,
2296,87,89,,,,,,,,,,,
2297,61,66,,,,,,,,,,,
2298,205,215,,,,,,,,,,,
2299,294,306,,,,,,,,,,,
2300,873,931,,,,,,,,,,,
2302,202,209,,,,,,,,,,,
2303,414,436,,,,,,,,,,,
2304,499,525,,,,,,,,,,,
2305,408,437,,,,,,,,,,,
2306,17,16,,,,,,,,,,,
2307,46,46,,,,,,,,,,,
2308,7,6,,,,,,,,,,,
2311,36,36,,,,,,,,,,,
2312,49,50,,,,,,,,,,,
2315,499,527,,,,,,,,,,,
2316,265,282,,,,,,,,,,,
2317,256,273,,,,,,,,,,,
2318,317,330,,,,,,,,,,,
2319,104,112,,,,,,,,,,,
2320,"1,111","1,165",,,,,,,,,,,
2321,389,406,,,,,,,,,,,
2322,522,564,,,,,,,,,,,
2323,636,662,,,,,,,,,,,
2324,586,609,,,,,,,,,,,
2325,638,669,,,,,,,,,,,
2326,129,134,,,,,,,,,,,
2327,137,139,,,,,,,,,,,
2328,51,52,,,,,,,,,,,
2329,77,84,,,,,,,,,,,
2330,438,464,,,,,,,,,,,
2333,206,217,,,,,,,,,,,
2334,51,52,,,,,,,,,,,
2335,172,180,,,,,,,,,,,
2336,55,60,,,,,,,,,,,
2337,276,295,,,,,,,,,,,
2338,61,65,,,,,,,,,,,
2339,41,43,,,,,,,,,,,
2340,"1,551","1,649",,,,,,,,,,,
2341,27,26,,,,,,,,,,,
2342,22,29,,,,,,,,,,,
2343,190,209,,,,,,,,,,,
2344,23,28,,,,,,,,,,,
2345,32,36,,,,,,,,,,,
2346,96,102,,,,,,,,,,,
2347,81,97,,,,,,,,,,,
2350,822,891,,,,,,,,,,,
2352,83,89,,,,,,,,,,,
2353,23,24,,,,,,,,,,,
2354,265,292,,,,,,,,,,,
2355,12,13,,,,,,,,,,,
2357,127,141,,,,,,,,,,,
2358,139,145,,,,,,,,,,,
2359,30,28,,,,,,,,,,,
2360,454,488,,,,,,,,,,,
2361,36,34,,,,,,,,,,,
2365,207,232,,,,,,,,,,,
2369,14,14,,,,,,,,,,,
2370,333,365,,,,,,,,,,,
2371,49,60,,,,,,,,,,,
2372,221,240,,,,,,,,,,,
2379,23,29,,,,,,,,,,,
2380,322,354,,,,,,,,,,,
2381,41,50,,,,,,,,,,,
2382,56,62,,,,,,,,,,,
2386,31,34,,,,,,,,,,,
2387,15,17,,,,,,,,,,,
2388,147,156,,,,,,,,,,,
2390,316,336,,,,,,,,,,,
2395,22,26,,,,,,,,,,,
2396,24,27,,,,,,,,,,,
2397,26,29,,,,,,,,,,,
2398,20,19,,,,,,,,,,,
2399,27,31,,,,,,,,,,,
2400,426,465,,,,,,,,,,,
2401,15,18,,,,,,,,,,,
2402,80,89,,,,,,,,,,,
2403,40,44,,,,,,,,,,,
2404,57,65,,,,,,,,,,,
2405,43,47,,,,,,,,,,,
2406,36,42,,,,,,,,,,,
2408,35,37,,,,,,,,,,,
2409,21,27,,,,,,,,,,,
2410,13,12,,,,,,,,,,,
2411,5,6,,,,,,,,,,,
2415,8,11,,,,,,,,,,,
2420,139,146,,,,,,,,,,,
2421,73,80,,,,,,,,,,,
2422,158,165,,,,,,,,,,,
2423,102,114,,,,,,,,,,,
2424,18,20,,,,,,,,,,,
2425,63,70,,,,,,,,,,,
2426,11,11,,,,,,,,,,,
2427,53,54,,,,,,,,,,,
2428,728,768,,,,,,,,,,,
2429,200,208,,,,,,,,,,,
2430,757,821,,,,,,,,,,,
2431,144,145,,,,,,,,,,,
2439,102,105,,,,,,,,,,,
2440,508,534,,,,,,,,,,,
2441,128,128,,,,,,,,,,,
2443,218,226,,,,,,,,,,,
2444,"1,781","1,847",,,,,,,,,,,
2445,201,213,,,,,,,,,,,
2446,439,458,,,,,,,,,,,
2447,212,227,,,,,,,,,,,
2448,227,238,,,,,,,,,,,
2449,51,59,,,,,,,,,,,
2450,"1,805","1,920",,,,,,,,,,,
2452,394,427,,,,,,,,,,,
2453,90,102,,,,,,,,,,,
2454,350,371,,,,,,,,,,,
2455,89,99,,,,,,,,,,,
2456,493,509,,,,,,,,,,,
2460,648,678,,,,,,,,,,,
2462,70,76,,,,,,,,,,,
2463,215,228,,,,,,,,,,,
2464,310,322,,,,,,,,,,,
2465,10,11,,,,,,,,,,,
2466,43,44,,,,,,,,,,,
2469,99,102,,,,,,,,,,,
2470,322,353,,,,,,,,,,,
2471,39,45,,,,,,,,,,,
2472,53,59,,,,,,,,,,,
2473,76,80,,,,,,,,,,,
2474,194,214,,,,,,,,,,,
2475,14,15,,,,,,,,,,,
2476,11,15,,,,,,,,,,,
2477,459,499,,,,,,,,,,,
2478,"1,273","1,363",,,,,,,,,,,
2479,526,565,,,,,,,,,,,
2480,"1,549","1,669",,,,,,,,,,,
2481,"1,511","1,565",,,,,,,,,,,
2482,529,556,,,,,,,,,,,
2483,732,779,,,,,,,,,,,
2484,778,827,,,,,,,,,,,
2485,530,550,,,,,,,,,,,
2486,"1,046","1,101",,,,,,,,,,,
2487,778,816,,,,,,,,,,,
2488,171,180,,,,,,,,,,,
2489,284,292,,,,,,,,,,,
2490,25,28,,,,,,,,,,,
2500,"1,622","1,683",,,,,,,,,,,
2502,268,282,,,,,,,,,,,
2505,139,149,,,,,,,,,,,
2506,120,118,,,,,,,,,,,
2508,346,366,,,,,,,,,,,
2515,533,561,,,,,,,,,,,
2516,224,233,,,,,,,,,,,
2517,371,380,,,,,,,,,,,
2518,526,552,,,,,,,,,,,
2519,519,538,,,,,,,,,,,
2520,6,7,,,,,,,,,,,
2525,314,330,,,,,,,,,,,
2526,468,498,,,,,,,,,,,
2527,494,516,,,,,,,,,,,
2528,402,430,,,,,,,,,,,
2529,745,790,,,,,,,,,,,
2530,580,613,,,,,,,,,,,
2533,622,648,,,,,,,,,,,
2534,244,257,,,,,,,,,,,
2535,357,376,,,,,,,,,,,
2536,583,613,,,,,,,,,,,
2537,361,378,,,,,,,,,,,
2538,144,157,,,,,,,,,,,
2539,742,772,,,,,,,,,,,
2540,"1,187","1,249",,,,,,,,,,,
2541,799,847,,,,,,,,,,,
2545,35,35,,,,,,,,,,,
2546,451,470,,,,,,,,,,,
2548,333,354,,,,,,,,,,,
2549,176,187,,,,,,,,,,,
2550,529,567,,,,,,,,,,,
2551,134,142,,,,,,,,,,,
2555,14,15,,,,,,,,,,,
2556,156,164,,,,,,,,,,,
2557,467,505,,,,,,,,,,,
2558,215,219,,,,,,,,,,,
2559,49,53,,,,,,,,,,,
2560,"1,748","1,819",,,,,,,,,,,
2563,9,9,,,,,,,,,,,
2564,313,321,,,,,,,,,,,
2565,916,970,,,,,,,,,,,
2566,796,838,,,,,,,,,,,
2567,"1,395","1,496",,,,,,,,,,,
2568,37,44,,,,,,,,,,,
2569,50,56,,,,,,,,,,,
2570,"1,607","1,697",,,,,,,,,,,
2571,433,464,,,,,,,,,,,
2572,123,133,,,,,,,,,,,
2573,120,127,,,,,,,,,,,
2574,147,168,,,,,,,,,,,
2575,660,713,,,,,,,,,,,
2576,774,822,,,,,,,,,,,
2577,744,805,,,,,,,,,,,
2578,109,116,,,,,,,,,,,
2579,146,159,,,,,,,,,,,
2580,738,794,,,,,,,,,,,
2581,65,71,,,,,,,,,,,
2582,382,427,,,,,,,,,,,
2583,139,150,,,,,,,,,,,
2584,28,31,,,,,,,,,,,
2585,12,12,,,,,,,,,,,
2586,116,125,,,,,,,,,,,
2587,119,125,,,,,,,,,,,
2588,22,25,,,,,,,,,,,
2590,190,219,,,,,,,,,,,
2594,377,406,,,,,,,,,,,
2600,480,489,,,,,,,,,,,
2601,483,495,,,,,,,,,,,
2602,651,677,,,,,,,,,,,
2603,350,367,,,,,,,,,,,
2604,367,375,,,,,,,,,,,
2605,238,235,,,,,,,,,,,
2606,343,361,,,,,,,,,,,
2607,311,321,,,,,,,,,,,
2609,520,550,,,,,,,,,,,
2611,547,565,,,,,,,,,,,
2612,373,386,,,,,,,,,,,
2614,335,347,,,,,,,,,,,
2615,616,641,,,,,,,,,,,
2617,672,700,,,,,,,,,,,
2618,73,74,,,,,,,,,,,
2619,170,176,,,,,,,,,,,
2620,"1,073","1,132",,,,,,,,,,,
2621,183,196,,,,,,,,,,,
2622,166,189,,,,,,,,,,,
2623,10,13,,,,,,,,,,,
2624,10,10,,,,,,,,,,,
2625,50,51,,,,,,,,,,,
2626,18,20,,,,,,,,,,,
2627,311,327,,,,,,,,,,,
2628,93,111,,,,,,,,,,,
2629,23,22,,,,,,,,,,,
2630,302,338,,,,,,,,,,,
2631,24,29,,,,,,,,,,,
2632,65,74,,,,,,,,,,,
2633,11,10,,,,,,,,,,,
2640,"1,376","1,464",,,,,,,,,,,
2641,315,342,,,,,,,,,,,
2642,173,208,,,,,,,,,,,
2643,59,63,,,,,,,,,,,
2644,67,80,,,,,,,,,,,
2645,26,30,,,,,,,,,,,
2646,228,245,,,,,,,,,,,
2647,81,89,,,,,,,,,,,
2648,73,76,,,,,,,,,,,
2650,"1,824","1,985",,,,,,,,,,,
2651,31,35,,,,,,,,,,,
2652,174,204,,,,,,,,,,,
2653,63,65,,,,,,,,,,,
2655,43,50,,,,,,,,,,,
2656,56,68,,,,,,,,,,,
2658,45,57,,,,,,,,,,,
2659,28,35,,,,,,,,,,,
2660,47,50,,,,,,,,,,,
2663,108,125,,,,,,,,,,,
2665,100,113,,,,,,,,,,,
2666,227,259,,,,,,,,,,,
2668,21,24,,,,,,,,,,,
2669,93,116,,,,,,,,,,,
2671,174,186,,,,,,,,,,,
2672,50,58,,,,,,,,,,,
2675,46,53,,,,,,,,,,,
2680,823,921,,,,,,,,,,,
2681,43,52,,,,,,,,,,,
2700,113,123,,,,,,,,,,,
2701,62,70,,,,,,,,,,,
2702,22,23,,,,,,,,,,,
2703,8,9,,,,,,,,,,,
2705,227,236,,,,,,,,,,,
2706,20,24,,,,,,,,,,,
2707,78,91,,,,,,,,,,,
2710,333,365,,,,,,,,,,,
2711,108,117,,,,,,,,,,,
2712,65,68,,,,,,,,,,,
2713,118,136,,,,,,,,,,,
2714,98,114,,,,,,,,,,,
2715,43,49,,,,,,,,,,,
2716,63,71,,,,,,,,,,,
2717,21,25,,,,,,,,,,,
2720,190,216,,,,,,,,,,,
2721,14,18,,,,,,,,,,,
2722,90,108,,,,,,,,,,,
2725,16,19,,,,,,,,,,,
2726,15,16,,,,,,,,,,,
2727,15,20,,,,,,,,,,,
2729,50,67,,,,,,,,,,,
2730,45,46,,,,,,,,,,,
2731,230,251,,,,,,,,,,,
2732,66,71,,,,,,,,,,,
2733,19,19,,,,,,,,,,,
2734,18,19,,,,,,,,,,,
2735,8,11,,,,,,,,,,,
2736,9,13,,,,,,,,,,,
2737,19,23,,,,,,,,,,,
2738,50,57,,,,,,,,,,,
2739,40,39,,,,,,,,,,,
2745,784,838,,,,,,,,,,,
2747,908,938,,,,,,,,,,,
2748,111,120,,,,,,,,,,,
2749,353,364,,,,,,,,,,,
2750,"1,658","1,746",,,,,,,,,,,
2751,8,8,,,,,,,,,,,
2752,144,160,,,,,,,,,,,
2753,595,636,,,,,,,,,,,
2754,187,207,,,,,,,,,,,
2756,"1,357","1,462",,,,,,,,,,,
2757,39,40,,,,,,,,,,,
2758,393,411,,,,,,,,,,,
2759,577,599,,,,,,,,,,,
2760,743,768,,,,,,,,,,,
2761,742,771,,,,,,,,,,,
2762,317,330,,,,,,,,,,,
2763,720,754,,,,,,,,,,,
2765,939,"1,000",,,,,,,,,,,
2766,386,411,,,,,,,,,,,
2767,429,448,,,,,,,,,,,
2768,866,907,,,,,,,,,,,
2769,381,396,,,,,,,,,,,
2770,945,984,,,,,,,,,,,
2773,196,215,,,,,,,,,,,
2774,343,360,,,,,,,,,,,
2775,75,76,,,,,,,,,,,
2776,113,116,,,,,,,,,,,
2777,524,555,,,,,,,,,,,
2778,59,62,,,,,,,,,,,
2779,121,131,,,,,,,,,,,
2780,642,665,,,,,,,,,,,
2782,214,228,,,,,,,,,,,
2783,95,97,,,,,,,,,,,
2784,33,37,,,,,,,,,,,
2785,224,234,,,,,,,,,,,
2786,45,49,,,,,,,,,,,
2787,107,116,,,,,,,,,,,
2790,333,346,,,,,,,,,,,
2791,9,9,,,,,,,,,,,
2792,8,8,,,,,,,,,,,
2793,30,31,,,,,,,,,,,
2794,332,368,,,,,,,,,,,
2795,"1,163","1,246",,,,,,,,,,,
2797,10,10,,,,,,,,,,,
2798,83,92,,,,,,,,,,,
2799,93,94,,,,,,,,,,,
2800,"1,324","1,378",,,,,,,,,,,
2803,8,7,,,,,,,,,,,
2804,105,117,,,,,,,,,,,
2805,17,18,,,,,,,,,,,
2806,39,43,,,,,,,,,,,
2807,10,12,,,,,,,,,,,
2809,13,16,,,,,,,,,,,
2810,169,184,,,,,,,,,,,
2817,11,11,,,,,,,,,,,
2818,20,20,,,,,,,,,,,
2820,167,174,,,,,,,,,,,
2821,187,207,,,,,,,,,,,
2822,19,17,,,,,,,,,,,
2823,83,86,,,,,,,,,,,
2824,114,122,,,,,,,,,,,
2825,105,111,,,,,,,,,,,
2826,12,12,,,,,,,,,,,
2827,125,139,,,,,,,,,,,
2828,44,47,,,,,,,,,,,
2829,138,151,,,,,,,,,,,
2830,"1,456","1,567",,,,,,,,,,,
2831,149,158,,,,,,,,,,,
2832,91,103,,,,,,,,,,,
2833,18,20,,,,,,,,,,,
2834,73,75,,,,,,,,,,,
2835,115,123,,,,,,,,,,,
2836,13,17,,,,,,,,,,,
2839,20,22,,,,,,,,,,,
2840,91,95,,,,,,,,,,,
2842,28,30,,,,,,,,,,,
2843,50,53,,,,,,,,,,,
2844,55,58,,,,,,,,,,,
2845,36,35,,,,,,,,,,,
2846,11,12,,,,,,,,,,,
2847,32,35,,,,,,,,,,,
2848,17,19,,,,,,,,,,,
2849,61,61,,,,,,,,,,,
2850,663,682,,,,,,,,,,,
2852,104,109,,,,,,,,,,,
2864,29,27,,,,,,,,,,,
2865,28,29,,,,,,,,,,,
2866,111,116,,,,,,,,,,,
2867,20,22,,,,,,,,,,,
2868,19,23,,,,,,,,,,,
2869,93,104,,,,,,,,,,,
2870,390,417,,,,,,,,,,,
2871,356,392,,,,,,,,,,,
2873,58,63,,,,,,,,,,,
2874,29,32,,,,,,,,,,,
2875,47,58,,,,,,,,,,,
2876,36,38,,,,,,,,,,,
2877,136,140,,,,,,,,,,,
2878,12,13,,,,,,,,,,,
2879,11,11,,,,,,,,,,,
2880,405,422,,,,,,,,,,,
2898,46,46,,,,,,,,,,,
2899,152,157,,,,,,,,,,,
2900,92,93,,,,,,,,,,,
2902,213,218,,,,,,,,,,,
2903,156,160,,,,,,,,,,,
2904,204,210,,,,,,,,,,,
2905,416,436,,,,,,,,,,,
2906,225,222,,,,,,,,,,,
2911,268,278,,,,,,,,,,,
2912,231,236,,,,,,,,,,,
2913,647,676,,,,,,,,,,,
2914,512,530,,,,,,,,,,,
3000,"6,767","7,033",,,,,,,,,,,
3001,15,17,,,,,,,,,,,
3002,506,551,,,,,,,,,,,
3003,446,461,,,,,,,,,,,
3004,"1,335","1,392",,,,,,,,,,,
3005,12,12,,,,,,,,,,,
3006,960,999,,,,,,,,,,,
3008,885,911,,,,,,,,,,,
3011,"1,177","1,219",,,,,,,,,,,
3012,"1,059","1,118",,,,,,,,,,,
3013,627,655,,,,,,,,,,,
3015,635,666,,,,,,,,,,,
3016,844,892,,,,,,,,,,,
3018,437,452,,,,,,,,,,,
3019,344,346,,,,,,,,,,,
3020,"1,818","1,891",,,,,,,,,,,
3021,"1,423","1,474",,,,,,,,,,,
3022,77,77,,,,,,,,,,,
3023,"1,981","2,054",,,,,,,,,,,
3024,517,544,,,,,,,,,,,
3025,485,510,,,,,,,,,,,
3026,539,566,,,,,,,,,,,
3027,311,323,,,,,,,,,,,
3028,669,695,,,,,,,,,,,
3029,"3,783","3,889",,,,,,,,,,,
3030,"3,355","3,492",,,,,,,,,,,
3031,754,791,,,,,,,,,,,
3032,"1,106","1,161",,,,,,,,,,,
3033,484,519,,,,,,,,,,,
3034,296,319,,,,,,,,,,,
3036,199,209,,,,,,,,,,,
3037,"1,320","1,382",,,,,,,,,,,
3038,804,857,,,,,,,,,,,
3039,764,795,,,,,,,,,,,
3040,"1,165","1,218",,,,,,,,,,,
3041,516,543,,,,,,,,,,,
3042,846,894,,,,,,,,,,,
3043,"1,033","1,103",,,,,,,,,,,
3044,857,893,,,,,,,,,,,
3045,24,29,,,,,,,,,,,
3046,"1,125","1,168",,,,,,,,,,,
3047,730,756,,,,,,,,,,,
3048,599,617,,,,,,,,,,,
3049,279,295,,,,,,,,,,,
3050,5,5,,,,,,,,,,,
3051,885,919,,,,,,,,,,,
3052,233,247,,,,,,,,,,,
3053,839,872,,,,,,,,,,,
3054,417,442,,,,,,,,,,,
3055,421,437,,,,,,,,,,,
3056,"1,365","1,405",,,,,,,,,,,
3057,692,721,,,,,,,,,,,
3058,"1,687","1,752",,,,,,,,,,,
3059,605,641,,,,,,,,,,,
3060,589,595,,,,,,,,,,,
3061,955,"1,020",,,,,,,,,,,
3062,117,125,,,,,,,,,,,
3063,23,24,,,,,,,,,,,
3064,"2,958","3,065",,,,,,,,,,,
3065,"1,028","1,058",,,,,,,,,,,
3066,"1,076","1,126",,,,,,,,,,,
3067,670,692,,,,,,,,,,,
3068,"1,010","1,040",,,,,,,,,,,
3070,"1,171","1,242",,,,,,,,,,,
3071,827,863,,,,,,,,,,,
3072,"1,560","1,634",,,,,,,,,,,
3073,"1,503","1,566",,,,,,,,,,,
3074,"1,157","1,249",,,,,,,,,,,
3075,621,645,,,,,,,,,,,
3076,"1,222","1,270",,,,,,,,,,,
3078,584,617,,,,,,,,,,,
3079,712,768,,,,,,,,,,,
3081,685,715,,,,,,,,,,,
3082,875,929,,,,,,,,,,,
3083,"1,037","1,089",,,,,,,,,,,
3084,908,964,,,,,,,,,,,
3085,316,342,,,,,,,,,,,
3087,215,221,,,,,,,,,,,
3088,920,971,,,,,,,,,,,
3089,399,421,,,,,,,,,,,
3090,120,127,,,,,,,,,,,
3091,89,95,,,,,,,,,,,
3093,157,167,,,,,,,,,,,
3094,300,315,,,,,,,,,,,
3095,"1,216","1,301",,,,,,,,,,,
3096,66,66,,,,,,,,,,,
3097,81,90,,,,,,,,,,,
3099,206,217,,,,,,,,,,,
3101,"1,301","1,368",,,,,,,,,,,
3102,360,383,,,,,,,,,,,
3103,805,831,,,,,,,,,,,
3104,919,941,,,,,,,,,,,
3105,468,480,,,,,,,,,,,
3106,730,782,,,,,,,,,,,
3107,547,567,,,,,,,,,,,
3108,935,974,,,,,,,,,,,
3109,"1,235","1,291",,,,,,,,,,,
3111,441,459,,,,,,,,,,,
3113,408,438,,,,,,,,,,,
3114,179,185,,,,,,,,,,,
3115,184,195,,,,,,,,,,,
3116,357,396,,,,,,,,,,,
3121,"2,497","2,610",,,,,,,,,,,
3122,"1,273","1,332",,,,,,,,,,,
3123,697,726,,,,,,,,,,,
3124,"1,250","1,315",,,,,,,,,,,
3125,576,601,,,,,,,,,,,
3126,397,418,,,,,,,,,,,
3127,836,868,,,,,,,,,,,
3128,"1,140","1,198",,,,,,,,,,,
3129,594,624,,,,,,,,,,,
3130,"1,270","1,334",,,,,,,,,,,
3131,968,"1,016",,,,,,,,,,,
3132,659,695,,,,,,,,,,,
3133,777,822,,,,,,,,,,,
3134,"1,431","1,517",,,,,,,,,,,
3135,587,624,,,,,,,,,,,
3136,"1,384","1,490",,,,,,,,,,,
3137,477,504,,,,,,,,,,,
3138,587,616,,,,,,,,,,,
3139,485,520,,,,,,,,,,,
3140,610,652,,,,,,,,,,,
3141,"1,646","1,715",,,,,,,,,,,
3142,725,759,,,,,,,,,,,
3143,531,552,,,,,,,,,,,
3144,802,826,,,,,,,,,,,
3145,"1,016","1,066",,,,,,,,,,,
3146,937,977,,,,,,,,,,,
3147,554,577,,,,,,,,,,,
3148,341,354,,,,,,,,,,,
3149,"1,505","1,594",,,,,,,,,,,
3150,"2,321","2,443",,,,,,,,,,,
3151,375,407,,,,,,,,,,,
3152,"1,165","1,231",,,,,,,,,,,
3153,"1,193","1,284",,,,,,,,,,,
3154,123,138,,,,,,,,,,,
3155,657,696,,,,,,,,,,,
3156,"1,242","1,320",,,,,,,,,,,
3158,215,234,,,,,,,,,,,
3159,91,98,,,,,,,,,,,
3160,361,387,,,,,,,,,,,
3161,879,910,,,,,,,,,,,
3162,"1,015","1,049",,,,,,,,,,,
3163,"1,078","1,139",,,,,,,,,,,
3164,5,7,,,,,,,,,,,
3165,"1,072","1,126",,,,,,,,,,,
3166,"1,178","1,251",,,,,,,,,,,
3167,401,427,,,,,,,,,,,
3168,949,986,,,,,,,,,,,
3169,720,760,,,,,,,,,,,
3170,894,935,,,,,,,,,,,
3171,994,"1,032",,,,,,,,,,,
3172,654,688,,,,,,,,,,,
3173,"1,017","1,062",,,,,,,,,,,
3174,"1,033","1,087",,,,,,,,,,,
3175,"3,305","3,497",,,,,,,,,,,
3177,403,409,,,,,,,,,,,
3178,"1,205","1,271",,,,,,,,,,,
3179,269,291,,,,,,,,,,,
3180,385,407,,,,,,,,,,,
3181,"1,377","1,427",,,,,,,,,,,
3182,"1,416","1,478",,,,,,,,,,,
3183,831,861,,,,,,,,,,,
3184,794,839,,,,,,,,,,,
3185,831,852,,,,,,,,,,,
3186,"1,385","1,428",,,,,,,,,,,
3187,709,746,,,,,,,,,,,
3188,872,902,,,,,,,,,,,
3189,828,880,,,,,,,,,,,
3190,480,512,,,,,,,,,,,
3191,483,507,,,,,,,,,,,
3192,"1,309","1,400",,,,,,,,,,,
3193,873,936,,,,,,,,,,,
3194,554,591,,,,,,,,,,,
3195,"1,729","1,830",,,,,,,,,,,
3196,785,841,,,,,,,,,,,
3197,390,405,,,,,,,,,,,
3198,678,714,,,,,,,,,,,
3199,"1,771","1,884",,,,,,,,,,,
3200,66,69,,,,,,,,,,,
3201,810,879,,,,,,,,,,,
3202,167,177,,,,,,,,,,,
3204,"1,317","1,364",,,,,,,,,,,
3205,"1,608","1,670",,,,,,,,,,,
3206,652,691,,,,,,,,,,,
3207,"1,681","1,749",,,,,,,,,,,
3211,38,40,,,,,,,,,,,
3212,330,354,,,,,,,,,,,
3213,132,145,,,,,,,,,,,
3214,353,356,,,,,,,,,,,
3215,610,661,,,,,,,,,,,
3216,"1,448","1,556",,,,,,,,,,,
3217,317,336,,,,,,,,,,,
3218,538,578,,,,,,,,,,,
3219,431,487,,,,,,,,,,,
3220,"1,456","1,552",,,,,,,,,,,
3221,58,62,,,,,,,,,,,
3222,460,507,,,,,,,,,,,
3223,191,198,,,,,,,,,,,
3224,419,456,,,,,,,,,,,
3225,210,221,,,,,,,,,,,
3226,662,686,,,,,,,,,,,
3227,202,223,,,,,,,,,,,
3228,"1,054","1,116",,,,,,,,,,,
3230,146,150,,,,,,,,,,,
3231,84,88,,,,,,,,,,,
3232,111,113,,,,,,,,,,,
3233,171,171,,,,,,,,,,,
3234,16,19,,,,,,,,,,,
3235,24,28,,,,,,,,,,,
3236,12,16,,,,,,,,,,,
3237,13,17,,,,,,,,,,,
3238,19,19,,,,,,,,,,,
3239,8,9,,,,,,,,,,,
3240,83,90,,,,,,,,,,,
3241,80,90,,,,,,,,,,,
3242,34,39,,,,,,,,,,,
3243,25,25,,,,,,,,,,,
3249,75,89,,,,,,,,,,,
3250,313,336,,,,,,,,,,,
3251,15,15,,,,,,,,,,,
3254,5,5,,,,,,,,,,,
3260,116,123,,,,,,,,,,,
3264,41,45,,,,,,,,,,,
3265,35,39,,,,,,,,,,,
3266,48,54,,,,,,,,,,,
3267,5,5,,,,,,,,,,,
3268,50,52,,,,,,,,,,,
3269,52,55,,,,,,,,,,,
3270,10,12,,,,,,,,,,,
3271,6,6,,,,,,,,,,,
3272,32,36,,,,,,,,,,,
3273,7,9,,,,,,,,,,,
3275,13,14,,,,,,,,,,,
3277,34,40,,,,,,,,,,,
3279,5,5,,,,,,,,,,,
3280,933,"1,012",,,,,,,,,,,
3281,56,61,,,,,,,,,,,
3282,54,61,,,,,,,,,,,
3283,38,45,,,,,,,,,,,
3284,167,176,,,,,,,,,,,
3285,23,25,,,,,,,,,,,
3286,8,9,,,,,,,,,,,
3287,6,6,,,,,,,,,,,
3289,8,12,,,,,,,,,,,
3292,6,7,,,,,,,,,,,
3293,7,6,,,,,,,,,,,
3294,36,36,,,,,,,,,,,
3300,262,285,,,,,,,,,,,
3301,22,25,,,,,,,,,,,
3302,6,6,,,,,,,,,,,
3304,38,39,,,,,,,,,,,
3305,306,324,,,,,,,,,,,
3311,37,40,,,,,,,,,,,
3312,15,18,,,,,,,,,,,
3314,15,20,,,,,,,,,,,
3315,17,16,,,,,,,,,,,
3318,25,26,,,,,,,,,,,
3319,6,7,,,,,,,,,,,
3321,64,71,,,,,,,,,,,
3324,19,20,,,,,,,,,,,
3325,14,14,,,,,,,,,,,
3328,29,33,,,,,,,,,,,
3329,7,10,,,,,,,,,,,
3330,5,6,,,,,,,,,,,
3331,169,173,,,,,,,,,,,
3332,29,32,,,,,,,,,,,
3333,25,27,,,,,,,,,,,
3334,18,18,,,,,,,,,,,
3335,88,88,,,,,,,,,,,
3336,316,331,,,,,,,,,,,
3337,871,940,,,,,,,,,,,
3338,551,573,,,,,,,,,,,
3340,558,593,,,,,,,,,,,
3341,56,59,,,,,,,,,,,
3342,102,112,,,,,,,,,,,
3345,33,34,,,,,,,,,,,
3350,"2,131","2,263",,,,,,,,,,,
3351,236,264,,,,,,,,,,,
3352,567,604,,,,,,,,,,,
3353,8,9,,,,,,,,,,,
3355,346,372,,,,,,,,,,,
3356,307,323,,,,,,,,,,,
3357,98,105,,,,,,,,,,,
3358,35,41,,,,,,,,,,,
3360,23,24,,,,,,,,,,,
3361,15,18,,,,,,,,,,,
3363,95,103,,,,,,,,,,,
3364,86,91,,,,,,,,,,,
3370,50,53,,,,,,,,,,,
3371,19,22,,,,,,,,,,,
3373,63,77,,,,,,,,,,,
3374,9,11,,,,,,,,,,,
3375,9,14,,,,,,,,,,,
3377,185,190,,,,,,,,,,,
3378,6,6,,,,,,,,,,,
3379,14,15,,,,,,,,,,,
3380,123,135,,,,,,,,,,,
3381,74,73,,,,,,,,,,,
3384,16,16,,,,,,,,,,,
3385,10,11,,,,,,,,,,,
3387,6,7,,,,,,,,,,,
3388,5,5,,,,,,,,,,,
3390,7,10,,,,,,,,,,,
3393,48,56,,,,,,,,,,,
3395,6,6,,,,,,,,,,,
3396,14,13,,,,,,,,,,,
3400,348,359,,,,,,,,,,,
3401,97,102,,,,,,,,,,,
3402,7,7,,,,,,,,,,,
3407,11,13,,,,,,,,,,,
3409,18,19,,,,,,,,,,,
3414,12,17,,,,,,,,,,,
3418,61,65,,,,,,,,,,,
3419,20,23,,,,,,,,,,,
3420,5,6,,,,,,,,,,,
3423,5,5,,,,,,,,,,,
3424,10,11,,,,,,,,,,,
3427,98,104,,,,,,,,,,,
3428,32,33,,,,,,,,,,,
3429,941,"1,013",,,,,,,,,,,
3430,10,10,,,,,,,,,,,
3431,124,138,,,,,,,,,,,
3432,8,10,,,,,,,,,,,
3433,7,8,,,,,,,,,,,
3434,146,156,,,,,,,,,,,
3435,92,109,,,,,,,,,,,
3437,395,422,,,,,,,,,,,
3438,94,100,,,,,,,,,,,
3440,91,96,,,,,,,,,,,
3441,75,83,,,,,,,,,,,
3442,325,347,,,,,,,,,,,
3444,400,433,,,,,,,,,,,
3446,38,41,,,,,,,,,,,
3447,18,19,,,,,,,,,,,
3448,34,40,,,,,,,,,,,
3450,301,313,,,,,,,,,,,
3451,175,180,,,,,,,,,,,
3453,51,57,,,,,,,,,,,
3458,97,99,,,,,,,,,,,
3460,201,203,,,,,,,,,,,
3461,222,237,,,,,,,,,,,
3462,36,41,,,,,,,,,,,
3463,83,88,,,,,,,,,,,
3464,27,26,,,,,,,,,,,
3465,229,244,,,,,,,,,,,
3467,38,35,,,,,,,,,,,
3468,6,7,,,,,,,,,,,
3469,9,12,,,,,,,,,,,
3472,29,30,,,,,,,,,,,
3475,9,9,,,,,,,,,,,
3477,17,19,,,,,,,,,,,
3478,60,66,,,,,,,,,,,
3480,36,41,,,,,,,,,,,
3483,29,30,,,,,,,,,,,
3485,5,6,,,,,,,,,,,
3490,29,32,,,,,,,,,,,
3494,11,14,,,,,,,,,,,
3496,157,171,,,,,,,,,,,
3498,175,190,,,,,,,,,,,
3500,968,"1,030",,,,,,,,,,,
3501,75,86,,,,,,,,,,,
3502,17,18,,,,,,,,,,,
3505,119,123,,,,,,,,,,,
3509,5,7,,,,,,,,,,,
3512,6,6,,,,,,,,,,,
3515,48,56,,,,,,,,,,,
3516,12,15,,,,,,,,,,,
3517,32,37,,,,,,,,,,,
3518,15,23,,,,,,,,,,,
3521,15,17,,,,,,,,,,,
3522,10,10,,,,,,,,,,,
3523,94,102,,,,,,,,,,,
3525,28,34,,,,,,,,,,,
3527,15,19,,,,,,,,,,,
3530,6,8,,,,,,,,,,,
3531,5,5,,,,,,,,,,,
3533,17,18,,,,,,,,,,,
3537,23,26,,,,,,,,,,,
3540,8,11,,,,,,,,,,,
3544,6,11,,,,,,,,,,,
3546,11,13,,,,,,,,,,,
3549,76,79,,,,,,,,,,,
3550,"1,345","1,449",,,,,,,,,,,
3551,748,813,,,,,,,,,,,
3552,6,6,,,,,,,,,,,
3555,418,437,,,,,,,,,,,
3556,192,209,,,,,,,,,,,
3557,15,14,,,,,,,,,,,
3558,21,24,,,,,,,,,,,
3559,15,18,,,,,,,,,,,
3561,96,108,,,,,,,,,,,
3562,17,16,,,,,,,,,,,
3563,13,13,,,,,,,,,,,
3564,667,697,,,,,,,,,,,
3566,11,12,,,,,,,,,,,
3567,11,13,,,,,,,,,,,
3568,85,91,,,,,,,,,,,
3570,15,18,,,,,,,,,,,
3571,9,10,,,,,,,,,,,
3573,7,9,,,,,,,,,,,
3575,20,21,,,,,,,,,,,
3579,171,187,,,,,,,,,,,
3580,24,23,,,,,,,,,,,
3581,6,5,,,,,,,,,,,
3583,7,9,,,,,,,,,,,
3584,27,29,,,,,,,,,,,
3585,410,457,,,,,,,,,,,
3586,28,29,,,,,,,,,,,
3588,7,9,,,,,,,,,,,
3589,7,19,,,,,,,,,,,
3590,7,9,,,,,,,,,,,
3591,7,8,,,,,,,,,,,
3594,10,10,,,,,,,,,,,
3595,11,12,,,,,,,,,,,
3597,17,21,,,,,,,,,,,
3608,72,80,,,,,,,,,,,
3610,32,36,,,,,,,,,,,
3612,29,32,,,,,,,,,,,
3614,29,32,,,,,,,,,,,
3616,145,157,,,,,,,,,,,
3618,8,9,,,,,,,,,,,
3620,229,260,,,,,,,,,,,
3621,39,43,,,,,,,,,,,
3622,10,12,,,,,,,,,,,
3623,19,21,,,,,,,,,,,
3624,7,8,,,,,,,,,,,
3629,160,179,,,,,,,,,,,
3630,957,"1,040",,,,,,,,,,,
3631,431,478,,,,,,,,,,,
3632,7,9,,,,,,,,,,,
3633,24,25,,,,,,,,,,,
3634,53,59,,,,,,,,,,,
3635,21,21,,,,,,,,,,,
3636,131,134,,,,,,,,,,,
3637,19,21,,,,,,,,,,,
3638,54,60,,,,,,,,,,,
3639,15,15,,,,,,,,,,,
3640,17,25,,,,,,,,,,,
3641,33,39,,,,,,,,,,,
3644,327,343,,,,,,,,,,,
3646,23,28,,,,,,,,,,,
3649,14,17,,,,,,,,,,,
3658,158,167,,,,,,,,,,,
3659,22,20,,,,,,,,,,,
3660,183,186,,,,,,,,,,,
3662,5,5,,,,,,,,,,,
3663,6,6,,,,,,,,,,,
3664,38,40,,,,,,,,,,,
3665,14,17,,,,,,,,,,,
3666,159,179,,,,,,,,,,,
3669,33,33,,,,,,,,,,,
3670,14,16,,,,,,,,,,,
3671,5,6,,,,,,,,,,,
3672,265,283,,,,,,,,,,,
3673,51,56,,,,,,,,,,,
3675,49,52,,,,,,,,,,,
3676,8,9,,,,,,,,,,,
3677,556,587,,,,,,,,,,,
3678,205,227,,,,,,,,,,,
3682,19,22,,,,,,,,,,,
3683,34,37,,,,,,,,,,,
3685,113,124,,,,,,,,,,,
3687,20,20,,,,,,,,,,,
3688,36,39,,,,,,,,,,,
3690,813,875,,,,,,,,,,,
3691,274,303,,,,,,,,,,,
3695,13,17,,,,,,,,,,,
3697,27,28,,,,,,,,,,,
3698,47,46,,,,,,,,,,,
3699,66,69,,,,,,,,,,,
3700,34,39,,,,,,,,,,,
3701,31,31,,,,,,,,,,,
3707,41,48,,,,,,,,,,,
3709,15,16,,,,,,,,,,,
3711,29,29,,,,,,,,,,,
3712,16,16,,,,,,,,,,,
3713,32,36,,,,,,,,,,,
3714,119,124,,,,,,,,,,,
3715,9,11,,,,,,,,,,,
3717,149,156,,,,,,,,,,,
3718,5,5,,,,,,,,,,,
3719,17,19,,,,,,,,,,,
3720,27,29,,,,,,,,,,,
3722,289,319,,,,,,,,,,,
3723,135,144,,,,,,,,,,,
3724,9,9,,,,,,,,,,,
3725,14,18,,,,,,,,,,,
3726,7,9,,,,,,,,,,,
3727,10,11,,,,,,,,,,,
3728,7,10,,,,,,,,,,,
3730,302,314,,,,,,,,,,,
3732,16,20,,,,,,,,,,,
3733,19,20,,,,,,,,,,,
3735,20,19,,,,,,,,,,,
3737,162,184,,,,,,,,,,,
3738,13,13,,,,,,,,,,,
3739,12,14,,,,,,,,,,,
3740,55,61,,,,,,,,,,,
3741,249,259,,,,,,,,,,,
3744,33,35,,,,,,,,,,,
3746,6,5,,,,,,,,,,,
3747,228,237,,,,,,,,,,,
3749,59,64,,,,,,,,,,,
3750,500,528,,,,,,,,,,,
3751,12,11,,,,,,,,,,,
3752,681,725,,,,,,,,,,,
3753,84,94,,,,,,,,,,,
3754,"1,115","1,177",,,,,,,,,,,
3755,15,16,,,,,,,,,,,
3756,325,341,,,,,,,,,,,
3757,273,300,,,,,,,,,,,
3758,70,74,,,,,,,,,,,
3759,57,64,,,,,,,,,,,
3760,24,25,,,,,,,,,,,
3761,63,65,,,,,,,,,,,
3762,8,8,,,,,,,,,,,
3763,48,59,,,,,,,,,,,
3764,263,277,,,,,,,,,,,
3765,219,235,,,,,,,,,,,
3766,47,49,,,,,,,,,,,
3767,43,45,,,,,,,,,,,
3770,178,186,,,,,,,,,,,
3775,194,206,,,,,,,,,,,
3777,524,568,,,,,,,,,,,
3778,17,17,,,,,,,,,,,
3779,32,33,,,,,,,,,,,
3781,114,122,,,,,,,,,,,
3782,279,298,,,,,,,,,,,
3783,94,93,,,,,,,,,,,
3786,45,47,,,,,,,,,,,
3787,68,73,,,,,,,,,,,
3788,102,107,,,,,,,,,,,
3789,11,10,,,,,,,,,,,
3791,67,78,,,,,,,,,,,
3792,43,43,,,,,,,,,,,
3793,167,180,,,,,,,,,,,
3795,72,76,,,,,,,,,,,
3796,358,395,,,,,,,,,,,
3797,111,117,,,,,,,,,,,
3799,183,185,,,,,,,,,,,
3802,751,799,,,,,,,,,,,
3803,691,759,,,,,,,,,,,
3804,396,413,,,,,,,,,,,
3805,"1,717","1,794",,,,,,,,,,,
3806,"1,630","1,720",,,,,,,,,,,
3807,285,304,,,,,,,,,,,
3808,146,161,,,,,,,,,,,
3809,313,333,,,,,,,,,,,
3810,"1,334","1,441",,,,,,,,,,,
3812,96,112,,,,,,,,,,,
3813,43,46,,,,,,,,,,,
3814,79,86,,,,,,,,,,,
3815,117,127,,,,,,,,,,,
3816,73,86,,,,,,,,,,,
3818,381,408,,,,,,,,,,,
3820,581,632,,,,,,,,,,,
3821,111,126,,,,,,,,,,,
3822,21,22,,,,,,,,,,,
3823,58,63,,,,,,,,,,,
3824,91,101,,,,,,,,,,,
3825,293,307,,,,,,,,,,,
3831,58,65,,,,,,,,,,,
3832,12,12,,,,,,,,,,,
3833,10,11,,,,,,,,,,,
3835,11,12,,,,,,,,,,,
3840,298,321,,,,,,,,,,,
3842,48,49,,,,,,,,,,,
3844,728,761,,,,,,,,,,,
3847,41,45,,,,,,,,,,,
3850,423,454,,,,,,,,,,,
3851,122,135,,,,,,,,,,,
3853,7,8,,,,,,,,,,,
3854,20,24,,,,,,,,,,,
3856,13,15,,,,,,,,,,,
3857,8,9,,,,,,,,,,,
3858,65,72,,,,,,,,,,,
3859,22,24,,,,,,,,,,,
3860,171,183,,,,,,,,,,,
3862,74,85,,,,,,,,,,,
3864,6,7,,,,,,,,,,,
3865,15,16,,,,,,,,,,,
3869,32,35,,,,,,,,,,,
3870,23,24,,,,,,,,,,,
3871,73,79,,,,,,,,,,,
3874,10,11,,,,,,,,,,,
3875,602,647,,,,,,,,,,,
3878,23,26,,,,,,,,,,,
3880,107,114,,,,,,,,,,,
3882,28,30,,,,,,,,,,,
3885,55,61,,,,,,,,,,,
3886,10,13,,,,,,,,,,,
3887,10,10,,,,,,,,,,,
3888,69,74,,,,,,,,,,,
3889,7,6,,,,,,,,,,,
3890,5,7,,,,,,,,,,,
3891,7,8,,,,,,,,,,,
3892,48,51,,,,,,,,,,,
3895,6,8,,,,,,,,,,,
3896,14,17,,,,,,,,,,,
3898,33,37,,,,,,,,,,,
3900,8,8,,,,,,,,,,,
3902,9,9,,,,,,,,,,,
3903,21,22,,,,,,,,,,,
3904,50,49,,,,,,,,,,,
3909,265,272,,,,,,,,,,,
3910,605,625,,,,,,,,,,,
3911,157,160,,,,,,,,,,,
3912,572,620,,,,,,,,,,,
3913,151,164,,,,,,,,,,,
3915,291,323,,,,,,,,,,,
3916,45,49,,,,,,,,,,,
3918,117,123,,,,,,,,,,,
3919,61,68,,,,,,,,,,,
3921,5,5,,,,,,,,,,,
3922,369,382,,,,,,,,,,,
3923,27,29,,,,,,,,,,,
3925,194,209,,,,,,,,,,,
3926,160,173,,,,,,,,,,,
3927,71,75,,,,,,,,,,,
3928,38,37,,,,,,,,,,,
3929,73,72,,,,,,,,,,,
3930,818,865,,,,,,,,,,,
3931,"1,276","1,349",,,,,,,,,,,
3933,77,77,,,,,,,,,,,
3934,767,815,,,,,,,,,,,
3936,493,539,,,,,,,,,,,
3937,117,125,,,,,,,,,,,
3938,124,131,,,,,,,,,,,
3939,533,574,,,,,,,,,,,
3940,113,116,,,,,,,,,,,
3941,589,636,,,,,,,,,,,
3942,119,128,,,,,,,,,,,
3943,121,122,,,,,,,,,,,
3944,34,31,,,,,,,,,,,
3945,39,38,,,,,,,,,,,
3946,8,8,,,,,,,,,,,
3950,116,132,,,,,,,,,,,
3951,35,41,,,,,,,,,,,
3953,217,236,,,,,,,,,,,
3954,13,13,,,,,,,,,,,
3956,72,79,,,,,,,,,,,
3957,5,5,,,,,,,,,,,
3959,50,53,,,,,,,,,,,
3960,88,91,,,,,,,,,,,
3962,18,18,,,,,,,,,,,
3964,11,11,,,,,,,,,,,
3965,5,5,,,,,,,,,,,
3966,11,11,,,,,,,,,,,
3971,87,89,,,,,,,,,,,
3975,523,535,,,,,,,,,,,
3976,584,594,,,,,,,,,,,
3977,"2,884","3,000",,,,,,,,,,,
3978,752,798,,,,,,,,,,,
3979,10,12,,,,,,,,,,,
3980,99,103,,,,,,,,,,,
3981,134,146,,,,,,,,,,,
3984,138,149,,,,,,,,,,,
3987,35,39,,,,,,,,,,,
3988,30,29,,,,,,,,,,,
3991,15,14,,,,,,,,,,,
3992,17,21,,,,,,,,,,,
3995,313,337,,,,,,,,,,,
3996,204,219,,,,,,,,,,,
4000,"3,088","3,237",,,,,,,,,,,
4001,65,66,,,,,,,,,,,
4004,11,12,,,,,,,,,,,
4005,862,910,,,,,,,,,,,
4006,"1,673","1,728",,,,,,,,,,,
4007,659,678,,,,,,,,,,,
4008,111,127,,,,,,,,,,,
4009,192,202,,,,,,,,,,,
4010,290,304,,,,,,,,,,,
4011,663,698,,,,,,,,,,,
4012,704,729,,,,,,,,,,,
4013,236,253,,,,,,,,,,,
4014,529,549,,,,,,,,,,,
4017,884,921,,,,,,,,,,,
4018,303,303,,,,,,,,,,,
4019,566,609,,,,,,,,,,,
4020,667,708,,,,,,,,,,,
4021,218,228,,,,,,,,,,,
4022,116,119,,,,,,,,,,,
4025,10,10,,,,,,,,,,,
4030,579,607,,,,,,,,,,,
4031,445,480,,,,,,,,,,,
4032,538,571,,,,,,,,,,,
4034,"1,407","1,494",,,,,,,,,,,
4035,771,826,,,,,,,,,,,
4036,124,139,,,,,,,,,,,
4037,243,258,,,,,,,,,,,
4051,987,"1,036",,,,,,,,,,,
4053,"1,342","1,429",,,,,,,,,,,
4054,322,332,,,,,,,,,,,
4055,482,499,,,,,,,,,,,
4059,506,522,,,,,,,,,,,
4060,488,524,,,,,,,,,,,
4061,560,596,,,,,,,,,,,
4064,"1,077","1,111",,,,,,,,,,,
4065,380,398,,,,,,,,,,,
4066,749,781,,,,,,,,,,,
4067,217,239,,,,,,,,,,,
4068,758,790,,,,,,,,,,,
4069,"1,240","1,305",,,,,,,,,,,
4070,366,377,,,,,,,,,,,
4073,325,341,,,,,,,,,,,
4074,881,920,,,,,,,,,,,
4075,753,796,,,,,,,,,,,
4076,308,338,,,,,,,,,,,
4077,803,824,,,,,,,,,,,
4078,553,574,,,,,,,,,,,
4101,"1,421","1,484",,,,,,,,,,,
4102,492,526,,,,,,,,,,,
4103,477,503,,,,,,,,,,,
4104,234,235,,,,,,,,,,,
4105,553,569,,,,,,,,,,,
4106,289,311,,,,,,,,,,,
4107,326,352,,,,,,,,,,,
4108,509,527,,,,,,,,,,,
4109,"1,591","1,652",,,,,,,,,,,
4110,627,653,,,,,,,,,,,
4111,26,28,,,,,,,,,,,
4112,312,315,,,,,,,,,,,
4113,"1,272","1,312",,,,,,,,,,,
4114,691,732,,,,,,,,,,,
4115,606,613,,,,,,,,,,,
4116,"1,008","1,036",,,,,,,,,,,
4117,85,90,,,,,,,,,,,
4118,790,829,,,,,,,,,,,
4119,522,542,,,,,,,,,,,
4120,521,536,,,,,,,,,,,
4121,844,894,,,,,,,,,,,
4122,"1,597","1,664",,,,,,,,,,,
4123,668,700,,,,,,,,,,,
4124,570,611,,,,,,,,,,,
4125,238,262,,,,,,,,,,,
4127,"1,087","1,127",,,,,,,,,,,
4128,565,597,,,,,,,,,,,
4129,388,406,,,,,,,,,,,
4130,353,375,,,,,,,,,,,
4131,295,312,,,,,,,,,,,
4132,364,389,,,,,,,,,,,
4133,440,454,,,,,,,,,,,
4151,670,703,,,,,,,,,,,
4152,"1,417","1,510",,,,,,,,,,,
4153,140,143,,,,,,,,,,,
4154,369,394,,,,,,,,,,,
4155,115,119,,,,,,,,,,,
4156,130,144,,,,,,,,,,,
4157,896,939,,,,,,,,,,,
4158,93,96,,,,,,,,,,,
4159,363,397,,,,,,,,,,,
4160,557,587,,,,,,,,,,,
4161,354,370,,,,,,,,,,,
4163,617,644,,,,,,,,,,,
4164,506,523,,,,,,,,,,,
4165,"1,026","1,095",,,,,,,,,,,
4169,674,709,,,,,,,,,,,
4170,976,"1,029",,,,,,,,,,,
4171,753,794,,,,,,,,,,,
4172,322,345,,,,,,,,,,,
4173,322,344,,,,,,,,,,,
4174,162,167,,,,,,,,,,,
4178,785,830,,,,,,,,,,,
4179,552,586,,,,,,,,,,,
4183,111,116,,,,,,,,,,,
4184,142,147,,,,,,,,,,,
4205,99,104,,,,,,,,,,,
4207,"1,737","1,835",,,,,,,,,,,
4208,745,786,,,,,,,,,,,
4209,"1,738","1,824",,,,,,,,,,,
4210,814,857,,,,,,,,,,,
4211,"2,458","2,594",,,,,,,,,,,
4212,"1,622","1,690",,,,,,,,,,,
4213,"1,435","1,525",,,,,,,,,,,
4214,"2,203","2,309",,,,,,,,,,,
4215,"2,477","2,581",,,,,,,,,,,
4216,"1,620","1,688",,,,,,,,,,,
4217,"2,985","3,079",,,,,,,,,,,
4218,"2,141","2,242",,,,,,,,,,,
4219,26,26,,,,,,,,,,,
4220,"2,347","2,463",,,,,,,,,,,
4221,"1,353","1,436",,,,,,,,,,,
4223,861,909,,,,,,,,,,,
4224,352,362,,,,,,,,,,,
4225,493,515,,,,,,,,,,,
4226,"1,680","1,765",,,,,,,,,,,
4227,"1,066","1,127",,,,,,,,,,,
4228,306,329,,,,,,,,,,,
4230,23,24,,,,,,,,,,,
4270,146,160,,,,,,,,,,,
4271,14,14,,,,,,,,,,,
4272,395,412,,,,,,,,,,,
4275,173,181,,,,,,,,,,,
4280,487,527,,,,,,,,,,,
4285,512,550,,,,,,,,,,,
4287,30,34,,,,,,,,,,,
4300,"1,402","1,478",,,,,,,,,,,
4301,462,470,,,,,,,,,,,
4303,51,53,,,,,,,,,,,
4304,296,306,,,,,,,,,,,
4305,"1,076","1,144",,,,,,,,,,,
4306,883,951,,,,,,,,,,,
4307,35,37,,,,,,,,,,,
4309,79,87,,,,,,,,,,,
4310,173,195,,,,,,,,,,,
4311,210,217,,,,,,,,,,,
4312,61,64,,,,,,,,,,,
4313,62,64,,,,,,,,,,,
4314,44,51,,,,,,,,,,,
4340,108,120,,,,,,,,,,,
4341,274,282,,,,,,,,,,,
4342,67,75,,,,,,,,,,,
4343,296,326,,,,,,,,,,,
4344,88,94,,,,,,,,,,,
4346,31,31,,,,,,,,,,,
4347,32,36,,,,,,,,,,,
4350,"2,997","3,210",,,,,,,,,,,
4352,810,869,,,,,,,,,,,
4353,13,13,,,,,,,,,,,
4354,25,28,,,,,,,,,,,
4355,69,77,,,,,,,,,,,
4356,165,171,,,,,,,,,,,
4357,66,74,,,,,,,,,,,
4358,68,80,,,,,,,,,,,
4359,41,44,,,,,,,,,,,
4360,23,22,,,,,,,,,,,
4361,100,101,,,,,,,,,,,
4362,106,114,,,,,,,,,,,
4363,23,22,,,,,,,,,,,
4364,15,16,,,,,,,,,,,
4365,13,14,,,,,,,,,,,
4370,558,604,,,,,,,,,,,
4371,25,28,,,,,,,,,,,
4372,7,7,,,,,,,,,,,
4373,36,37,,,,,,,,,,,
4374,16,18,,,,,,,,,,,
4375,9,9,,,,,,,,,,,
4376,16,17,,,,,,,,,,,
4377,20,23,,,,,,,,,,,
4378,32,32,,,,,,,,,,,
4380,292,323,,,,,,,,,,,
4381,23,22,,,,,,,,,,,
4382,35,41,,,,,,,,,,,
4383,10,10,,,,,,,,,,,
4385,51,57,,,,,,,,,,,
4387,53,56,,,,,,,,,,,
4388,18,20,,,,,,,,,,,
4390,344,404,,,,,,,,,,,
4400,32,36,,,,,,,,,,,
4401,117,126,,,,,,,,,,,
4402,14,15,,,,,,,,,,,
4403,46,49,,,,,,,,,,,
4404,31,35,,,,,,,,,,,
4405,463,490,,,,,,,,,,,
4406,85,91,,,,,,,,,,,
4407,23,29,,,,,,,,,,,
4408,41,44,,,,,,,,,,,
4410,55,63,,,,,,,,,,,
4411,29,30,,,,,,,,,,,
4412,21,21,,,,,,,,,,,
4413,202,229,,,,,,,,,,,
4415,57,64,,,,,,,,,,,
4416,31,37,,,,,,,,,,,
4417,26,33,,,,,,,,,,,
4419,31,36,,,,,,,,,,,
4420,54,70,,,,,,,,,,,
4421,58,60,,,,,,,,,,,
4422,38,46,,,,,,,,,,,
4423,20,19,,,,,,,,,,,
4424,8,9,,,,,,,,,,,
4425,9,11,,,,,,,,,,,
4426,6,7,,,,,,,,,,,
4427,18,19,,,,,,,,,,,
4428,33,33,,,,,,,,,,,
4454,32,39,,,,,,,,,,,
4455,283,323,,,,,,,,,,,
4461,5,7,,,,,,,,,,,
4462,6,7,,,,,,,,,,,
4465,37,50,,,,,,,,,,,
4467,7,10,,,,,,,,,,,
4468,14,18,,,,,,,,,,,
4470,76,80,,,,,,,,,,,
4472,40,44,,,,,,,,,,,
4477,20,24,,,,,,,,,,,
4478,28,28,,,,,,,,,,,
4480,29,36,,,,,,,,,,,
4481,6,6,,,,,,,,,,,
4486,48,53,,,,,,,,,,,
4487,121,138,,,,,,,,,,,
4488,14,15,,,,,,,,,,,
4490,49,54,,,,,,,,,,,
4491,6,7,,,,,,,,,,,
4494,12,17,,,,,,,,,,,
4496,18,21,,,,,,,,,,,
4497,28,35,,,,,,,,,,,
4498,11,11,,,,,,,,,,,
4500,"1,345","1,428",,,,,,,,,,,
4501,151,161,,,,,,,,,,,
4502,167,176,,,,,,,,,,,
4503,921,970,,,,,,,,,,,
4504,425,453,,,,,,,,,,,
4505,559,607,,,,,,,,,,,
4506,451,482,,,,,,,,,,,
4507,437,450,,,,,,,,,,,
4508,310,314,,,,,,,,,,,
4509,906,934,,,,,,,,,,,
4510,933,991,,,,,,,,,,,
4511,185,194,,,,,,,,,,,
4512,132,138,,,,,,,,,,,
4514,189,203,,,,,,,,,,,
4515,90,94,,,,,,,,,,,
4516,123,135,,,,,,,,,,,
4517,18,19,,,,,,,,,,,
4518,162,174,,,,,,,,,,,
4519,251,272,,,,,,,,,,,
4520,620,658,,,,,,,,,,,
4521,188,205,,,,,,,,,,,
4550,175,189,,,,,,,,,,,
4551,"2,199","2,305",,,,,,,,,,,
4552,392,409,,,,,,,,,,,
4553,325,335,,,,,,,,,,,
4554,105,114,,,,,,,,,,,
4555,288,308,,,,,,,,,,,
4556,"1,991","2,116",,,,,,,,,,,
4557,980,"1,036",,,,,,,,,,,
4558,"1,313","1,376",,,,,,,,,,,
4559,282,305,,,,,,,,,,,
4560,"1,112","1,167",,,,,,,,,,,
4561,400,426,,,,,,,,,,,
4562,569,594,,,,,,,,,,,
4563,416,435,,,,,,,,,,,
4564,572,606,,,,,,,,,,,
4565,600,622,,,,,,,,,,,
4566,792,832,,,,,,,,,,,
4567,"1,019","1,070",,,,,,,,,,,
4568,156,157,,,,,,,,,,,
4569,69,68,,,,,,,,,,,
4570,"1,137","1,200",,,,,,,,,,,
4571,36,36,,,,,,,,,,,
4572,247,263,,,,,,,,,,,
4573,"1,549","1,626",,,,,,,,,,,
4574,62,60,,,,,,,,,,,
4575,"1,393","1,465",,,,,,,,,,,
4580,96,103,,,,,,,,,,,
4581,93,100,,,,,,,,,,,
4600,23,23,,,,,,,,,,,
4601,39,46,,,,,,,,,,,
4605,92,103,,,,,,,,,,,
4606,58,66,,,,,,,,,,,
4608,32,36,,,,,,,,,,,
4610,375,412,,,,,,,,,,,
4611,6,6,,,,,,,,,,,
4612,7,8,,,,,,,,,,,
4613,22,27,,,,,,,,,,,
4614,26,24,,,,,,,,,,,
4615,147,157,,,,,,,,,,,
4620,10,10,,,,,,,,,,,
4621,34,38,,,,,,,,,,,
4625,72,83,,,,,,,,,,,
4626,54,66,,,,,,,,,,,
4627,12,17,,,,,,,,,,,
4630,45,47,,,,,,,,,,,
4650,557,587,,,,,,,,,,,
4655,"1,372","1,452",,,,,,,,,,,
4659,63,68,,,,,,,,,,,
4660,170,187,,,,,,,,,,,
4662,9,10,,,,,,,,,,,
4670,"1,629","1,711",,,,,,,,,,,
4671,73,75,,,,,,,,,,,
4673,13,14,,,,,,,,,,,
4674,24,26,,,,,,,,,,,
4677,160,163,,,,,,,,,,,
4678,8,9,,,,,,,,,,,
4680,929,974,,,,,,,,,,,
4694,6,6,,,,,,,,,,,
4695,13,15,,,,,,,,,,,
4699,15,19,,,,,,,,,,,
4700,605,634,,,,,,,,,,,
4701,679,735,,,,,,,,,,,
4702,585,657,,,,,,,,,,,
4703,597,627,,,,,,,,,,,
4705,11,17,,,,,,,,,,,
4707,9,8,,,,,,,,,,,
4709,6,8,,,,,,,,,,,
4710,76,83,,,,,,,,,,,
4711,29,32,,,,,,,,,,,
4712,7,9,,,,,,,,,,,
4714,22,23,,,,,,,,,,,
4715,113,122,,,,,,,,,,,
4716,14,19,,,,,,,,,,,
4717,49,51,,,,,,,,,,,
4718,38,43,,,,,,,,,,,
4719,35,38,,,,,,,,,,,
4720,364,392,,,,,,,,,,,
4721,79,97,,,,,,,,,,,
4722,43,62,,,,,,,,,,,
4723,37,43,,,,,,,,,,,
4724,29,35,,,,,,,,,,,
4725,40,43,,,,,,,,,,,
4726,6,6,,,,,,,,,,,
4727,9,10,,,,,,,,,,,
4728,7,9,,,,,,,,,,,
4730,110,119,,,,,,,,,,,
4732,7,7,,,,,,,,,,,
4735,35,35,,,,,,,,,,,
4737,138,145,,,,,,,,,,,
4738,25,28,,,,,,,,,,,
4739,7,7,,,,,,,,,,,
4740,"1,757","1,865",,,,,,,,,,,
4741,120,140,,,,,,,,,,,
4742,20,25,,,,,,,,,,,
4744,83,88,,,,,,,,,,,
4745,23,23,,,,,,,,,,,
4746,10,12,,,,,,,,,,,
4750,69,75,,,,,,,,,,,
4751,61,71,,,,,,,,,,,
4753,67,75,,,,,,,,,,,
4754,38,43,,,,,,,,,,,
4756,13,14,,,,,,,,,,,
4757,13,11,,,,,,,,,,,
4798,17,24,,,,,,,,,,,
4799,23,24,,,,,,,,,,,
4800,376,388,,,,,,,,,,,
4802,754,772,,,,,,,,,,,
4803,17,17,,,,,,,,,,,
4804,24,30,,,,,,,,,,,
4805,205,234,,,,,,,,,,,
4806,64,68,,,,,,,,,,,
4807,271,282,,,,,,,,,,,
4808,20,20,,,,,,,,,,,
4809,32,35,,,,,,,,,,,
4810,924,956,,,,,,,,,,,
4811,220,241,,,,,,,,,,,
4812,603,620,,,,,,,,,,,
4814,"1,016","1,056",,,,,,,,,,,
4815,220,244,,,,,,,,,,,
4816,175,181,,,,,,,,,,,
4817,552,573,,,,,,,,,,,
4818,539,575,,,,,,,,,,,
4819,130,133,,,,,,,,,,,
4820,163,176,,,,,,,,,,,
4821,47,51,,,,,,,,,,,
4822,17,22,,,,,,,,,,,
4823,20,28,,,,,,,,,,,
4824,38,38,,,,,,,,,,,
4825,247,260,,,,,,,,,,,
4828,8,8,,,,,,,,,,,
4829,8,10,,,,,,,,,,,
4830,11,11,,,,,,,,,,,
4849,46,47,,,,,,,,,,,
4850,339,373,,,,,,,,,,,
4852,200,209,,,,,,,,,,,
4854,147,163,,,,,,,,,,,
4855,27,32,,,,,,,,,,,
4856,14,15,,,,,,,,,,,
4858,37,40,,,,,,,,,,,
4859,9,9,,,,,,,,,,,
4860,281,296,,,,,,,,,,,
4861,30,30,,,,,,,,,,,
4865,200,237,,,,,,,,,,,
4868,529,560,,,,,,,,,,,
4869,409,426,,,,,,,,,,,
4870,"3,643","3,786",,,,,,,,,,,
4871,262,277,,,,,,,,,,,
4872,144,163,,,,,,,,,,,
4873,329,342,,,,,,,,,,,
4874,72,74,,,,,,,,,,,
4875,62,63,,,,,,,,,,,
4876,18,22,,,,,,,,,,,
4877,526,539,,,,,,,,,,,
4878,506,523,,,,,,,,,,,
4879,783,814,,,,,,,,,,,
4880,386,396,,,,,,,,,,,
4881,265,269,,,,,,,,,,,
4882,102,112,,,,,,,,,,,
4883,310,327,,,,,,,,,,,
4884,90,92,,,,,,,,,,,
4885,125,138,,,,,,,,,,,
4886,19,23,,,,,,,,,,,
4887,37,41,,,,,,,,,,,
4888,68,69,,,,,,,,,,,
4890,23,24,,,,,,,,,,,
4891,26,28,,,,,,,,,,,
4892,19,20,,,,,,,,,,,
4895,98,104,,,,,,,,,,,
5000,"3,075","3,210",,,,,,,,,,,
5001,18,16,,,,,,,,,,,
5005,8,8,,,,,,,,,,,
5006,553,568,,,,,,,,,,,
5007,444,462,,,,,,,,,,,
5008,425,446,,,,,,,,,,,
5009,328,343,,,,,,,,,,,
5010,172,176,,,,,,,,,,,
5011,376,400,,,,,,,,,,,
5012,262,272,,,,,,,,,,,
5013,376,430,,,,,,,,,,,
5014,344,376,,,,,,,,,,,
5015,286,306,,,,,,,,,,,
5016,183,201,,,,,,,,,,,
5017,49,50,,,,,,,,,,,
5018,89,100,,,,,,,,,,,
5019,213,229,,,,,,,,,,,
5020,66,71,,,,,,,,,,,
5021,206,210,,,,,,,,,,,
5022,522,550,,,,,,,,,,,
5023,419,434,,,,,,,,,,,
5024,408,429,,,,,,,,,,,
5025,263,273,,,,,,,,,,,
5031,629,668,,,,,,,,,,,
5032,366,401,,,,,,,,,,,
5033,358,379,,,,,,,,,,,
5034,530,544,,,,,,,,,,,
5035,293,314,,,,,,,,,,,
5037,319,327,,,,,,,,,,,
5038,456,483,,,,,,,,,,,
5039,465,484,,,,,,,,,,,
5040,59,64,,,,,,,,,,,
5041,410,431,,,,,,,,,,,
5042,353,370,,,,,,,,,,,
5043,388,412,,,,,,,,,,,
5044,386,423,,,,,,,,,,,
5045,671,701,,,,,,,,,,,
5046,244,258,,,,,,,,,,,
5047,197,210,,,,,,,,,,,
5048,432,456,,,,,,,,,,,
5049,320,340,,,,,,,,,,,
5050,153,166,,,,,,,,,,,
5051,420,439,,,,,,,,,,,
5052,181,190,,,,,,,,,,,
5061,662,684,,,,,,,,,,,
5062,534,555,,,,,,,,,,,
5063,739,786,,,,,,,,,,,
5064,397,420,,,,,,,,,,,
5065,533,567,,,,,,,,,,,
5066,469,490,,,,,,,,,,,
5067,"1,043","1,120",,,,,,,,,,,
5068,436,462,,,,,,,,,,,
5069,570,589,,,,,,,,,,,
5070,533,572,,,,,,,,,,,
5071,11,10,,,,,,,,,,,
5072,403,435,,,,,,,,,,,
5073,436,465,,,,,,,,,,,
5074,416,454,,,,,,,,,,,
5075,278,297,,,,,,,,,,,
5076,250,263,,,,,,,,,,,
5081,377,397,,,,,,,,,,,
5082,567,594,,,,,,,,,,,
5083,219,236,,,,,,,,,,,
5084,352,382,,,,,,,,,,,
5085,556,583,,,,,,,,,,,
5086,422,449,,,,,,,,,,,
5087,340,364,,,,,,,,,,,
5088,148,160,,,,,,,,,,,
5089,158,173,,,,,,,,,,,
5090,132,137,,,,,,,,,,,
5091,176,186,,,,,,,,,,,
5092,415,434,,,,,,,,,,,
5093,191,198,,,,,,,,,,,
5094,174,194,,,,,,,,,,,
5095,625,658,,,,,,,,,,,
5096,330,374,,,,,,,,,,,
5097,279,295,,,,,,,,,,,
5098,235,242,,,,,,,,,,,
5106,70,75,,,,,,,,,,,
5107,331,345,,,,,,,,,,,
5108,580,621,,,,,,,,,,,
5109,324,350,,,,,,,,,,,
5110,188,204,,,,,,,,,,,
5111,16,18,,,,,,,,,,,
5112,255,262,,,,,,,,,,,
5113,155,170,,,,,,,,,,,
5114,417,432,,,,,,,,,,,
5115,118,129,,,,,,,,,,,
5116,133,147,,,,,,,,,,,
5117,63,73,,,,,,,,,,,
5118,483,506,,,,,,,,,,,
5120,116,130,,,,,,,,,,,
5121,49,52,,,,,,,,,,,
5125,431,456,,,,,,,,,,,
5126,142,151,,,,,,,,,,,
5127,135,140,,,,,,,,,,,
5131,44,52,,,,,,,,,,,
5132,15,18,,,,,,,,,,,
5133,8,11,,,,,,,,,,,
5134,17,19,,,,,,,,,,,
5136,22,22,,,,,,,,,,,
5137,24,24,,,,,,,,,,,
5138,20,21,,,,,,,,,,,
5139,7,7,,,,,,,,,,,
5140,13,11,,,,,,,,,,,
5141,21,22,,,,,,,,,,,
5142,29,31,,,,,,,,,,,
5144,20,24,,,,,,,,,,,
5151,14,16,,,,,,,,,,,
5152,287,310,,,,,,,,,,,
5153,237,243,,,,,,,,,,,
5154,129,135,,,,,,,,,,,
5155,134,141,,,,,,,,,,,
5156,31,38,,,,,,,,,,,
5157,104,111,,,,,,,,,,,
5158,590,628,,,,,,,,,,,
5159,718,758,,,,,,,,,,,
5160,224,247,,,,,,,,,,,
5161,198,208,,,,,,,,,,,
5162,608,640,,,,,,,,,,,
5163,208,224,,,,,,,,,,,
5164,32,33,,,,,,,,,,,
5165,151,161,,,,,,,,,,,
5166,29,28,,,,,,,,,,,
5167,138,146,,,,,,,,,,,
5168,135,147,,,,,,,,,,,
5169,365,395,,,,,,,,,,,
5170,36,40,,,,,,,,,,,
5171,326,347,,,,,,,,,,,
5172,196,213,,,,,,,,,,,
5173,327,353,,,,,,,,,,,
5174,69,77,,,,,,,,,,,
5201,69,75,,,,,,,,,,,
5202,27,31,,,,,,,,,,,
5203,40,48,,,,,,,,,,,
5204,97,103,,,,,,,,,,,
5210,66,69,,,,,,,,,,,
5211,448,479,,,,,,,,,,,
5212,78,84,,,,,,,,,,,
5213,54,58,,,,,,,,,,,
5214,201,207,,,,,,,,,,,
5220,19,22,,,,,,,,,,,
5221,12,14,,,,,,,,,,,
5222,35,39,,,,,,,,,,,
5223,180,209,,,,,,,,,,,
5231,42,42,,,,,,,,,,,
5232,12,12,,,,,,,,,,,
5233,49,54,,,,,,,,,,,
5234,37,40,,,,,,,,,,,
5235,83,92,,,,,,,,,,,
5236,7,7,,,,,,,,,,,
5237,11,10,,,,,,,,,,,
5238,83,95,,,,,,,,,,,
5240,19,21,,,,,,,,,,,
5241,75,80,,,,,,,,,,,
5242,50,61,,,,,,,,,,,
5243,33,38,,,,,,,,,,,
5244,163,170,,,,,,,,,,,
5245,181,192,,,,,,,,,,,
5250,115,124,,,,,,,,,,,
5251,436,479,,,,,,,,,,,
5252,148,155,,,,,,,,,,,
5253,331,347,,,,,,,,,,,
5254,52,59,,,,,,,,,,,
5255,282,307,,,,,,,,,,,
5256,23,24,,,,,,,,,,,
5259,17,19,,,,,,,,,,,
5260,33,37,,,,,,,,,,,
5261,11,12,,,,,,,,,,,
5263,20,20,,,,,,,,,,,
5264,50,53,,,,,,,,,,,
5265,9,11,,,,,,,,,,,
5266,15,17,,,,,,,,,,,
5267,40,42,,,,,,,,,,,
5268,50,54,,,,,,,,,,,
5269,5,5,,,,,,,,,,,
5270,12,12,,,,,,,,,,,
5271,183,194,,,,,,,,,,,
5272,19,21,,,,,,,,,,,
5275,62,70,,,,,,,,,,,
5276,84,90,,,,,,,,,,,
5277,74,80,,,,,,,,,,,
5278,5,6,,,,,,,,,,,
5280,161,173,,,,,,,,,,,
5290,573,616,,,,,,,,,,,
5291,168,181,,,,,,,,,,,
5301,7,10,,,,,,,,,,,
5302,16,16,,,,,,,,,,,
5304,11,18,,,,,,,,,,,
5307,13,12,,,,,,,,,,,
5311,6,5,,,,,,,,,,,
5320,20,19,,,,,,,,,,,
5321,7,6,,,,,,,,,,,
5322,14,17,,,,,,,,,,,
5330,96,101,,,,,,,,,,,
5331,10,11,,,,,,,,,,,
5332,9,10,,,,,,,,,,,
5333,160,176,,,,,,,,,,,
5340,28,30,,,,,,,,,,,
5341,185,193,,,,,,,,,,,
5342,22,25,,,,,,,,,,,
5343,144,143,,,,,,,,,,,
5344,17,16,,,,,,,,,,,
5345,47,54,,,,,,,,,,,
5346,8,9,,,,,,,,,,,
5350,13,14,,,,,,,,,,,
5351,148,156,,,,,,,,,,,
5352,258,270,,,,,,,,,,,
5353,160,179,,,,,,,,,,,
5354,7,8,,,,,,,,,,,
5355,236,245,,,,,,,,,,,
5356,25,26,,,,,,,,,,,
5357,9,12,,,,,,,,,,,
5360,51,56,,,,,,,,,,,
5371,37,38,,,,,,,,,,,
5372,39,40,,,,,,,,,,,
5373,82,94,,,,,,,,,,,
5374,48,60,,,,,,,,,,,
5381,8,14,,,,,,,,,,,
5400,17,17,,,,,,,,,,,
5401,20,22,,,,,,,,,,,
5410,6,7,,,,,,,,,,,
5411,9,10,,,,,,,,,,,
5412,18,22,,,,,,,,,,,
5413,27,34,,,,,,,,,,,
5414,7,8,,,,,,,,,,,
5415,9,10,,,,,,,,,,,
5416,6,8,,,,,,,,,,,
5417,42,47,,,,,,,,,,,
5418,6,6,,,,,,,,,,,
5419,12,13,,,,,,,,,,,
5422,35,38,,,,,,,,,,,
5431,41,49,,,,,,,,,,,
5432,11,13,,,,,,,,,,,
5433,37,37,,,,,,,,,,,
5434,33,32,,,,,,,,,,,
5440,12,13,,,,,,,,,,,
5451,42,49,,,,,,,,,,,
5452,26,29,,,,,,,,,,,
5453,247,272,,,,,,,,,,,
5454,14,18,,,,,,,,,,,
5460,14,15,,,,,,,,,,,
5461,47,55,,,,,,,,,,,
5462,17,23,,,,,,,,,,,
5464,12,16,,,,,,,,,,,
5470,5,6,,,,,,,,,,,
5473,16,16,,,,,,,,,,,
5480,17,22,,,,,,,,,,,
5481,12,11,,,,,,,,,,,
5482,27,32,,,,,,,,,,,
5483,18,19,,,,,,,,,,,
5485,21,23,,,,,,,,,,,
5490,6,6,,,,,,,,,,,
5491,55,61,,,,,,,,,,,
5495,12,13,,,,,,,,,,,
5501,151,171,,,,,,,,,,,
5502,25,30,,,,,,,,,,,
5520,9,14,,,,,,,,,,,
5522,28,28,,,,,,,,,,,
5523,38,41,,,,,,,,,,,
5540,197,218,,,,,,,,,,,
5550,17,21,,,,,,,,,,,
5552,8,10,,,,,,,,,,,
5554,113,124,,,,,,,,,,,
5555,20,24,,,,,,,,,,,
5556,96,102,,,,,,,,,,,
5558,115,119,,,,,,,,,,,
5560,14,17,,,,,,,,,,,
5570,13,17,,,,,,,,,,,
5571,48,59,,,,,,,,,,,
5572,8,9,,,,,,,,,,,
5573,50,54,,,,,,,,,,,
5575,88,91,,,,,,,,,,,
5576,34,39,,,,,,,,,,,
5577,20,23,,,,,,,,,,,
5580,8,9,,,,,,,,,,,
5581,21,25,,,,,,,,,,,
5582,16,17,,,,,,,,,,,
5583,25,26,,,,,,,,,,,
5600,124,130,,,,,,,,,,,
5602,50,52,,,,,,,,,,,
5603,34,40,,,,,,,,,,,
5604,12,13,,,,,,,,,,,
5605,40,52,,,,,,,,,,,
5606,550,589,,,,,,,,,,,
5607,164,193,,,,,,,,,,,
5608,92,95,,,,,,,,,,,
5609,19,19,,,,,,,,,,,
5630,7,7,,,,,,,,,,,
5631,44,50,,,,,,,,,,,
5632,6,10,,,,,,,,,,,
5633,23,24,,,,,,,,,,,
5640,43,46,,,,,,,,,,,
5641,39,52,,,,,,,,,,,
5642,19,23,,,,,,,,,,,
5650,8,10,,,,,,,,,,,
5652,26,33,,,,,,,,,,,
5654,11,14,,,,,,,,,,,
5661,6,6,,,,,,,,,,,
5670,28,30,,,,,,,,,,,
5671,11,13,,,,,,,,,,,
5680,108,116,,,,,,,,,,,
5690,114,121,,,,,,,,,,,
5700,159,170,,,,,,,,,,,
5701,5,5,,,,,,,,,,,
5710,15,18,,,,,,,,,,,
5720,6,6,,,,,,,,,,,
5723,51,50,,,,,,,,,,,
5725,34,37,,,,,,,,,,,
5730,15,16,,,,,,,,,,,
5731,7,7,,,,,,,,,,,
5732,10,10,,,,,,,,,,,
5950,19,20,,,,,,,,,,,
6000,"1,997","2,103",,,,,,,,,,,
6003,333,336,,,,,,,,,,,
6004,468,481,,,,,,,,,,,
6005,"1,007","1,068",,,,,,,,,,,
6006,464,494,,,,,,,,,,,
6007,598,625,,,,,,,,,,,
6008,"1,335","1,386",,,,,,,,,,,
6009,955,982,,,,,,,,,,,
6010,772,815,,,,,,,,,,,
6011,529,544,,,,,,,,,,,
6012,319,334,,,,,,,,,,,
6014,834,862,,,,,,,,,,,
6015,294,312,,,,,,,,,,,
6016,433,462,,,,,,,,,,,
6017,"1,090","1,142",,,,,,,,,,,
6018,"1,237","1,289",,,,,,,,,,,
6019,831,872,,,,,,,,,,,
6020,856,891,,,,,,,,,,,
6021,"1,036","1,095",,,,,,,,,,,
6022,117,129,,,,,,,,,,,
6023,512,541,,,,,,,,,,,
6024,370,395,,,,,,,,,,,
6025,967,"1,005",,,,,,,,,,,
6026,615,650,,,,,,,,,,,
6027,"1,556","1,634",,,,,,,,,,,
6028,738,780,,,,,,,,,,,
6029,130,136,,,,,,,,,,,
6030,"1,037","1,074",,,,,,,,,,,
6031,390,413,,,,,,,,,,,
6032,11,12,,,,,,,,,,,
6033,41,41,,,,,,,,,,,
6034,47,48,,,,,,,,,,,
6035,202,214,,,,,,,,,,,
6036,355,366,,,,,,,,,,,
6037,93,98,,,,,,,,,,,
6038,161,162,,,,,,,,,,,
6041,25,29,,,,,,,,,,,
6043,9,9,,,,,,,,,,,
6044,59,58,,,,,,,,,,,
6050,664,709,,,,,,,,,,,
6051,412,436,,,,,,,,,,,
6052,378,411,,,,,,,,,,,
6053,626,659,,,,,,,,,,,
6054,539,564,,,,,,,,,,,
6055,706,726,,,,,,,,,,,
6056,"1,033","1,113",,,,,,,,,,,
6057,338,355,,,,,,,,,,,
6058,264,276,,,,,,,,,,,
6059,824,850,,,,,,,,,,,
6060,732,749,,,,,,,,,,,
6061,"1,163","1,171",,,,,,,,,,,
6062,"1,108","1,163",,,,,,,,,,,
6063,354,354,,,,,,,,,,,
6064,767,811,,,,,,,,,,,
6065,"2,464","2,593",,,,,,,,,,,
6066,449,484,,,,,,,,,,,
6068,5,5,,,,,,,,,,,
6069,854,882,,,,,,,,,,,
6070,130,133,,,,,,,,,,,
6071,113,122,,,,,,,,,,,
6072,23,25,,,,,,,,,,,
6073,129,137,,,,,,,,,,,
6074,23,23,,,,,,,,,,,
6076,669,717,,,,,,,,,,,
6077,98,113,,,,,,,,,,,
6078,39,46,,,,,,,,,,,
6081,124,139,,,,,,,,,,,
6082,65,66,,,,,,,,,,,
6083,101,110,,,,,,,,,,,
6084,189,213,,,,,,,,,,,
6090,722,797,,,,,,,,,,,
6100,599,640,,,,,,,,,,,
6101,617,646,,,,,,,,,,,
6102,359,365,,,,,,,,,,,
6103,294,312,,,,,,,,,,,
6104,561,588,,,,,,,,,,,
6105,475,499,,,,,,,,,,,
6106,361,395,,,,,,,,,,,
6107,"1,349","1,394",,,,,,,,,,,
6108,504,532,,,,,,,,,,,
6109,482,513,,,,,,,,,,,
6110,894,947,,,,,,,,,,,
6111,487,526,,,,,,,,,,,
6112,"1,209","1,266",,,,,,,,,,,
6121,118,133,,,,,,,,,,,
6122,338,371,,,,,,,,,,,
6123,38,40,,,,,,,,,,,
6124,24,28,,,,,,,,,,,
6125,89,100,,,,,,,,,,,
6126,5,7,,,,,,,,,,,
6147,331,353,,,,,,,,,,,
6148,499,518,,,,,,,,,,,
6149,516,533,,,,,,,,,,,
6150,408,421,,,,,,,,,,,
6151,744,790,,,,,,,,,,,
6152,770,799,,,,,,,,,,,
6153,945,990,,,,,,,,,,,
6154,560,586,,,,,,,,,,,
6155,"1,840","1,946",,,,,,,,,,,
6156,556,598,,,,,,,,,,,
6157,471,507,,,,,,,,,,,
6158,350,376,,,,,,,,,,,
6159,211,226,,,,,,,,,,,
6160,813,844,,,,,,,,,,,
6161,6,6,,,,,,,,,,,
6162,521,562,,,,,,,,,,,
6163,"1,980","2,057",,,,,,,,,,,
6164,"1,605","1,670",,,,,,,,,,,
6165,45,51,,,,,,,,,,,
6166,355,389,,,,,,,,,,,
6167,428,448,,,,,,,,,,,
6168,514,549,,,,,,,,,,,
6169,482,508,,,,,,,,,,,
6170,217,217,,,,,,,,,,,
6171,516,545,,,,,,,,,,,
6172,248,256,,,,,,,,,,,
6173,218,234,,,,,,,,,,,
6174,73,80,,,,,,,,,,,
6175,68,74,,,,,,,,,,,
6176,49,50,,,,,,,,,,,
6180,79,79,,,,,,,,,,,
6181,11,11,,,,,,,,,,,
6207,30,35,,,,,,,,,,,
6208,198,207,,,,,,,,,,,
6209,45,49,,,,,,,,,,,
6210,"1,541","1,630",,,,,,,,,,,
6211,153,157,,,,,,,,,,,
6213,17,19,,,,,,,,,,,
6214,11,12,,,,,,,,,,,
6215,72,71,,,,,,,,,,,
6218,7,8,,,,,,,,,,,
6220,80,85,,,,,,,,,,,
6221,8,9,,,,,,,,,,,
6223,8,9,,,,,,,,,,,
6224,29,31,,,,,,,,,,,
6225,104,117,,,,,,,,,,,
6226,14,15,,,,,,,,,,,
6227,14,14,,,,,,,,,,,
6228,5,5,,,,,,,,,,,
6229,39,45,,,,,,,,,,,
6230,"1,172","1,230",,,,,,,,,,,
6231,13,15,,,,,,,,,,,
6232,141,151,,,,,,,,,,,
6233,286,294,,,,,,,,,,,
6236,66,73,,,,,,,,,,,
6237,68,78,,,,,,,,,,,
6239,106,112,,,,,,,,,,,
6244,84,94,,,,,,,,,,,
6251,12,14,,,,,,,,,,,
6252,8,8,,,,,,,,,,,
6253,25,26,,,,,,,,,,,
6254,6,8,,,,,,,,,,,
6255,130,137,,,,,,,,,,,
6256,14,13,,,,,,,,,,,
6258,184,227,,,,,,,,,,,
6260,75,82,,,,,,,,,,,
6262,28,29,,,,,,,,,,,
6271,76,82,,,,,,,,,,,
6275,74,79,,,,,,,,,,,
6280,"1,124","1,177",,,,,,,,,,,
6281,568,612,,,,,,,,,,,
6282,150,156,,,,,,,,,,,
6284,130,140,,,,,,,,,,,
6285,759,781,,,,,,,,,,,
6286,50,52,,,,,,,,,,,
6288,33,37,,,,,,,,,,,
6290,89,93,,,,,,,,,,,
6302,115,129,,,,,,,,,,,
6304,48,55,,,,,,,,,,,
6306,35,47,,,,,,,,,,,
6308,52,59,,,,,,,,,,,
6309,7,9,,,,,,,,,,,
6311,22,23,,,,,,,,,,,
6312,150,162,,,,,,,,,,,
6313,6,6,,,,,,,,,,,
6315,72,88,,,,,,,,,,,
6316,12,21,,,,,,,,,,,
6317,76,96,,,,,,,,,,,
6318,12,15,,,,,,,,,,,
6320,18,28,,,,,,,,,,,
6321,13,23,,,,,,,,,,,
6322,6,8,,,,,,,,,,,
6323,22,27,,,,,,,,,,,
6324,109,117,,,,,,,,,,,
6326,23,31,,,,,,,,,,,
6327,10,12,,,,,,,,,,,
6328,16,19,,,,,,,,,,,
6330,"1,064","1,148",,,,,,,,,,,
6331,10,10,,,,,,,,,,,
6332,6,5,,,,,,,,,,,
6333,327,361,,,,,,,,,,,
6335,32,41,,,,,,,,,,,
6336,12,17,,,,,,,,,,,
6337,23,25,,,,,,,,,,,
6338,46,49,,,,,,,,,,,
6341,12,14,,,,,,,,,,,
6343,17,22,,,,,,,,,,,
6346,33,37,,,,,,,,,,,
6348,15,17,,,,,,,,,,,
6350,15,16,,,,,,,,,,,
6352,12,16,,,,,,,,,,,
6353,51,56,,,,,,,,,,,
6355,36,43,,,,,,,,,,,
6356,9,9,,,,,,,,,,,
6357,7,8,,,,,,,,,,,
6358,11,13,,,,,,,,,,,
6359,40,42,,,,,,,,,,,
6361,6,9,,,,,,,,,,,
6363,5,6,,,,,,,,,,,
6365,22,22,,,,,,,,,,,
6367,7,10,,,,,,,,,,,
6369,43,48,,,,,,,,,,,
6370,17,23,,,,,,,,,,,
6372,7,8,,,,,,,,,,,
6375,37,42,,,,,,,,,,,
6383,26,31,,,,,,,,,,,
6386,7,6,,,,,,,,,,,
6390,14,16,,,,,,,,,,,
6391,37,44,,,,,,,,,,,
6392,25,29,,,,,,,,,,,
6393,8,11,,,,,,,,,,,
6394,9,11,,,,,,,,,,,
6395,80,109,,,,,,,,,,,
6396,15,19,,,,,,,,,,,
6398,41,42,,,,,,,,,,,
6401,178,207,,,,,,,,,,,
6403,6,9,,,,,,,,,,,
6405,8,11,,,,,,,,,,,
6407,34,36,,,,,,,,,,,
6409,20,22,,,,,,,,,,,
6410,28,28,,,,,,,,,,,
6411,16,17,,,,,,,,,,,
6415,66,83,,,,,,,,,,,
6418,41,44,,,,,,,,,,,
6419,6,6,,,,,,,,,,,
6420,9,11,,,,,,,,,,,
6421,7,8,,,,,,,,,,,
6423,5,5,,,,,,,,,,,
6425,12,13,,,,,,,,,,,
6426,18,20,,,,,,,,,,,
6430,448,467,,,,,,,,,,,
6432,95,101,,,,,,,,,,,
6438,6,8,,,,,,,,,,,
6440,6,6,,,,,,,,,,,
6442,7,10,,,,,,,,,,,
6443,18,17,,,,,,,,,,,
6445,15,17,,,,,,,,,,,
6446,7,9,,,,,,,,,,,
6447,12,14,,,,,,,,,,,
6448,7,10,,,,,,,,,,,
6450,412,459,,,,,,,,,,,
6460,27,34,,,,,,,,,,,
6461,29,34,,,,,,,,,,,
6462,5,5,,,,,,,,,,,
6468,17,17,,,,,,,,,,,
6472,14,18,,,,,,,,,,,
6473,5,6,,,,,,,,,,,
6475,21,22,,,,,,,,,,,
6477,16,17,,,,,,,,,,,
6479,26,31,,,,,,,,,,,
6485,24,27,,,,,,,,,,,
6488,13,15,,,,,,,,,,,
6490,6,6,,,,,,,,,,,
6501,31,38,,,,,,,,,,,
6502,38,39,,,,,,,,,,,
6503,67,76,,,,,,,,,,,
6504,6,6,,,,,,,,,,,
6505,7,9,,,,,,,,,,,
6507,26,26,,,,,,,,,,,
6509,7,7,,,,,,,,,,,
6510,58,65,,,,,,,,,,,
6511,40,39,,,,,,,,,,,
6512,8,8,,,,,,,,,,,
6514,20,19,,,,,,,,,,,
6515,25,28,,,,,,,,,,,
6516,81,85,,,,,,,,,,,
6517,20,20,,,,,,,,,,,
6518,10,14,,,,,,,,,,,
6519,21,23,,,,,,,,,,,
6521,21,24,,,,,,,,,,,
6522,18,20,,,,,,,,,,,
6525,106,112,,,,,,,,,,,
6528,18,18,,,,,,,,,,,
6530,959,"1,001",,,,,,,,,,,
6531,16,18,,,,,,,,,,,
6532,185,200,,,,,,,,,,,
6535,58,62,,,,,,,,,,,
6536,93,93,,,,,,,,,,,
6537,43,43,,,,,,,,,,,
6556,45,46,,,,,,,,,,,
6558,18,20,,,,,,,,,,,
6560,13,14,,,,,,,,,,,
6562,19,24,,,,,,,,,,,
6566,93,97,,,,,,,,,,,
6567,5,6,,,,,,,,,,,
6568,11,12,,,,,,,,,,,
6569,12,15,,,,,,,,,,,
6571,5,6,,,,,,,,,,,
6575,13,18,,,,,,,,,,,
6603,34,35,,,,,,,,,,,
6606,11,17,,,,,,,,,,,
6608,8,8,,,,,,,,,,,
6609,29,31,,,,,,,,,,,
6612,11,12,,,,,,,,,,,
6613,5,6,,,,,,,,,,,
6620,13,16,,,,,,,,,,,
6623,13,16,,,,,,,,,,,
6630,18,21,,,,,,,,,,,
6631,5,5,,,,,,,,,,,
6638,10,10,,,,,,,,,,,
6640,5,5,,,,,,,,,,,
6642,17,17,,,,,,,,,,,
6646,8,9,,,,,,,,,,,
6701,165,177,,,,,,,,,,,
6707,159,166,,,,,,,,,,,
6710,5,6,,,,,,,,,,,
6713,27,29,,,,,,,,,,,
6714,213,218,,,,,,,,,,,
6718,11,8,,,,,,,,,,,
6720,10,11,,,,,,,,,,,
6721,87,96,,,,,,,,,,,
6722,85,86,,,,,,,,,,,
6725,421,442,,,,,,,,,,,
6726,128,128,,,,,,,,,,,
6728,62,66,,,,,,,,,,,
6740,17,18,,,,,,,,,,,
6743,197,204,,,,,,,,,,,
6751,29,32,,,,,,,,,,,
6753,38,35,,,,,,,,,,,
6754,7,8,,,,,,,,,,,
6760,5,7,,,,,,,,,,,
6765,22,23,,,,,,,,,,,
6770,20,20,,,,,,,,,,,
6798,44,46,,,,,,,,,,,
6799,21,22,,,,,,,,,,,
6865,6,6,,,,,,,,,,,
6872,10,12,,,,,,,,,,,
6901,6,6,,,,,,,,,,,
6903,5,5,,,,,,,,,,,
6904,9,11,,,,,,,,,,,
6914,6,5,,,,,,,,,,,
6916,5,5,,,,,,,,,,,
6951,12,15,,,,,,,,,,,
6959,7,7,,,,,,,,,,,
6979,5,5,,,,,,,,,,,
7000,"1,298","1,347",,,,,,,,,,,
7001,14,14,,,,,,,,,,,
7004,400,424,,,,,,,,,,,
7005,463,480,,,,,,,,,,,
7007,80,83,,,,,,,,,,,
7008,317,324,,,,,,,,,,,
7009,437,456,,,,,,,,,,,
7010,354,360,,,,,,,,,,,
7011,175,174,,,,,,,,,,,
7012,13,14,,,,,,,,,,,
7015,192,197,,,,,,,,,,,
7016,21,20,,,,,,,,,,,
7017,106,120,,,,,,,,,,,
7018,499,525,,,,,,,,,,,
7019,65,69,,,,,,,,,,,
7020,82,86,,,,,,,,,,,
7021,82,85,,,,,,,,,,,
7022,29,28,,,,,,,,,,,
7023,9,10,,,,,,,,,,,
7024,21,24,,,,,,,,,,,
7025,72,75,,,,,,,,,,,
7026,14,13,,,,,,,,,,,
7030,237,261,,,,,,,,,,,
7050,368,391,,,,,,,,,,,
7051,6,6,,,,,,,,,,,
7052,175,181,,,,,,,,,,,
7053,111,115,,,,,,,,,,,
7054,263,278,,,,,,,,,,,
7055,29,30,,,,,,,,,,,
7109,260,273,,,,,,,,,,,
7112,110,109,,,,,,,,,,,
7113,29,31,,,,,,,,,,,
7116,60,63,,,,,,,,,,,
7117,36,36,,,,,,,,,,,
7120,31,36,,,,,,,,,,,
7140,168,184,,,,,,,,,,,
7150,95,101,,,,,,,,,,,
7155,32,32,,,,,,,,,,,
7162,25,28,,,,,,,,,,,
7163,16,16,,,,,,,,,,,
7170,247,259,,,,,,,,,,,
7171,68,72,,,,,,,,,,,
7172,100,108,,,,,,,,,,,
7173,165,168,,,,,,,,,,,
7174,13,14,,,,,,,,,,,
7175,9,11,,,,,,,,,,,
7177,28,28,,,,,,,,,,,
7178,7,7,,,,,,,,,,,
7179,29,33,,,,,,,,,,,
7180,9,9,,,,,,,,,,,
7182,13,13,,,,,,,,,,,
7184,25,25,,,,,,,,,,,
7190,126,136,,,,,,,,,,,
7209,23,23,,,,,,,,,,,
7210,26,27,,,,,,,,,,,
7211,5,5,,,,,,,,,,,
7212,65,69,,,,,,,,,,,
7213,8,9,,,,,,,,,,,
7214,12,13,,,,,,,,,,,
7215,170,174,,,,,,,,,,,
7216,153,161,,,,,,,,,,,
7248,343,354,,,,,,,,,,,
7249,333,365,,,,,,,,,,,
7250,"1,603","1,706",,,,,,,,,,,
7252,60,64,,,,,,,,,,,
7253,63,65,,,,,,,,,,,
7254,19,19,,,,,,,,,,,
7255,35,38,,,,,,,,,,,
7256,61,66,,,,,,,,,,,
7258,50,54,,,,,,,,,,,
7259,8,7,,,,,,,,,,,
7260,79,89,,,,,,,,,,,
7261,13,14,,,,,,,,,,,
7262,62,66,,,,,,,,,,,
7263,5,6,,,,,,,,,,,
7264,18,18,,,,,,,,,,,
7267,12,14,,,,,,,,,,,
7268,36,40,,,,,,,,,,,
7270,79,88,,,,,,,,,,,
7275,79,84,,,,,,,,,,,
7276,15,16,,,,,,,,,,,
7277,161,173,,,,,,,,,,,
7290,42,45,,,,,,,,,,,
7291,14,15,,,,,,,,,,,
7292,20,21,,,,,,,,,,,
7300,52,60,,,,,,,,,,,
7301,115,121,,,,,,,,,,,
7302,39,39,,,,,,,,,,,
7303,62,66,,,,,,,,,,,
7304,176,192,,,,,,,,,,,
7305,24,25,,,,,,,,,,,
7306,117,125,,,,,,,,,,,
7307,225,241,,,,,,,,,,,
7310,698,742,,,,,,,,,,,
7315,321,330,,,,,,,,,,,
7316,141,143,,,,,,,,,,,
7320,394,409,,,,,,,,,,,
7321,98,108,,,,,,,,,,,
7322,58,59,,,,,,,,,,,
7325,167,176,,,,,,,,,,,
7330,156,169,,,,,,,,,,,
7331,46,48,,,,,,,,,,,
7467,26,26,,,,,,,,,,,
7468,38,40,,,,,,,,,,,
7469,8,8,,,,,,,,,,,
9726,5,6,,,,,,,,,,,
N/A as <5 for postcode in April or May or postcode not available,954,"1,054",,,,,,,,,,,
TOTAL,"860,489","906,484",,,,,,,,,,,
