"","SED_NAME_2018","SED_CODE_2018","SED_JK_June","SED_JK_May","SED_JK_April"
"1","McConnel",30052,6170.6246752,6107.9078216,5843.752767
"2","Clayfield",30019,2804.6021436,2782.9177043,2643.418286
"3","Stafford",30080,1860.0154436,1847.1259769,1740.547616
"4","Nudgee",30067,2025.7811492,2024.0382721,1927.3368181
"5","Sandgate",30074,1297.1956259,1282.1956259,1239.9639561
"6","Redcliffe",30071,1517.8280365,1498.0224529,1402.2029103
"7","Murrumba",30062,1254.7883181,1245.5098008,1181.4063015
"8","Bancroft",30003,1348.2183717,1312.8319706,1270.2620971
"9","Aspley",30002,1631.7976953,1630.0425589,1532.4692304
"10","Everton",30025,1659.6850001,1646.950045,1546.7053956
"11","Cooper",30023,2561.9713209,2561.3923474,2434.2672921
"12","Ferny Grove",30026,1405.2263925,1400.444077,1339.4649638
"13","Maiwar",30048,2122.8425753,2110.4106816,2007.7883637
"14","Moggill",30056,1770.6017674,1760.379999,1673.8997662
"15","Miller",30054,1796.0143035,1772.2022427,1694.2584429
"16","Mount Ommaney",30058,1919.3553056,1887.7053,1790.4178024
"17","Inala",30036,1595.955712,1574.2148753,1515.9814433
"18","Algester",30001,2069.9895101,2054.6038241,1991.1957987
"19","South Brisbane",30076,2840.047114,2827.7644463,2688.7704667
"20","Greenslopes",30030,2092.289133,2067.5828946,1968.7572377
"21","Toohey",30085,3003.1147362,2981.0958029,2853.1683126
"22","Stretton",30081,2458.6200857,2445.7392543,2372.9460138
"23","Woodridge",30093,1538.30516,1510.2209238,1426.9363681
"24","Waterford",30091,2275.945747,2225.0466087,2121.5096955
"25","Logan",30044,1563.3742644,1529.2252109,1425.5911669
"26","Mansfield",30049,1941.1653811,1911.7717931,1824.8624105
"27","Springwood",30079,2002.5928079,1954.217819,1855.4899729
"28","Jordan",30039,1511.9099196,1499.5718509,1410.0243663
"29","Macalister",30046,1955.6330424,1904.9705397,1805.892075
"30","Bulimba",30008,2490.8633244,2466.911735,2329.4172852
"31","Chatsworth",30018,1768.8383104,1771.0814075,1669.5974112
"32","Redlands",30072,1409.6333118,1373.1020678,1299.9963736
"33","Capalaba",30017,1704.0443853,1695.5780777,1606.682589
"34","Oodgeroo",30068,1614.1577934,1604.969794,1529.8756941
"35","Lytton",30045,1781.9210291,1776.5938948,1664.5259075
"36","Coomera",30022,2256.117714,2205.69538,2084.3813825
"37","Theodore",30083,2505.3154762,2465.78378,2347.191557
"38","Gaven",30027,2154.5288241,2109.8721648,1993.9555069
"39","Surfers Paradise",30082,3714.1043608,3686.2575499,3539.4908215
"40","Scenic Rim",30075,1839.6296047,1779.2069666,1656.0232094
"41","Mudgeeraba",30059,2799.5931054,2758.003578,2601.5641134
"42","Broadwater",30006,2298.223581,2261.1304564,2165.1057078
"43","Bonney",30005,2799.1391939,2763.2883099,2639.4966281
"44","Southport",30078,3113.2455512,3077.2222803,2943.781451
"45","Mermaid Beach",30053,3248.1908371,3230.6278827,3076.4804624
"46","Burleigh",30012,3135.1076492,3098.6837025,2937.5512597
"47","Currumbin",30024,2756.2271669,2721.1615907,2581.9104758
"48","Bundamba",30010,1121.029227,1113.7987452,1076.738581
"49","Ipswich",30037,908.8821378,891.4208056,837.9014691
"50","Ipswich West",30038,1104.1227895,1075.322912,1001.4971965
"51","Nanango",30063,1367.4427882,1314.2142853,1214.3326142
"52","Lockyer",30043,1291.4411881,1259.418658,1174.3541758
"53","Condamine",30020,1634.6025486,1571.6501529,1462.8391042
"54","Toowoomba North",30086,1559.3638437,1523.7528111,1419.8934702
"55","Toowoomba South",30087,1670.2867491,1636.7488953,1525.4641986
"56","Southern Downs",30077,2061.1710787,2015.9180802,1825.152417
"57","Lismore",10045,11.9765258,11.9765258,10.6788397
"58","Northern Tablelands",10061,2.6557664,2.7031908,2.4186444
"59","Warrego",30090,1799.7674211,1731.9646163,1550.3569216
"60","Callide",30015,1350.3008735,1292.0688209,1153.8672664
"61","Gregory",30031,1056.3541028,1017.764763,923.6349534
"62","Kurwongbah",30042,1370.2457061,1347.6422593,1259.8698817
"63","Pine Rivers",30069,2047.5761551,2012.6198987,1884.3736467
"64","Morayfield",30057,1156.9342395,1138.8832663,1064.5933239
"65","Glass House",30029,1743.4121209,1716.1399535,1613.1153009
"66","Pumicestone",30070,1060.6748449,1044.4615642,992.1486219
"67","Caloundra",30016,1833.2268134,1820.4230138,1720.0628668
"68","Kawana",30040,2418.2903233,2403.8456534,2283.7624063
"69","Buderim",30007,2472.7602869,2447.0107301,2303.1271894
"70","Nicklin",30064,1967.8875621,1932.0883868,1828.9454515
"71","Ninderry",30065,2740.3864745,2698.3639725,2557.5881132
"72","Maroochydore",30050,2890.3460412,2852.6094263,2699.1606265
"73","Noosa",30066,3214.7398375,3185.1656791,3049.9025043
"74","Gympie",30032,1481.5752013,1439.9342762,1352.1840633
"75","Maryborough",30051,931.7075385,917.4047102,864.1373239
"76","Hervey Bay",30033,1240.5624255,1233.2696875,1156.237068
"77","Burnett",30013,1085.2356717,1073.0368649,1009.4031405
"78","Bundaberg",30009,1067.9538786,1057.5378052,999.9430464
"79","Gladstone",30028,886.6725824,882.1401792,841.283744
"80","Mirani",30055,971.0834862,947.2985774,873.1043083
"81","Rockhampton",30073,1323.8770449,1303.8065293,1216.678801
"82","Keppel",30041,1152.2469905,1133.3552757,1061.8353808
"83","Burdekin",30011,1062.2723491,1017.6661318,927.1507382
"84","Mackay",30047,1265.0367512,1230.631986,1164.468976
"85","Whitsunday",30092,1818.484393,1786.8909931,1709.3512047
"86","Traeger",30089,700.9378255,698.8465002,647.1192012
"87","Townsville",30088,1790.6040689,1794.869543,1735.2328575
"88","Mundingburra",30061,1178.8938069,1179.6128771,1125.5697517
"89","Thuringowa",30084,828.1794275,833.5787678,787.3805773
"90","Hinchinbrook",30035,1250.96262,1162.6852226,1075.3882653
"91","Barkly",70004,6.1847307,6.2809911,5.9681448
"92","Hill",30034,1834.0993807,1816.9445307,1697.2672054
"93","Mulgrave",30060,1334.9575348,1321.2735892,1228.2411912
"94","Cairns",30014,3077.101281,3057.0157635,2933.2889757
"95","Barron River",30004,2363.898719,2357.9842365,2275.7110243
"96","Cook",30021,1624.1899181,1614.6527829,1554.9300923
