SED_CODE_2018,SED_NAME_2018,SED_Bus_Count
30017,Capalaba,4990
30018,Chatsworth,6442
30068,Oodgeroo,6004
30072,Redlands,4664
30079,Springwood,4870
30045,Lytton,4610
30008,Bulimba,7563
30002,Aspley,6565
30074,Sandgate,3418
30025,Everton,10038
30080,Stafford,6943
30067,Nudgee,7401
30019,Clayfield,8401
30030,Greenslopes,7624
30049,Mansfield,6951
30054,Miller,7819
30076,South Brisbane,10344
30085,Toohey,10826
30001,Algester,10531
30081,Stretton,9757
30039,Jordan,6323
30058,Mount Ommaney,5543
30056,Moggill,5934
30048,Maiwar,9612
30026,Ferny Grove,5940
30023,Cooper,8989
30052,McConnel,21728
30014,Cairns,8240
30004,Barron River,4190
30060,Mulgrave,3821
30034,Hill,7034
30035,Hinchinbrook,4460
30021,Cook,4313
30090,Warrego,8292
30015,Callide,9771
30077,Southern Downs,6564
30020,Condamine,9016
30063,Nanango,7103
30031,Gregory,5170
30073,Rockhampton,4287
30055,Mirani,7088
30041,Keppel,4385
30013,Burnett,4192
30028,Gladstone,3045
30082,Surfers Paradise,13223
30012,Burleigh,8872
30053,Mermaid Beach,10327
30024,Currumbin,5024
30005,Bonney,11362
30006,Broadwater,8729
30059,Mudgeeraba,12018
30083,Theodore,8818
30075,Scenic Rim,7177
30027,Gaven,5670
30022,Coomera,7497
30078,Southport,12721
30036,Inala,4908
30043,Lockyer,4168
30038,Ipswich West,2863
30010,Bundamba,2752
30037,Ipswich,2788
30046,Macalister,5076
30044,Logan,7321
30093,Woodridge,3805
30091,Waterford,6308
30011,Burdekin,5671
30047,Mackay,4609
30092,Whitsunday,6122
30070,Pumicestone,3743
30003,Bancroft,4419
30029,Glass House,10459
30057,Morayfield,4457
30042,Kurwongbah,5584
30071,Redcliffe,4183
30062,Murrumba,4986
30069,Pine Rivers,6312
30089,Traeger,3608
30007,Buderim,6701
30065,Ninderry,14050
30064,Nicklin,9839
30040,Kawana,5577
30016,Caloundra,5954
30050,Maroochydore,7807
30066,Noosa,7729
30087,Toowoomba South,6824
30086,Toowoomba North,6475
30088,Townsville,6316
30061,Mundingburra,3195
30084,Thuringowa,2189
30009,Bundaberg,3295
30032,Gympie,5213
30033,Hervey Bay,3542
30051,Maryborough,4290
