"","SED_NAME_2018","SED_CODE_2018","SED_incident_total","Year","Type.of.Incident"
"1","Northern Tablelands",10061,7.38,"2019","Fire_all_types"
"2","Northern Tablelands",10061,4.14,"2017","Fire_all_types"
"3","Northern Tablelands",10061,7.05,"2018","Fire_all_types"
"4","Tweed",10084,2,"2019","Fire_all_types"
"5","Tweed",10084,3,"2017","Fire_all_types"
"6","McConnel",30052,242.44,"2019","Fire_all_types"
"7","McConnel",30052,204.58,"2018","Fire_all_types"
"8","McConnel",30052,202.01,"2017","Fire_all_types"
"9","McConnel",30052,5,"2017","Water Search Rescue_Drowning"
"10","McConnel",30052,1,"2018","Water Search Rescue_Drowning"
"11","McConnel",30052,5,"2019","Water Search Rescue_Drowning"
"12","Clayfield",30019,53.21,"2018","Fire_all_types"
"13","Clayfield",30019,55.91,"2017","Fire_all_types"
"14","Clayfield",30019,56.77,"2019","Fire_all_types"
"15","Clayfield",30019,1,"2017","Water Search Rescue_Drowning"
"16","Stafford",30080,55.54,"2019","Fire_all_types"
"17","Stafford",30080,0.66,"2017","Water Search Rescue_Drowning"
"18","Stafford",30080,0.07,"2018","Water Search Rescue_Drowning"
"19","Stafford",30080,48.24,"2017","Fire_all_types"
"20","Stafford",30080,54.36,"2018","Fire_all_types"
"21","Nudgee",30067,49,"2019","Fire_all_types"
"22","Nudgee",30067,3.22,"2017","Water Search Rescue_Drowning"
"23","Nudgee",30067,0.94,"2018","Water Search Rescue_Drowning"
"24","Nudgee",30067,65.35,"2017","Fire_all_types"
"25","Nudgee",30067,66.59,"2018","Fire_all_types"
"26","Sandgate",30074,43.12,"2017","Fire_all_types"
"27","Sandgate",30074,54.61,"2018","Fire_all_types"
"28","Sandgate",30074,43.48,"2019","Fire_all_types"
"29","Sandgate",30074,1,"2018","Water Search Rescue_Drowning"
"30","Redcliffe",30071,1,"2018","Water Search Rescue_Drowning"
"31","Redcliffe",30071,60.61,"2018","Fire_all_types"
"32","Redcliffe",30071,1,"2019","Water Search Rescue_Drowning"
"33","Redcliffe",30071,63.22,"2019","Fire_all_types"
"34","Redcliffe",30071,63.42,"2017","Fire_all_types"
"35","Murrumba",30062,48.01,"2018","Fire_all_types"
"36","Murrumba",30062,59.34,"2019","Fire_all_types"
"37","Murrumba",30062,37.02,"2017","Fire_all_types"
"38","Bancroft",30003,69.97,"2017","Fire_all_types"
"39","Bancroft",30003,74.98,"2018","Fire_all_types"
"40","Bancroft",30003,93.97,"2019","Fire_all_types"
"41","Clayfield",30019,1,"2018","Water Search Rescue_Drowning"
"42","Aspley",30002,61.1,"2017","Fire_all_types"
"43","Aspley",30002,57.17,"2019","Fire_all_types"
"44","Aspley",30002,58.4,"2018","Fire_all_types"
"45","Aspley",30002,0.99,"2017","Water Search Rescue_Drowning"
"46","Everton",30025,0.93,"2017","Water Search Rescue_Drowning"
"47","Everton",30025,37.36,"2019","Fire_all_types"
"48","Everton",30025,31.68,"2017","Fire_all_types"
"49","Everton",30025,37.18,"2018","Fire_all_types"
"50","Cooper",30023,34.59,"2017","Fire_all_types"
"51","Cooper",30023,0.03,"2017","Water Search Rescue_Drowning"
"52","Cooper",30023,36.53,"2018","Fire_all_types"
"53","Cooper",30023,49.84,"2019","Fire_all_types"
"54","Ferny Grove",30026,38.79,"2017","Fire_all_types"
"55","Ferny Grove",30026,1.17,"2017","Water Search Rescue_Drowning"
"56","Ferny Grove",30026,40.22,"2018","Fire_all_types"
"57","Ferny Grove",30026,45.74,"2019","Fire_all_types"
"58","Maiwar",30048,51.94,"2019","Fire_all_types"
"59","Maiwar",30048,49.19,"2018","Fire_all_types"
"60","Maiwar",30048,59.05,"2017","Fire_all_types"
"61","Maiwar",30048,1,"2017","Water Search Rescue_Drowning"
"62","Moggill",30056,43.39,"2018","Fire_all_types"
"63","Moggill",30056,45.57,"2017","Fire_all_types"
"64","Moggill",30056,49.76,"2019","Fire_all_types"
"65","Miller",30054,60.71,"2018","Fire_all_types"
"66","Miller",30054,47.75,"2017","Fire_all_types"
"67","Miller",30054,53.95,"2019","Fire_all_types"
"68","Maiwar",30048,1,"2019","Water Search Rescue_Drowning"
"69","Mount Ommaney",30058,48.76,"2019","Fire_all_types"
"70","Mount Ommaney",30058,43.41,"2017","Fire_all_types"
"71","Mount Ommaney",30058,51.54,"2018","Fire_all_types"
"72","Miller",30054,0.62,"2017","Flood"
"73","Miller",30054,2.32,"2017","Water Search Rescue_Drowning"
"74","Miller",30054,0.62,"2018","Water Search Rescue_Drowning"
"75","Inala",30036,95.35,"2017","Fire_all_types"
"76","Inala",30036,107.51,"2018","Fire_all_types"
"77","Inala",30036,0.06,"2017","Flood"
"78","Inala",30036,103.91,"2019","Fire_all_types"
"79","Inala",30036,3.06,"2017","Water Search Rescue_Drowning"
"80","Inala",30036,1.06,"2018","Water Search Rescue_Drowning"
"81","Mount Ommaney",30058,0.54,"2017","Flood"
"82","Mount Ommaney",30058,0.54,"2017","Water Search Rescue_Drowning"
"83","Mount Ommaney",30058,0.54,"2018","Water Search Rescue_Drowning"
"84","Algester",30001,80,"2018","Fire_all_types"
"85","Algester",30001,66.71,"2017","Fire_all_types"
"86","Algester",30001,77.47,"2019","Fire_all_types"
"87","South Brisbane",30076,3,"2017","Water Search Rescue_Drowning"
"88","South Brisbane",30076,102.21,"2018","Fire_all_types"
"89","South Brisbane",30076,98.05,"2017","Fire_all_types"
"90","South Brisbane",30076,8,"2019","Water Search Rescue_Drowning"
"91","South Brisbane",30076,2,"2018","Water Search Rescue_Drowning"
"92","South Brisbane",30076,111.03,"2019","Fire_all_types"
"93","Greenslopes",30030,48.02,"2017","Fire_all_types"
"94","Greenslopes",30030,1,"2017","Water Search Rescue_Drowning"
"95","Greenslopes",30030,58.09,"2018","Fire_all_types"
"96","Greenslopes",30030,2.15,"2019","Water Search Rescue_Drowning"
"97","Greenslopes",30030,49.52,"2019","Fire_all_types"
"98","Toohey",30085,71.1,"2018","Fire_all_types"
"99","Toohey",30085,77.75,"2019","Fire_all_types"
"100","Toohey",30085,3.98,"2017","Water Search Rescue_Drowning"
"101","Toohey",30085,85.06,"2017","Fire_all_types"
"102","Toohey",30085,0.78,"2017","Flood"
"103","Toohey",30085,0.78,"2018","Water Search Rescue_Drowning"
"104","Algester",30001,0,"2017","Flood"
"105","Algester",30001,0,"2018","Water Search Rescue_Drowning"
"106","Algester",30001,2.4,"2017","Water Search Rescue_Drowning"
"107","Stretton",30081,36.73,"2018","Fire_all_types"
"108","Stretton",30081,42.24,"2019","Fire_all_types"
"109","Stretton",30081,45.73,"2017","Fire_all_types"
"110","Stretton",30081,0.7,"2017","Water Search Rescue_Drowning"
"111","Woodridge",30093,221.22,"2019","Fire_all_types"
"112","Woodridge",30093,174.35,"2018","Fire_all_types"
"113","Woodridge",30093,173.26,"2017","Fire_all_types"
"114","Waterford",30091,154.46,"2019","Fire_all_types"
"115","Waterford",30091,119.08,"2018","Fire_all_types"
"116","Waterford",30091,122.47,"2017","Fire_all_types"
"117","Logan",30044,103.62,"2018","Fire_all_types"
"118","Logan",30044,149.17,"2019","Fire_all_types"
"119","Logan",30044,101.15,"2017","Fire_all_types"
"120","Mansfield",30049,55.41,"2018","Fire_all_types"
"121","Mansfield",30049,43.58,"2017","Fire_all_types"
"122","Mansfield",30049,74.38,"2019","Fire_all_types"
"123","Springwood",30079,56.75,"2017","Fire_all_types"
"124","Springwood",30079,81.84,"2019","Fire_all_types"
"125","Springwood",30079,75.88,"2018","Fire_all_types"
"126","Jordan",30039,111,"2018","Fire_all_types"
"127","Jordan",30039,134.91,"2019","Fire_all_types"
"128","Jordan",30039,4.09,"2017","Water Search Rescue_Drowning"
"129","Jordan",30039,95.3,"2017","Fire_all_types"
"130","Logan",30044,9.27,"2017","Water Search Rescue_Drowning"
"131","Logan",30044,3.15,"2017","Flood"
"132","Waterford",30091,3.19,"2017","Water Search Rescue_Drowning"
"133","Waterford",30091,0.39,"2019","Water Search Rescue_Drowning"
"134","Springwood",30079,0.6,"2017","Water Search Rescue_Drowning"
"135","Springwood",30079,0.77,"2019","Water Search Rescue_Drowning"
"136","Mansfield",30049,0,"2017","Water Search Rescue_Drowning"
"137","Mansfield",30049,0.05,"2019","Water Search Rescue_Drowning"
"138","Macalister",30046,115.15,"2018","Fire_all_types"
"139","Macalister",30046,144.4,"2019","Fire_all_types"
"140","Macalister",30046,103.7,"2017","Fire_all_types"
"141","Macalister",30046,1.73,"2019","Water Search Rescue_Drowning"
"142","Woodridge",30093,2,"2018","Water Search Rescue_Drowning"
"143","Woodridge",30093,1,"2017","Flood"
"144","Waterford",30091,0.56,"2018","Water Search Rescue_Drowning"
"145","Waterford",30091,0.56,"2017","Flood"
"146","Macalister",30046,2.44,"2018","Water Search Rescue_Drowning"
"147","Macalister",30046,2.44,"2017","Flood"
"148","Macalister",30046,10.01,"2017","Water Search Rescue_Drowning"
"149","Logan",30044,0.78,"2018","Water Search Rescue_Drowning"
"150","Bulimba",30008,63.33,"2019","Fire_all_types"
"151","Bulimba",30008,66.33,"2018","Fire_all_types"
"152","Bulimba",30008,39.15,"2017","Fire_all_types"
"153","Bulimba",30008,1.18,"2019","Water Search Rescue_Drowning"
"154","Chatsworth",30018,41.89,"2018","Fire_all_types"
"155","Chatsworth",30018,47.9,"2017","Fire_all_types"
"156","Chatsworth",30018,0.62,"2019","Water Search Rescue_Drowning"
"157","Chatsworth",30018,44.65,"2019","Fire_all_types"
"158","Redlands",30072,70.32,"2017","Fire_all_types"
"159","Redlands",30072,65.28,"2018","Fire_all_types"
"160","Redlands",30072,84.78,"2019","Fire_all_types"
"161","Capalaba",30017,59.33,"2017","Fire_all_types"
"162","Capalaba",30017,50.81,"2018","Fire_all_types"
"163","Capalaba",30017,47.56,"2019","Fire_all_types"
"164","Oodgeroo",30068,44.18,"2018","Fire_all_types"
"165","Oodgeroo",30068,52.04,"2019","Fire_all_types"
"166","Oodgeroo",30068,34.84,"2017","Fire_all_types"
"167","Redlands",30072,0.58,"2017","Water Search Rescue_Drowning"
"168","Oodgeroo",30068,1.42,"2017","Water Search Rescue_Drowning"
"169","Springwood",30079,0.17,"2017","Flood"
"170","Redlands",30072,0.83,"2017","Flood"
"171","Redlands",30072,0.83,"2019","Water Search Rescue_Drowning"
"172","Chatsworth",30018,0,"2018","Water Search Rescue_Drowning"
"173","Greenslopes",30030,0.01,"2018","Water Search Rescue_Drowning"
"174","Bulimba",30008,0.99,"2018","Water Search Rescue_Drowning"
"175","Bulimba",30008,1,"2017","Water Search Rescue_Drowning"
"176","Lytton",30045,57.2,"2017","Fire_all_types"
"177","Lytton",30045,60.72,"2018","Fire_all_types"
"178","Lytton",30045,69.2,"2019","Fire_all_types"
"179","Lytton",30045,2,"2017","Water Search Rescue_Drowning"
"180","Lytton",30045,1,"2019","Water Search Rescue_Drowning"
"181","Coomera",30022,78.22,"2019","Fire_all_types"
"182","Coomera",30022,76.25,"2017","Fire_all_types"
"183","Coomera",30022,71.93,"2018","Fire_all_types"
"184","Coomera",30022,0.07,"2019","Water Search Rescue_Drowning"
"185","Coomera",30022,1.75,"2017","Water Search Rescue_Drowning"
"186","Coomera",30022,0.22,"2017","Flood"
"187","Coomera",30022,0.22,"2018","Water Search Rescue_Drowning"
"188","Logan",30044,0.2,"2019","Water Search Rescue_Drowning"
"189","Theodore",30083,84.62,"2019","Fire_all_types"
"190","Theodore",30083,61.82,"2018","Fire_all_types"
"191","Theodore",30083,3.25,"2017","Water Search Rescue_Drowning"
"192","Theodore",30083,73.8,"2017","Fire_all_types"
"193","Mudgeeraba",30059,1.06,"2017","Flood"
"194","Mudgeeraba",30059,1.34,"2018","Water Search Rescue_Drowning"
"195","Mudgeeraba",30059,2.38,"2017","Water Search Rescue_Drowning"
"196","Mudgeeraba",30059,58.02,"2018","Fire_all_types"
"197","Mudgeeraba",30059,71.39,"2019","Fire_all_types"
"198","Mudgeeraba",30059,64.19,"2017","Fire_all_types"
"199","Mudgeeraba",30059,1.13,"2019","Water Search Rescue_Drowning"
"200","Surfers Paradise",30082,0.01,"2017","Flood"
"201","Surfers Paradise",30082,1.62,"2018","Water Search Rescue_Drowning"
"202","Surfers Paradise",30082,0.53,"2017","Water Search Rescue_Drowning"
"203","Surfers Paradise",30082,96.69,"2018","Fire_all_types"
"204","Surfers Paradise",30082,85.68,"2019","Fire_all_types"
"205","Surfers Paradise",30082,103.92,"2017","Fire_all_types"
"206","Surfers Paradise",30082,0.02,"2019","Water Search Rescue_Drowning"
"207","Scenic Rim",30075,3.01,"2017","Flood"
"208","Scenic Rim",30075,3.01,"2018","Water Search Rescue_Drowning"
"209","Scenic Rim",30075,13.74,"2017","Water Search Rescue_Drowning"
"210","Scenic Rim",30075,151.19,"2018","Fire_all_types"
"211","Scenic Rim",30075,123.91,"2019","Fire_all_types"
"212","Scenic Rim",30075,101.66,"2017","Fire_all_types"
"213","Scenic Rim",30075,1.12,"2019","Water Search Rescue_Drowning"
"214","Gaven",30027,0.83,"2017","Flood"
"215","Gaven",30027,0.83,"2018","Water Search Rescue_Drowning"
"216","Gaven",30027,0.9,"2017","Water Search Rescue_Drowning"
"217","Gaven",30027,63.56,"2018","Fire_all_types"
"218","Gaven",30027,89.95,"2019","Fire_all_types"
"219","Gaven",30027,73.87,"2017","Fire_all_types"
"220","Gaven",30027,1.6,"2019","Water Search Rescue_Drowning"
"221","Theodore",30083,0.11,"2017","Flood"
"222","Theodore",30083,0.55,"2018","Water Search Rescue_Drowning"
"223","Theodore",30083,0.22,"2019","Water Search Rescue_Drowning"
"224","Broadwater",30006,39.79,"2019","Fire_all_types"
"225","Broadwater",30006,34.38,"2018","Fire_all_types"
"226","Broadwater",30006,0.56,"2018","Water Search Rescue_Drowning"
"227","Broadwater",30006,41.25,"2017","Fire_all_types"
"228","Bonney",30005,82.13,"2019","Fire_all_types"
"229","Bonney",30005,67.02,"2017","Fire_all_types"
"230","Bonney",30005,67.28,"2018","Fire_all_types"
"231","Southport",30078,95.79,"2019","Fire_all_types"
"232","Southport",30078,82.73,"2017","Fire_all_types"
"233","Southport",30078,83.56,"2018","Fire_all_types"
"234","Bonney",30005,1.15,"2019","Water Search Rescue_Drowning"
"235","Bonney",30005,0.46,"2018","Water Search Rescue_Drowning"
"236","Southport",30078,1.07,"2019","Water Search Rescue_Drowning"
"237","Southport",30078,0.72,"2018","Water Search Rescue_Drowning"
"238","Bonney",30005,0.23,"2017","Water Search Rescue_Drowning"
"239","Broadwater",30006,0.77,"2019","Water Search Rescue_Drowning"
"240","Broadwater",30006,0.77,"2017","Water Search Rescue_Drowning"
"241","Mermaid Beach",30053,71.3,"2017","Fire_all_types"
"242","Mermaid Beach",30053,59.32,"2018","Fire_all_types"
"243","Mermaid Beach",30053,1.09,"2017","Water Search Rescue_Drowning"
"244","Mermaid Beach",30053,59.41,"2019","Fire_all_types"
"245","Mermaid Beach",30053,1.43,"2018","Water Search Rescue_Drowning"
"246","Burleigh",30012,47.29,"2018","Fire_all_types"
"247","Burleigh",30012,59.83,"2019","Fire_all_types"
"248","Burleigh",30012,59.19,"2017","Fire_all_types"
"249","Currumbin",30024,62.33,"2017","Fire_all_types"
"250","Currumbin",30024,56.07,"2018","Fire_all_types"
"251","Currumbin",30024,69.11,"2019","Fire_all_types"
"252","Burleigh",30012,0.47,"2018","Water Search Rescue_Drowning"
"253","Currumbin",30024,1.61,"2017","Water Search Rescue_Drowning"
"254","Currumbin",30024,1.61,"2017","Flood"
"255","Burleigh",30012,0.37,"2017","Water Search Rescue_Drowning"
"256","Burleigh",30012,0.37,"2017","Flood"
"257","Jordan",30039,0.63,"2017","Flood"
"258","Scenic Rim",30075,1,"2018","Flood"
"259","Logan",30044,0,"2018","Flood"
"260","Jordan",30039,0,"2018","Flood"
"261","Jordan",30039,0,"2019","Water Search Rescue_Drowning"
"262","Jordan",30039,0.7,"2018","Water Search Rescue_Drowning"
"263","Bundamba",30010,1.3,"2018","Water Search Rescue_Drowning"
"264","Bundamba",30010,135.01,"2018","Fire_all_types"
"265","Bundamba",30010,166.64,"2019","Fire_all_types"
"266","Bundamba",30010,1.53,"2017","Water Search Rescue_Drowning"
"267","Bundamba",30010,140.26,"2017","Fire_all_types"
"268","Ipswich",30037,123.77,"2018","Fire_all_types"
"269","Ipswich",30037,1.2,"2017","Water Search Rescue_Drowning"
"270","Ipswich",30037,119.65,"2017","Fire_all_types"
"271","Ipswich",30037,114.52,"2019","Fire_all_types"
"272","Ipswich West",30038,141.73,"2018","Fire_all_types"
"273","Ipswich West",30038,124.48,"2017","Fire_all_types"
"274","Ipswich West",30038,118.25,"2019","Fire_all_types"
"275","Nanango",30063,171.99,"2019","Fire_all_types"
"276","Nanango",30063,127.97,"2018","Fire_all_types"
"277","Nanango",30063,117.08,"2017","Fire_all_types"
"278","Nanango",30063,2.02,"2019","Water Search Rescue_Drowning"
"279","Nanango",30063,2.24,"2017","Water Search Rescue_Drowning"
"280","Ipswich",30037,0.13,"2019","Water Search Rescue_Drowning"
"281","Moggill",30056,0.19,"2019","Water Search Rescue_Drowning"
"282","Moggill",30056,0.19,"2017","Water Search Rescue_Drowning"
"283","Ipswich West",30038,0.44,"2019","Water Search Rescue_Drowning"
"284","Ipswich West",30038,2.02,"2017","Water Search Rescue_Drowning"
"285","Lockyer",30043,125.18,"2019","Fire_all_types"
"286","Lockyer",30043,140.31,"2018","Fire_all_types"
"287","Lockyer",30043,112.66,"2017","Fire_all_types"
"288","Lockyer",30043,0.14,"2019","Water Search Rescue_Drowning"
"289","Lockyer",30043,1.25,"2017","Water Search Rescue_Drowning"
"290","Nanango",30063,1.25,"2018","Water Search Rescue_Drowning"
"291","Nanango",30063,0.29,"2017","Flood"
"292","Lockyer",30043,0.77,"2018","Water Search Rescue_Drowning"
"293","Lockyer",30043,0.77,"2017","Flood"
"294","Toowoomba North",30086,54.89,"2018","Fire_all_types"
"295","Toowoomba North",30086,0.75,"2017","Flood"
"296","Toowoomba North",30086,67.82,"2017","Fire_all_types"
"297","Toowoomba North",30086,77.37,"2019","Fire_all_types"
"298","Toowoomba South",30087,65.04,"2018","Fire_all_types"
"299","Toowoomba South",30087,1.02,"2017","Flood"
"300","Toowoomba South",30087,75.21,"2017","Fire_all_types"
"301","Toowoomba South",30087,94.52,"2019","Fire_all_types"
"302","Condamine",30020,63.41,"2018","Fire_all_types"
"303","Condamine",30020,0.23,"2017","Flood"
"304","Condamine",30020,76.7,"2017","Fire_all_types"
"305","Condamine",30020,74.21,"2019","Fire_all_types"
"306","Southern Downs",30077,91.49,"2019","Fire_all_types"
"307","Southern Downs",30077,87.39,"2017","Fire_all_types"
"308","Southern Downs",30077,86.47,"2018","Fire_all_types"
"309","Condamine",30020,1.94,"2017","Water Search Rescue_Drowning"
"310","Southern Downs",30077,1.06,"2017","Water Search Rescue_Drowning"
"311","Southern Downs",30077,2,"2017","Flood"
"312","Southern Downs",30077,2,"2018","Water Search Rescue_Drowning"
"313","Lismore",10045,0.86,"2019","Fire_all_types"
"314","Lismore",10045,0.98,"2018","Fire_all_types"
"315","Lismore",10045,0.66,"2017","Fire_all_types"
"316","Warrego",30090,125.9,"2019","Fire_all_types"
"317","Warrego",30090,108.71,"2018","Fire_all_types"
"318","Condamine",30020,0.01,"2018","Water Search Rescue_Drowning"
"319","Condamine",30020,0.01,"2018","Flood"
"320","Warrego",30090,92.73,"2017","Fire_all_types"
"321","Warrego",30090,0.98,"2018","Water Search Rescue_Drowning"
"322","Warrego",30090,0.98,"2018","Flood"
"323","Nanango",30063,0,"2018","Flood"
"324","Callide",30015,78.15,"2017","Fire_all_types"
"325","Callide",30015,2.01,"2018","Water Search Rescue_Drowning"
"326","Callide",30015,0.01,"2018","Flood"
"327","Callide",30015,84.73,"2018","Fire_all_types"
"328","Callide",30015,113.52,"2019","Fire_all_types"
"329","Warrego",30090,3,"2017","Water Search Rescue_Drowning"
"330","Warrego",30090,1,"2019","Water Search Rescue_Drowning"
"331","Gregory",30031,72.61,"2019","Fire_all_types"
"332","Gregory",30031,100.24,"2018","Fire_all_types"
"333","Gregory",30031,77.76,"2017","Fire_all_types"
"334","Kurwongbah",30042,95.44,"2019","Fire_all_types"
"335","Kurwongbah",30042,64.6,"2017","Fire_all_types"
"336","Kurwongbah",30042,69.92,"2018","Fire_all_types"
"337","Pine Rivers",30069,76.92,"2019","Fire_all_types"
"338","Pine Rivers",30069,37.7,"2017","Fire_all_types"
"339","Pine Rivers",30069,55.03,"2018","Fire_all_types"
"340","Murrumba",30062,0.95,"2019","Water Search Rescue_Drowning"
"341","Kurwongbah",30042,0.05,"2019","Water Search Rescue_Drowning"
"342","Kurwongbah",30042,1,"2018","Water Search Rescue_Drowning"
"343","Morayfield",30057,153.7,"2019","Fire_all_types"
"344","Morayfield",30057,130.37,"2017","Fire_all_types"
"345","Morayfield",30057,101.08,"2018","Fire_all_types"
"346","Glass House",30029,112.44,"2019","Fire_all_types"
"347","Glass House",30029,74.58,"2018","Fire_all_types"
"348","Glass House",30029,69.39,"2017","Fire_all_types"
"349","Pumicestone",30070,82.71,"2019","Fire_all_types"
"350","Pumicestone",30070,67.96,"2017","Fire_all_types"
"351","Pumicestone",30070,61.93,"2018","Fire_all_types"
"352","Pumicestone",30070,0.34,"2017","Water Search Rescue_Drowning"
"353","Pumicestone",30070,0.34,"2018","Water Search Rescue_Drowning"
"354","Pumicestone",30070,0.34,"2019","Water Search Rescue_Drowning"
"355","Morayfield",30057,0.57,"2017","Water Search Rescue_Drowning"
"356","Morayfield",30057,0.57,"2018","Water Search Rescue_Drowning"
"357","Morayfield",30057,0.57,"2019","Water Search Rescue_Drowning"
"358","Glass House",30029,3.53,"2017","Water Search Rescue_Drowning"
"359","Glass House",30029,2.24,"2018","Water Search Rescue_Drowning"
"360","Glass House",30029,1.24,"2019","Water Search Rescue_Drowning"
"361","Glass House",30029,0.94,"2017","Flood"
"362","Caloundra",30016,63.17,"2019","Fire_all_types"
"363","Caloundra",30016,67.24,"2017","Fire_all_types"
"364","Caloundra",30016,65.11,"2018","Fire_all_types"
"365","Pine Rivers",30069,1,"2017","Water Search Rescue_Drowning"
"366","Pine Rivers",30069,1,"2018","Water Search Rescue_Drowning"
"367","Cooper",30023,0,"2018","Water Search Rescue_Drowning"
"368","Kawana",30040,72.13,"2017","Fire_all_types"
"369","Kawana",30040,59.73,"2018","Fire_all_types"
"370","Kawana",30040,1.81,"2017","Water Search Rescue_Drowning"
"371","Kawana",30040,52.05,"2019","Fire_all_types"
"372","Caloundra",30016,1.52,"2017","Water Search Rescue_Drowning"
"373","Buderim",30007,52.99,"2019","Fire_all_types"
"374","Buderim",30007,51.7,"2017","Fire_all_types"
"375","Buderim",30007,36.62,"2018","Fire_all_types"
"376","Buderim",30007,0.89,"2017","Water Search Rescue_Drowning"
"377","Nicklin",30064,66.55,"2018","Fire_all_types"
"378","Nicklin",30064,88.39,"2019","Fire_all_types"
"379","Nicklin",30064,68.82,"2017","Fire_all_types"
"380","Nicklin",30064,1.04,"2018","Water Search Rescue_Drowning"
"381","Nicklin",30064,0.86,"2019","Water Search Rescue_Drowning"
"382","Ninderry",30065,91.5,"2019","Fire_all_types"
"383","Ninderry",30065,67.33,"2017","Fire_all_types"
"384","Ninderry",30065,53.59,"2018","Fire_all_types"
"385","Ninderry",30065,0.9,"2017","Water Search Rescue_Drowning"
"386","Nicklin",30064,0.17,"2017","Water Search Rescue_Drowning"
"387","Maroochydore",30050,59.16,"2017","Fire_all_types"
"388","Maroochydore",30050,57.92,"2018","Fire_all_types"
"389","Maroochydore",30050,69.82,"2019","Fire_all_types"
"390","Ninderry",30065,0.16,"2019","Water Search Rescue_Drowning"
"391","Maroochydore",30050,0.84,"2019","Water Search Rescue_Drowning"
"392","Noosa",30066,1.08,"2017","Water Search Rescue_Drowning"
"393","Noosa",30066,64.49,"2018","Fire_all_types"
"394","Noosa",30066,87.73,"2019","Fire_all_types"
"395","Noosa",30066,0.08,"2017","Flood"
"396","Noosa",30066,77.69,"2017","Fire_all_types"
"397","Ninderry",30065,0.75,"2017","Flood"
"398","Nicklin",30064,0.16,"2017","Flood"
"399","Gympie",30032,101.3,"2018","Fire_all_types"
"400","Gympie",30032,119.58,"2019","Fire_all_types"
"401","Gympie",30032,78.75,"2017","Fire_all_types"
"402","Noosa",30066,2,"2019","Water Search Rescue_Drowning"
"403","Noosa",30066,1.82,"2018","Water Search Rescue_Drowning"
"404","Maryborough",30051,102.71,"2017","Fire_all_types"
"405","Maryborough",30051,78.96,"2018","Fire_all_types"
"406","Maryborough",30051,1.35,"2017","Water Search Rescue_Drowning"
"407","Maryborough",30051,0,"2018","Water Search Rescue_Drowning"
"408","Maryborough",30051,99.68,"2019","Fire_all_types"
"409","Gympie",30032,4.97,"2017","Water Search Rescue_Drowning"
"410","Gympie",30032,2.98,"2018","Water Search Rescue_Drowning"
"411","Kawana",30040,1,"2019","Water Search Rescue_Drowning"
"412","Hervey Bay",30033,65.71,"2018","Fire_all_types"
"413","Hervey Bay",30033,66.25,"2019","Fire_all_types"
"414","Hervey Bay",30033,67.51,"2017","Fire_all_types"
"415","Callide",30015,2.03,"2017","Flood"
"416","Callide",30015,1.69,"2017","Water Search Rescue_Drowning"
"417","Maryborough",30051,0.17,"2019","Water Search Rescue_Drowning"
"418","Hervey Bay",30033,0.83,"2019","Water Search Rescue_Drowning"
"419","Hervey Bay",30033,1.65,"2017","Water Search Rescue_Drowning"
"420","Burnett",30013,97.13,"2019","Fire_all_types"
"421","Burnett",30013,78.22,"2017","Fire_all_types"
"422","Burnett",30013,7.32,"2017","Water Search Rescue_Drowning"
"423","Burnett",30013,62.72,"2018","Fire_all_types"
"424","Bundaberg",30009,3.68,"2017","Water Search Rescue_Drowning"
"425","Bundaberg",30009,89.46,"2017","Fire_all_types"
"426","Bundaberg",30009,71.07,"2018","Fire_all_types"
"427","Bundaberg",30009,98.03,"2019","Fire_all_types"
"428","Bundaberg",30009,2.45,"2018","Water Search Rescue_Drowning"
"429","Bundaberg",30009,1.84,"2019","Water Search Rescue_Drowning"
"430","Burnett",30013,2.61,"2018","Water Search Rescue_Drowning"
"431","Burnett",30013,1.16,"2019","Water Search Rescue_Drowning"
"432","Burnett",30013,11,"2017","Flood"
"433","Gladstone",30028,100.26,"2019","Fire_all_types"
"434","Gladstone",30028,2.65,"2017","Water Search Rescue_Drowning"
"435","Gladstone",30028,75.3,"2017","Fire_all_types"
"436","Gladstone",30028,76.95,"2018","Fire_all_types"
"437","Mirani",30055,79.21,"2018","Fire_all_types"
"438","Mirani",30055,84.2,"2019","Fire_all_types"
"439","Mirani",30055,68.89,"2017","Fire_all_types"
"440","Rockhampton",30073,113.19,"2018","Fire_all_types"
"441","Rockhampton",30073,140.15,"2019","Fire_all_types"
"442","Rockhampton",30073,1.53,"2019","Water Search Rescue_Drowning"
"443","Rockhampton",30073,176.05,"2017","Flood"
"444","Rockhampton",30073,3.63,"2017","Water Search Rescue_Drowning"
"445","Rockhampton",30073,99.94,"2017","Fire_all_types"
"446","Mirani",30055,1.22,"2019","Water Search Rescue_Drowning"
"447","Mirani",30055,9.1,"2017","Flood"
"448","Mirani",30055,8.16,"2017","Water Search Rescue_Drowning"
"449","Keppel",30041,89.12,"2018","Fire_all_types"
"450","Keppel",30041,97.07,"2019","Fire_all_types"
"451","Keppel",30041,0.42,"2019","Water Search Rescue_Drowning"
"452","Keppel",30041,20.29,"2017","Flood"
"453","Keppel",30041,1.26,"2017","Water Search Rescue_Drowning"
"454","Keppel",30041,67,"2017","Fire_all_types"
"455","Gregory",30031,0.14,"2018","Water Search Rescue_Drowning"
"456","Gregory",30031,2.03,"2017","Flood"
"457","Gregory",30031,0.68,"2017","Water Search Rescue_Drowning"
"458","Mirani",30055,0.45,"2018","Water Search Rescue_Drowning"
"459","Rockhampton",30073,0.42,"2018","Water Search Rescue_Drowning"
"460","Keppel",30041,1.17,"2018","Water Search Rescue_Drowning"
"461","Burdekin",30011,6.47,"2019","Water Search Rescue_Drowning"
"462","Burdekin",30011,124.66,"2017","Fire_all_types"
"463","Burdekin",30011,110.24,"2018","Fire_all_types"
"464","Burdekin",30011,124.12,"2019","Fire_all_types"
"465","Gregory",30031,0.03,"2019","Water Search Rescue_Drowning"
"466","Burdekin",30011,1.19,"2017","Water Search Rescue_Drowning"
"467","Whitsunday",30092,90.1,"2017","Fire_all_types"
"468","Whitsunday",30092,72.52,"2018","Fire_all_types"
"469","Whitsunday",30092,0.77,"2017","Flood"
"470","Whitsunday",30092,2.76,"2017","Water Search Rescue_Drowning"
"471","Whitsunday",30092,1.43,"2018","Water Search Rescue_Drowning"
"472","Whitsunday",30092,72.17,"2019","Fire_all_types"
"473","Mackay",30047,103.21,"2017","Fire_all_types"
"474","Mackay",30047,80.72,"2018","Fire_all_types"
"475","Mackay",30047,0.66,"2017","Flood"
"476","Mackay",30047,1.98,"2017","Water Search Rescue_Drowning"
"477","Mackay",30047,1.32,"2018","Water Search Rescue_Drowning"
"478","Mackay",30047,95.27,"2019","Fire_all_types"
"479","Whitsunday",30092,1.56,"2019","Water Search Rescue_Drowning"
"480","Burdekin",30011,1.07,"2017","Flood"
"481","Burdekin",30011,1.84,"2018","Water Search Rescue_Drowning"
"482","Burdekin",30011,29.02,"2019","Flood"
"483","Traeger",30089,144.82,"2019","Fire_all_types"
"484","Traeger",30089,0.22,"2018","Flood"
"485","Traeger",30089,3.62,"2019","Water Search Rescue_Drowning"
"486","Traeger",30089,143.62,"2017","Fire_all_types"
"487","Traeger",30089,129.84,"2018","Fire_all_types"
"488","Burdekin",30011,0.99,"2018","Flood"
"489","Townsville",30088,114.37,"2019","Flood"
"490","Townsville",30088,97.88,"2018","Fire_all_types"
"491","Townsville",30088,98.31,"2017","Fire_all_types"
"492","Townsville",30088,7.09,"2019","Water Search Rescue_Drowning"
"493","Townsville",30088,1.61,"2017","Water Search Rescue_Drowning"
"494","Townsville",30088,123.62,"2019","Fire_all_types"
"495","Mundingburra",30061,110.05,"2019","Fire_all_types"
"496","Mundingburra",30061,85.25,"2017","Fire_all_types"
"497","Mundingburra",30061,82.33,"2018","Fire_all_types"
"498","Mundingburra",30061,4.49,"2019","Water Search Rescue_Drowning"
"499","Mundingburra",30061,1.34,"2018","Water Search Rescue_Drowning"
"500","Mundingburra",30061,99.51,"2019","Flood"
"501","Mundingburra",30061,0.38,"2017","Water Search Rescue_Drowning"
"502","Townsville",30088,2.17,"2018","Water Search Rescue_Drowning"
"503","Thuringowa",30084,105.76,"2018","Fire_all_types"
"504","Thuringowa",30084,4.14,"2019","Water Search Rescue_Drowning"
"505","Thuringowa",30084,70.96,"2017","Fire_all_types"
"506","Thuringowa",30084,105.34,"2019","Fire_all_types"
"507","Thuringowa",30084,13.19,"2019","Flood"
"508","Thuringowa",30084,1,"2018","Water Search Rescue_Drowning"
"509","Traeger",30089,4.4,"2018","Water Search Rescue_Drowning"
"510","Traeger",30089,9.05,"2019","Flood"
"511","Hinchinbrook",30035,81.13,"2019","Fire_all_types"
"512","Hinchinbrook",30035,8.15,"2018","Water Search Rescue_Drowning"
"513","Hinchinbrook",30035,77.65,"2017","Fire_all_types"
"514","Hinchinbrook",30035,9.08,"2019","Water Search Rescue_Drowning"
"515","Hinchinbrook",30035,42.86,"2019","Flood"
"516","Hinchinbrook",30035,71,"2018","Fire_all_types"
"517","Hinchinbrook",30035,69.11,"2018","Flood"
"518","Townsville",30088,0.05,"2018","Flood"
"519","Traeger",30089,1.1,"2017","Water Search Rescue_Drowning"
"520","Barkly",70004,0.02,"2019","Water Search Rescue_Drowning"
"521","Barkly",70004,1.85,"2018","Fire_all_types"
"522","Barkly",70004,2.14,"2019","Fire_all_types"
"523","Barkly",70004,1.95,"2017","Fire_all_types"
"524","Barkly",70004,0.02,"2018","Water Search Rescue_Drowning"
"525","Hinchinbrook",30035,1,"2017","Water Search Rescue_Drowning"
"526","Hill",30034,68.42,"2017","Fire_all_types"
"527","Hill",30034,98.37,"2018","Fire_all_types"
"528","Hill",30034,98.6,"2019","Fire_all_types"
"529","Hill",30034,12.96,"2018","Water Search Rescue_Drowning"
"530","Hill",30034,11.76,"2019","Water Search Rescue_Drowning"
"531","Hill",30034,4.63,"2018","Flood"
"532","Hill",30034,10.24,"2017","Water Search Rescue_Drowning"
"533","Mulgrave",30060,1,"2018","Flood"
"534","Mulgrave",30060,3.01,"2019","Water Search Rescue_Drowning"
"535","Mulgrave",30060,81.05,"2018","Fire_all_types"
"536","Mulgrave",30060,100.05,"2019","Fire_all_types"
"537","Mulgrave",30060,1.67,"2018","Water Search Rescue_Drowning"
"538","Mulgrave",30060,70.7,"2017","Fire_all_types"
"539","Mulgrave",30060,1.34,"2017","Water Search Rescue_Drowning"
"540","Barron River",30004,91,"2018","Fire_all_types"
"541","Barron River",30004,83.93,"2017","Fire_all_types"
"542","Barron River",30004,0.2,"2017","Water Search Rescue_Drowning"
"543","Barron River",30004,99.29,"2019","Fire_all_types"
"544","Barron River",30004,5.79,"2018","Water Search Rescue_Drowning"
"545","Barron River",30004,3.79,"2019","Water Search Rescue_Drowning"
"546","Cairns",30014,94,"2018","Fire_all_types"
"547","Cairns",30014,110.07,"2017","Fire_all_types"
"548","Cairns",30014,0.8,"2017","Water Search Rescue_Drowning"
"549","Cairns",30014,119.71,"2019","Fire_all_types"
"550","Cairns",30014,3.21,"2018","Water Search Rescue_Drowning"
"551","Cairns",30014,3.21,"2019","Water Search Rescue_Drowning"
"552","Cook",30021,6.32,"2017","Water Search Rescue_Drowning"
"553","Cook",30021,8.44,"2018","Water Search Rescue_Drowning"
"554","Cook",30021,11.57,"2019","Water Search Rescue_Drowning"
"555","Cook",30021,79.05,"2019","Fire_all_types"
"556","Cook",30021,63.26,"2017","Fire_all_types"
"557","Cook",30021,82.82,"2018","Fire_all_types"
"558","Cook",30021,10,"2018","Flood"
"559","Cook",30021,3.93,"2019","Flood"
"560","Barron River",30004,2,"2018","Flood"
"561","Hill",30034,0.07,"2019","Flood"
