,LGA_NAME16,,Total_No
1,Brisbane (C),,"131,452"
2,Bundaberg (R),,"6,545"
3,Cairns (R),,"14,150"
4,Cassowary Coast (R),,"3,160"
5,Central Highlands (R) (Qld),,"3,291"
6,Fraser Coast (R),,"5,971"
7,Gladstone (R),,"3,705"
8,Gold Coast (C),,"69,248"
9,Gympie (R),,"4,542"
10,Ipswich (C),,"9,901"
11,Isaac (R),,"1,696"
12,Livingstone (S),,"2,952"
13,Lockyer Valley (R),,"3,140"
14,Logan (C),,"22,571"
15,Mackay (R),,"9,872"
16,Mareeba (S),,"2,084"
17,Moreton Bay (R),,"28,805"
18,Mount Isa (C),,"1,013"
19,Noosa (S),,"7,103"
20,Redland (C),,"12,103"
21,Rockhampton (R),,"5,120"
22,Scenic Rim (R),,"4,465"
23,Somerset (R),,"2,109"
24,South Burnett (R),,"3,168"
25,Southern Downs (R),,"4,187"
26,Sunshine Coast (R),,"32,439"
27,Tablelands (R),,"2,731"
28,Toowoomba (R),,"16,109"
29,Townsville (C),,"11,959"
30,Western Downs (R),,"4,791"
31,Whitsunday (R),,"3,796"
