Date,QLD_Unemployment,AUS_Unemployment,QLD_Participation,AUS_Participation
1/01/2019,6.0,5.0,65.2,65.7
1/02/2019,5.6,5.0,65.1,65.6
1/03/2019,6.1,5.1,65.7,65.7
1/04/2019,5.9,5.3,65.5,65.9
1/05/2019,6.3,5.4,65.9,66.0
1/06/2019,6.4,5.3,65.8,66.0
1/07/2019,6.3,5.5,66.1,66.0
1/08/2019,6.3,5.3,65.8,66.2
1/09/2019,6.6,5.2,66.7,66.1
1/10/2019,6.4,5.3,66.0,66.0
1/11/2019,6.3,5.3,66.2,65.9
1/12/2019,5.7,5.2,65.7,66.0
1/01/2020,6.2,5.4,65.9,66.1
1/02/2020,5.6,5.0,65.8,65.9
1/03/2020,5.6,5.4,65.5,65.9
1/04/2020,7.0,6.9,62.8,63.6
1/05/2020,7.8,7.5,61.6,62.7
1/06/2020,7.7,7.9,62.9,64.0
