SA2_NAME16,Northern European Languages,Southern European Languages,Eastern European Languages,Southwest and Central Asian Languages,Southern Asian Languages,Southeast Asian Languages,Eastern Asian Languages,Australian Indigenous Languages,Total
Alexandra Hills,14743,198,143,63,114,176,134,9,15583
Belmont - Gumdale,6114,321,90,36,157,76,260,0,7052
Birkdale,13265,227,107,12,139,118,199,15,14070
Capalaba,15632,282,149,91,283,213,200,3,16856
Thorneside,3395,30,34,5,31,17,33,0,3549
Wellington Point,10611,153,108,27,56,40,114,0,11107
Cleveland,12976,176,118,55,111,147,278,0,13862
Ormiston,5259,74,52,13,38,50,87,0,5580
Redland Bay,14236,138,76,42,61,78,53,8,14687
Sheldon - Mount Cotton,7390,68,47,9,48,24,35,0,7616
Thornlands,13475,148,110,49,150,80,99,0,14117
Victoria Point,13786,136,85,22,91,79,65,12,14262
Redland Islands,8041,56,57,9,3,67,40,8,8293
Brisbane Port - Lytton,4,0,0,0,0,0,0,0,4
Manly - Lota,6782,100,37,9,19,55,52,0,7058
Manly West,10261,151,67,66,88,104,130,3,10864
Murarrie,3299,107,43,9,116,93,155,6,3829
Tingalpa,7199,244,75,68,245,210,149,0,8193
Wakerley,7580,266,106,98,260,98,221,0,8632
Wynnum,11775,190,65,16,100,169,125,4,12433
Wynnum West - Hemmant,12554,257,75,54,302,336,241,10,13825
Bald Hills,6090,114,24,66,329,180,97,0,6897
Bridgeman Downs,6573,235,66,71,445,120,342,0,7849
Carseldine,6776,272,58,111,619,200,386,0,8422
Everton Park,7486,223,58,73,196,120,221,0,8394
McDowall,6332,274,68,60,193,82,237,0,7244
Aspley,10123,364,82,41,344,202,488,4,11647
Chermside,6016,275,78,197,743,419,540,9,8270
Chermside West,5068,237,34,31,263,146,204,0,5979
Geebung,3709,68,25,9,102,79,65,0,4064
Kedron - Gordon Park,11310,415,72,100,453,201,312,4,12870
Stafford,5427,186,38,37,107,164,137,11,6106
Stafford Heights,5773,253,40,41,64,123,99,0,6392
Wavell Heights,8476,222,65,44,189,157,178,3,9331
Boondall,7135,233,64,48,584,303,299,6,8665
Brisbane Airport,86,0,3,0,3,0,0,0,93
Eagle Farm - Pinkenba,606,38,13,14,11,6,35,0,719
Northgate - Virginia,5387,102,38,36,294,147,121,4,6127
Nudgee - Banyo,7923,101,63,9,321,295,185,13,8906
Nundah,8975,311,124,70,1062,279,394,11,11218
Bracken Ridge,13981,189,123,149,809,460,284,4,16006
Brighton (Qld),8655,98,34,5,29,54,59,6,8949
Deagon,3213,37,19,6,24,59,45,7,3416
Sandgate - Shorncliffe,6117,81,55,4,25,41,43,0,6370
Taigum - Fitzgibbon,8026,255,165,201,1503,614,524,7,11293
Zillmere,6496,168,63,81,847,335,190,13,8176
Camp Hill,9579,333,101,40,212,100,203,0,10572
Cannon Hill,4548,156,58,35,135,82,228,0,5239
Carina,8925,407,148,113,317,150,373,0,10432
Carina Heights,5032,293,129,98,170,135,317,0,6176
Carindale,11478,997,242,202,534,315,1309,0,15078
Annerley,7967,500,162,227,597,369,604,5,10432
Coorparoo,12595,575,224,149,875,219,375,5,15013
Fairfield - Dutton Park,3462,256,80,71,134,172,283,0,4457
Greenslopes,6591,324,176,153,676,209,350,0,8471
Holland Park,6800,276,82,122,161,116,216,0,7771
Holland Park West,5040,177,116,47,261,100,266,0,6001
Woolloongabba,3318,296,137,86,219,245,593,0,4887
Yeronga,7520,261,114,140,222,169,288,0,8717
Eight Mile Plains,6427,365,304,204,1366,451,5283,3,14397
Macgregor (Qld),2155,179,130,64,341,257,2373,0,5503
Mansfield (Qld),6075,355,190,172,556,187,730,0,8265
Mount Gravatt,11156,493,227,280,648,269,766,0,13843
Rochedale - Burbank,3993,160,106,45,369,143,1248,0,6058
Upper Mount Gravatt,6128,221,152,124,425,298,1438,4,8799
Wishart,7208,371,250,122,664,260,1455,0,10328
Coopers Plains,2771,92,131,108,529,342,995,3,4969
Moorooka,7834,338,224,245,430,248,277,0,9599
Robertson,1625,101,94,117,577,231,2062,0,4811
Salisbury - Nathan,5458,165,112,103,338,155,314,0,6645
Tarragindi,9111,303,100,50,140,108,301,0,10110
Algester,5592,187,168,127,507,278,968,0,7830
Calamvale - Stretton,8117,482,476,559,1777,1118,7366,0,19897
Pallara - Willawong,2884,49,71,67,466,514,265,0,4306
Parkinson - Drewvale,9501,327,297,303,1382,569,2396,5,14777
Rocklea - Acacia Ridge,5837,230,254,438,522,521,334,6,8151
Kuraby,4020,173,144,543,1248,363,1353,0,7847
Runcorn,5960,192,291,332,1712,665,4360,0,13505
Sunnybank,3383,127,116,118,503,354,3681,0,8273
Sunnybank Hills,7598,420,468,290,1052,786,6098,6,16731
Jindalee - Mount Ommaney,5911,136,99,140,184,281,515,0,7275
Middle Park - Jamboree Heights,5261,126,94,130,311,364,557,0,6845
Riverhills,3277,75,34,95,117,118,123,0,3837
Seventeen Mile Rocks - Sinnamon Park,7309,212,115,194,518,347,576,0,9264
Westlake,3291,59,44,57,248,197,319,0,4222
Bellbowrie - Moggill,8737,190,69,34,300,107,260,0,9705
Brookfield - Kenmore Hills,5728,112,52,54,145,43,241,0,6366
Chapel Hill,8305,266,114,93,244,114,729,0,9865
Fig Tree Pocket,3499,85,47,46,66,34,115,0,3889
Kenmore,7331,178,70,43,254,96,540,0,8504
Pinjarra Hills - Pullenvale,4805,61,35,31,75,42,95,0,5141
Chelmer - Graceville,6542,141,42,36,88,69,202,0,7117
Corinda,4067,97,35,48,93,119,92,0,4559
Indooroopilly,8011,369,84,297,607,295,1763,0,11425
Sherwood,4666,124,44,46,166,80,208,0,5341
St Lucia,7068,390,93,157,528,1080,2410,0,11730
Taringa,6066,309,91,151,323,278,747,0,7959
Enoggera,6996,139,62,56,108,81,151,0,7602
Enoggera Reservoir,21,0,0,0,0,0,0,0,21
Keperra,6281,110,55,60,38,117,70,0,6723
Mitchelton,7377,144,51,21,124,93,159,3,7985
Mount Coot-tha,0,0,0,0,0,0,0,0,0
The Gap,14726,315,204,45,158,101,285,0,15832
Upper Kedron - Ferny Grove,8857,140,95,87,119,77,159,0,9533
Brisbane City,4974,774,123,273,296,233,2483,5,9161
Fortitude Valley,4295,571,87,66,340,191,526,0,6080
Highgate Hill,4120,661,75,71,275,168,402,0,5773
Kangaroo Point,5689,590,147,173,224,166,452,0,7428
New Farm,9027,663,127,73,263,164,490,0,10809
South Brisbane,3887,457,89,174,306,269,1354,0,6539
Spring Hill,2946,859,77,70,409,199,817,0,5386
West End,6314,794,91,151,299,371,580,3,8603
Balmoral,3678,94,35,5,32,26,68,0,3936
Bulimba,5658,208,62,22,45,31,119,0,6155
East Brisbane,4322,309,84,51,170,131,231,0,5309
Hawthorne,4405,178,27,25,28,39,38,0,4749
Morningside - Seven Hills,10339,318,118,81,345,196,371,0,11772
Norman Park,5479,135,57,31,51,75,99,0,5934
Albion,2177,101,32,10,76,54,93,5,2549
Alderley,5137,128,44,39,147,56,126,0,5680
Ascot,4138,204,33,42,143,76,133,0,4774
Clayfield,8109,316,107,99,603,149,335,12,9723
Grange,3837,131,19,5,27,26,55,0,4085
Hamilton (Qld),4735,189,51,74,124,72,306,0,5566
Hendra,4011,113,30,25,53,48,60,0,4333
Kelvin Grove - Herston,5670,270,92,573,371,321,1767,4,9076
Newmarket,3977,140,17,32,177,90,169,0,4606
Newstead - Bowen Hills,7605,464,117,123,166,137,486,3,9110
Wilston,3441,116,18,10,93,16,63,0,3755
Windsor,5763,239,58,55,296,112,219,3,6744
Wooloowin - Lutwyche,7618,295,67,98,540,171,284,4,9072
Ashgrove,11839,302,88,41,147,57,176,10,12652
Auchenflower,4258,173,40,43,205,92,225,0,5043
Bardon,8779,229,65,28,38,25,98,8,9270
Paddington - Milton,8995,403,118,75,108,77,309,0,10089
Red Hill (Qld),4719,152,40,28,111,35,130,0,5219
Toowong,7760,319,82,116,277,226,1176,5,9968
Brinsmead,4566,62,23,18,42,62,226,19,5024
Clifton Beach - Kewarra Beach,9279,197,98,32,24,105,224,11,9975
Freshwater - Stratford,3173,49,17,7,20,31,65,5,3363
Redlynch,10932,145,38,14,148,103,316,36,11739
Trinity Beach - Smithfield,11669,253,110,60,187,179,353,27,12833
Yorkeys Knob - Machans Beach,4911,97,46,3,9,61,90,40,5261
Bentley Park,6510,104,24,0,71,315,88,65,7171
Cairns City,6630,286,90,54,466,263,1194,171,9157
Earlville - Bayview Heights,6827,163,41,17,57,149,222,40,7521
Edmonton,9012,124,34,6,94,328,106,93,9789
Gordonvale - Trinity,7625,88,17,0,59,54,52,28,7933
Kanimbla - Mooroobool,7258,177,58,8,393,230,551,94,8773
Lamb Range,0,0,0,0,0,0,0,0,0
Manoora,3929,68,20,26,145,161,242,171,4758
Manunda,3569,61,31,0,291,176,213,87,4435
Mount Sheridan,6614,155,30,18,179,314,317,48,7676
Westcourt - Bungalow,4033,88,36,29,327,268,349,89,5217
White Rock,3707,44,17,4,49,143,95,52,4108
Whitfield - Edge Hill,6899,123,39,11,50,124,283,49,7583
Woree,3581,66,25,0,77,228,100,66,4143
Babinda,3658,103,9,0,16,39,5,0,3837
Innisfail,7180,286,30,7,422,267,96,42,8328
Johnstone,6850,164,25,0,92,53,36,3,7229
Tully,8752,214,25,0,222,122,114,76,9519
Wooroonooran,0,0,0,0,0,0,0,0,0
Yarrabah,2161,0,0,0,0,0,0,304,2465
Daintree,5329,92,18,0,10,31,41,92,5601
Port Douglas,4064,151,17,0,41,62,89,13,4436
Atherton,9541,208,20,10,36,59,49,15,9941
Herberton,4722,26,5,3,4,22,21,29,4825
Kuranda,3807,74,22,4,0,18,41,46,4015
Malanda - Yungaburra,7653,64,26,3,12,32,23,12,7823
Mareeba,8702,740,90,30,63,98,177,9,9909
Balonne,3942,7,3,0,12,21,8,6,4003
Chinchilla,6920,19,24,11,89,84,11,0,7162
Goondiwindi,5533,13,0,9,37,57,49,0,5703
Inglewood - Waggamba,3757,17,5,0,20,19,20,0,3841
Miles - Wandoan,3434,9,5,0,17,41,10,0,3511
Roma,5712,33,6,5,100,151,41,9,6053
Roma Region,5293,7,6,0,17,13,7,0,5342
Tara,3270,8,33,0,3,33,12,0,3360
Crows Nest - Rosalie,7906,26,16,0,7,19,14,0,7983
Jondaryan,6710,136,0,4,22,123,11,0,7013
Millmerran,2710,7,6,0,5,101,48,0,2876
Pittsworth,5126,5,13,0,3,40,27,0,5208
Wambo,15191,42,17,14,124,269,36,14,15707
Clifton - Greenmount,4462,14,3,0,7,43,4,0,4538
Southern Downs - East,3844,22,5,0,9,16,11,0,3908
Southern Downs - West,4272,12,15,3,5,7,26,0,4336
Stanthorpe,4600,259,35,4,33,20,114,0,5067
Stanthorpe Region,5142,136,52,0,0,17,18,0,5376
Warwick,13867,85,22,28,65,113,78,7,14272
Central Highlands - East,6231,8,0,0,29,63,36,88,6453
Central Highlands - West,6940,27,11,0,17,44,12,0,7051
Emerald,11163,68,31,9,161,241,100,3,11768
Berserker,5866,24,3,39,80,191,44,13,6254
Bouldercombe,1718,3,0,0,0,3,0,9,1734
Emu Park,4816,19,11,0,0,20,9,5,4879
Frenchville - Mount Archer,8146,40,16,25,101,105,61,25,8521
Glenlee - Rockyview,4074,10,0,3,9,16,8,0,4119
Gracemere,10515,28,14,10,114,71,29,9,10786
Lakes Creek,4134,19,7,28,57,267,26,7,4553
Mount Morgan,2649,5,3,6,0,14,3,0,2680
Norman Gardens,8414,163,7,54,362,302,132,4,9450
Park Avenue,4572,33,5,8,56,53,27,0,4760
Parkhurst - Kawana,5996,56,3,6,108,147,57,0,6377
Rockhampton - West,5321,13,7,0,50,56,19,20,5480
Rockhampton City,2745,12,0,8,24,36,20,0,2861
Rockhampton Region - East,3136,5,7,0,0,16,0,0,3169
Rockhampton Region - North,3844,18,11,0,4,15,13,0,3894
Rockhampton Region - West,2687,0,0,0,0,4,4,0,2697
Shoalwater Bay,14,0,0,0,0,0,0,0,14
The Range - Allenstown,7111,41,8,15,181,79,65,21,7521
Yeppoon,16297,93,27,12,37,92,82,20,16666
Banana,7746,14,11,0,12,22,11,4,7823
Biloela,4786,72,5,21,89,276,58,0,5306
Agnes Water - Miriam Vale,5353,27,33,0,4,30,23,8,5484
Boyne Island - Tannum Sands,9100,43,18,16,21,65,32,0,9289
Callemondah,19,0,0,0,0,0,0,0,19
Clinton - New Auckland,11699,101,67,58,274,333,78,6,12619
Gladstone,4704,42,30,32,181,244,38,5,5272
Gladstone Hinterland,10512,30,34,3,15,105,17,6,10721
Kin Kora - Sun Valley,3204,30,11,3,47,65,39,0,3402
South Trees,0,0,0,0,0,0,0,0,0
Telina - Toolooa,5436,22,27,9,49,77,38,0,5659
West Gladstone,3858,50,24,36,133,132,32,0,4266
Broadbeach Waters,6431,229,173,46,16,90,249,0,7239
Burleigh Heads,7448,230,74,10,22,57,82,0,7923
Burleigh Waters,12539,353,155,35,37,102,275,0,13500
Mermaid Beach - Broadbeach,8886,581,194,65,179,122,394,0,10419
Mermaid Waters,9838,464,187,50,81,170,566,0,11354
Miami,5726,257,68,7,16,43,88,0,6213
Coolangatta,4822,191,36,6,32,60,70,0,5227
Currumbin - Tugun,9623,217,53,14,35,99,122,0,10162
Currumbin Waters,8441,93,45,8,14,52,66,5,8710
Elanora,10989,180,97,9,18,74,136,8,11508
Palm Beach,12976,238,80,18,29,85,138,11,13566
Arundel,8016,156,209,132,207,154,683,0,9555
Biggera Waters,6278,186,174,126,215,141,574,0,7694
Coombabah,8687,194,150,70,79,114,258,0,9551
Labrador,13570,392,531,299,297,358,705,4,16151
Paradise Point - Hollywell,8235,160,88,42,44,61,180,0,8818
Runaway Bay,7672,191,137,74,65,110,216,0,8467
Guanaba - Springbrook,3702,49,21,4,0,6,22,0,3804
Tamborine - Canungra,12615,107,93,13,36,53,117,8,13035
Currumbin Valley - Tallebudgera,6502,77,43,13,4,22,54,3,6716
Mudgeeraba - Bonogin,16173,262,182,45,87,113,352,0,17210
Reedy Creek - Andrews,6933,146,117,22,99,89,208,0,7611
Carrara,10276,247,162,67,82,110,463,6,11409
Highland Park,7339,93,104,22,35,110,182,0,7883
Nerang - Mount Nathan,17814,288,299,55,194,213,302,3,19161
Pacific Pines - Gaven,15024,276,301,171,391,241,664,5,17065
Worongary - Tallai,6851,98,94,5,29,33,139,0,7249
Coomera,11311,138,103,63,102,143,293,0,12145
Helensvale,14425,228,175,105,160,166,488,0,15746
Hope Island,9297,157,136,47,78,70,370,0,10157
Jacobs Well - Alberton,3322,21,13,0,6,19,15,0,3405
Ormeau - Yatala,17418,201,246,42,123,112,217,0,18353
Oxenford - Maudsland,13774,176,208,38,121,131,344,0,14785
Pimpama,7691,76,73,38,48,62,99,7,8091
Upper Coomera - Willow Vale,26922,370,317,181,322,264,654,0,29013
Clear Island Waters,3103,122,77,36,93,39,409,0,3886
Merrimac,5455,192,167,53,65,103,424,0,6461
Robina,18325,542,334,188,284,324,1765,8,21780
Varsity Lakes,11198,443,312,147,206,280,1307,0,13898
Ashmore,9840,267,165,54,103,141,512,0,11088
Molendinar,4611,121,154,48,104,142,854,0,6031
Parkwood,6881,141,93,98,137,171,549,0,8072
Southport - North,9343,401,327,308,390,407,1980,4,13164
Southport - South,11957,415,377,209,305,362,1819,4,15454
Benowa,6230,233,182,121,139,114,933,0,7953
Bundall,3665,121,83,38,31,54,225,0,4211
Main Beach,2976,156,44,19,34,20,71,0,3323
Surfers Paradise,14314,1481,500,424,1202,486,1558,0,19974
Darra - Sumner,2432,107,81,135,398,934,122,0,4210
Durack,3713,108,87,188,468,1901,275,4,6754
Forest Lake - Doolandella,17791,505,448,406,2083,2622,1119,9,24975
Inala - Richlands,7196,290,133,474,534,5163,223,18,14024
Oxley (Qld),5597,193,86,107,283,581,245,0,7093
Wacol,1776,50,40,48,55,391,34,4,2395
Boonah,10867,36,21,6,6,40,77,9,11073
Esk,4676,22,13,0,0,25,19,0,4762
Lake Manchester - England Creek,0,0,0,0,0,0,0,0,0
Lockyer Valley - East,17404,79,43,26,17,115,100,9,17792
Lowood,12574,40,29,14,23,114,60,4,12848
Rosewood,10540,23,13,3,10,50,28,3,10661
Brassall,9880,40,34,26,63,88,54,0,10185
Bundamba,7479,61,42,15,75,115,73,0,7862
Churchill - Yamanto,6184,29,18,13,73,53,26,0,6397
Ipswich - Central,5692,34,19,15,30,41,104,10,5949
Ipswich - East,15810,59,39,28,162,161,86,11,16349
Ipswich - North,4347,24,14,7,3,9,13,0,4423
Karalee - Barellan Point,5154,22,16,11,17,16,33,0,5264
Karana Downs,5722,53,19,7,10,24,38,3,5886
Leichhardt - One Mile,6509,28,12,25,46,64,60,5,6749
North Ipswich - Tivoli,5781,28,18,0,18,23,33,0,5901
Raceview,13711,60,20,11,197,138,77,12,14221
Ripley,4148,27,9,4,34,22,25,0,4272
Riverview,2248,30,13,14,21,80,34,0,2438
Bellbird Park - Brookwater,10887,222,117,80,520,392,170,4,12398
Camira - Gailes,7565,144,142,24,66,348,48,0,8322
Carole Park,0,0,0,0,0,0,0,0,0
Collingwood Park - Redbank,6596,229,60,94,138,201,140,7,7460
Goodna,6597,204,91,138,312,816,148,25,8339
New Chum,0,0,0,0,0,0,0,0,0
Redbank Plains,13806,270,139,158,423,493,135,17,15443
Springfield,5396,111,54,35,244,260,85,0,6180
Springfield Lakes,11532,286,171,226,917,719,329,0,14181
Beaudesert,12507,47,34,9,25,45,26,16,12709
Beenleigh,6880,91,82,48,80,197,45,3,7424
Eagleby,10958,187,169,218,111,215,110,13,11975
Edens Landing - Holmview,6234,85,131,133,121,142,103,0,6943
Mount Warren Park,5118,64,65,13,31,88,47,0,5420
Wolffdene - Bahrs Scrub,5530,58,56,12,14,46,56,0,5773
Boronia Heights - Park Ridge,9914,158,191,35,281,310,344,4,11248
Browns Plains,5047,104,175,147,384,348,315,0,6517
Chambers Flat - Logan Reserve,4143,49,82,36,56,216,63,0,4644
Crestmead,8895,101,147,191,160,480,66,4,10035
Greenbank Military Camp,0,0,0,0,0,0,0,0,0
Hillcrest,6521,147,155,58,210,245,264,0,7599
Marsden,9508,132,234,465,414,725,141,0,11615
Munruben - Park Ridge South,4033,42,64,22,29,145,85,0,4419
Regents Park - Heritage Park,12212,219,593,185,478,589,423,0,14703
Greenbank,11413,99,121,10,51,351,96,0,12136
Jimboomba,23252,166,120,17,95,200,165,7,24014
Logan Village,6309,49,46,11,10,62,19,0,6499
Bethania - Waterford,8968,122,127,99,207,142,232,0,9903
Cornubia - Carbrook,7548,110,115,35,79,53,78,0,8027
Loganholme - Tanah Merah,9578,119,169,67,91,140,185,5,10362
Loganlea,7340,88,172,365,385,416,186,17,8972
Shailer Park,9994,153,214,89,179,131,259,0,11027
Waterford West,5469,70,138,103,162,322,66,0,6324
Daisy Hill,5344,114,144,64,192,120,331,7,6307
Kingston (Qld.),6684,119,188,382,266,588,125,8,8358
Logan Central,3412,55,110,378,172,732,95,9,4958
Rochedale South - Priestdale,12779,236,279,103,368,183,692,0,14649
Slacks Creek,7456,104,228,377,287,414,201,0,9071
Springwood,7454,130,208,81,192,190,343,3,8610
Underwood,3471,99,234,298,607,201,1023,0,5929
Woodridge,6962,141,204,1066,610,1046,217,11,10253
Bowen,7447,66,15,31,44,130,321,29,8092
Broadsound - Nebo,6716,36,11,0,26,119,18,0,6923
Clermont,3177,11,4,0,13,30,12,0,3247
Collinsville,2888,15,3,0,10,51,6,0,2969
Moranbah,7258,40,9,13,100,174,43,3,7634
Andergrove - Beaconsfield,13403,118,48,11,141,123,64,6,13923
East Mackay,3079,36,4,3,24,101,18,0,3263
Eimeo - Rural View,11070,64,54,9,54,69,27,19,11373
Eungella Hinterland,13,0,0,0,0,0,0,0,13
Mackay,2502,42,18,8,160,325,66,0,3122
Mackay Harbour,404,5,0,0,0,4,7,0,427
Mount Pleasant - Glenella,9469,94,30,29,211,120,94,0,10047
North Mackay,5169,37,17,3,89,107,23,0,5449
Ooralea - Bakers Creek,4180,67,9,5,99,123,65,0,4534
Pioneer Valley,7354,49,10,0,12,21,16,4,7467
Sarina,10266,44,6,0,7,73,11,9,10416
Seaforth - Calen,7299,70,3,0,0,21,6,4,7410
Shoal Point - Bucasia,5261,33,3,5,14,23,19,0,5355
Slade Point,3032,23,17,0,6,35,11,0,3125
South Mackay,5622,57,11,3,87,362,49,0,6189
Walkerston - Eton,7457,85,5,0,7,31,16,0,7601
West Mackay,5059,79,3,3,70,244,34,0,5501
Airlie - Whitsundays,9954,189,60,15,99,210,227,7,10769
Cape Conway,0,0,0,0,0,0,0,0,0
Proserpine,7371,50,18,3,9,53,19,3,7523
Beachmere - Sandstone Point,13576,99,44,14,15,55,56,0,13856
Bribie Island,16534,126,86,12,21,82,75,7,16931
Burpengary - East,3691,18,19,13,9,25,34,0,3812
Caboolture,22394,179,82,45,260,432,547,21,23954
Caboolture - South,17731,130,62,45,81,228,329,13,18625
Elimbah,3598,30,3,3,6,36,23,0,3699
Morayfield - East,7428,41,11,18,42,113,145,3,7796
Wamuran,3462,42,3,0,8,41,51,0,3600
Kilcoy,4532,15,12,0,26,311,42,3,4942
Woodford - D'Aguilar,6144,34,8,0,0,18,13,3,6224
Burpengary,12803,87,54,4,57,125,92,9,13226
Deception Bay,19218,124,87,27,114,241,158,24,19984
Morayfield,4498,51,20,0,13,18,15,0,4614
Narangba,17176,143,66,16,90,105,101,11,17708
Upper Caboolture,2767,13,8,0,14,12,18,0,2839
Clontarf,7348,71,47,8,39,85,53,0,7662
Margate - Woody Point,10563,156,81,35,45,108,68,3,11049
Redcliffe,8640,142,95,37,57,113,84,5,9172
Rothwell - Kippa-Ring,14857,132,112,34,186,196,147,20,15680
Scarborough - Newport - Moreton Island,10862,186,102,26,44,92,94,0,11411
Albany Creek,14402,240,120,49,107,101,162,6,15189
Cashmere,17072,184,104,69,370,271,99,0,18167
Dayboro,7763,62,19,13,9,22,30,0,7925
Eatons Hill,7416,83,53,25,72,21,49,0,7720
The Hills District,21667,258,135,55,163,141,197,0,22610
Samford Valley,10825,143,44,19,37,24,45,4,11144
Dakabin - Kallangur,20966,192,98,69,270,261,125,0,21994
Murrumba Downs - Griffin,15043,242,87,58,492,200,157,4,16282
North Lakes - Mango Hill,24878,570,272,155,1053,588,649,5,28186
Bray Park,9007,92,62,27,142,186,93,0,9605
Lawnton,5259,46,20,6,68,93,59,3,5549
Petrie,7876,86,48,21,44,72,66,4,8212
Strathpine - Brendale,10338,159,49,103,258,262,199,3,11371
Aurukun,133,0,0,0,0,0,0,1084,1222
Cape York,4723,44,15,0,10,32,45,1439,6314
Croydon - Etheridge,922,6,0,5,0,3,3,0,928
Kowanyama - Pormpuraaw,1133,0,0,4,0,4,4,486,1637
Northern Peninsula,399,0,0,0,5,10,0,885,1303
Tablelands,4137,227,41,4,16,23,13,13,4480
Torres,1344,25,4,0,17,8,11,1554,2962
Torres Strait Islands,255,0,0,0,0,4,0,3755,4011
Weipa,3191,10,3,0,10,67,22,96,3401
Carpentaria,4197,4,0,0,16,29,10,163,4428
Mount Isa,14781,152,63,15,250,407,68,57,15792
Mount Isa Region,2746,9,4,0,38,34,12,10,2851
Northern Highlands,2833,5,3,0,11,9,5,0,2865
Barcaldine - Blackall,4393,5,0,0,35,15,0,5,4469
Charleville,3842,4,5,0,4,136,4,8,4005
Far Central West,1843,9,5,0,0,3,0,5,1871
Far South West,2588,3,4,0,0,5,0,0,2602
Longreach,3256,6,9,4,25,18,7,0,3323
Buderim - North,15269,168,65,27,70,99,87,0,15790
Buderim - South,14863,178,95,16,80,90,149,3,15482
Mountain Creek,10200,144,46,23,87,92,132,0,10727
Sippy Downs,8988,148,58,25,88,115,243,0,9664
Aroona - Currimundi,9504,60,28,8,17,26,40,5,9693
Buddina - Minyama,5873,57,25,9,40,41,49,0,6086
Caloundra - Kings Beach,5619,73,35,21,124,50,88,0,6006
Caloundra - West,18691,136,84,23,177,106,110,0,19334
Golden Beach - Pelican Waters,10870,104,44,14,57,85,46,0,11220
Moffat Beach - Battery Hill,7275,81,22,0,23,46,22,0,7466
Parrearra - Warana,8614,118,42,10,26,62,73,4,8944
Wurtulla - Birtinya,7038,73,47,11,60,42,38,0,7313
Coolum Beach,13211,183,51,15,38,74,59,0,13636
Marcoola - Mudjimba,9957,99,46,27,68,59,42,0,10285
Maroochydore - Kuluin,16437,207,88,61,311,223,260,0,17584
Mooloolaba - Alexandra Headland,9829,174,49,18,189,88,109,0,10457
Noosa Heads,3904,121,37,3,29,28,49,0,4165
Noosaville,7796,146,35,4,38,77,54,0,8150
Sunshine Beach,5807,156,48,0,8,23,53,0,6094
Tewantin,9164,139,36,5,46,85,58,5,9532
Peregian Beach - Marcus Beach,3457,74,14,3,0,17,8,0,3575
Peregian Springs,6497,101,53,11,26,32,52,0,6761
Beerwah,7507,41,13,3,26,36,61,0,7689
Caloundra Hinterland,7838,82,32,10,24,33,26,0,8041
Glass House Mountains,5333,64,11,3,0,21,28,0,5472
Landsborough,9378,90,24,0,14,33,15,0,9555
Maroochy Hinterland,5659,54,15,0,0,11,18,0,5752
Palmwoods,9854,78,28,0,21,38,31,5,10046
Bli Bli,7674,63,18,7,61,58,21,5,7904
Diddillibah - Rosemount,3406,30,9,5,8,21,20,0,3502
Eumundi - Yandina,9626,89,24,9,18,76,34,8,9875
Nambour,18069,131,49,28,131,142,106,4,18653
Noosa Hinterland,20104,161,46,8,18,72,65,11,20484
Cambooya - Wyreema,6312,23,16,4,21,18,21,0,6421
Darling Heights,9749,105,49,799,1019,196,383,4,12307
Drayton - Harristown,8607,58,22,139,132,144,72,9,9203
Gatton,5404,56,9,206,247,210,656,0,6791
Gowrie (Qld),6048,23,7,0,5,12,8,3,6108
Highfields,12371,45,23,5,17,33,31,0,12521
Lockyer Valley - West,10344,40,20,9,20,42,31,5,10501
Middle Ridge,6116,57,19,56,201,35,154,0,6634
Newtown (Qld),8384,57,10,57,112,95,139,8,8865
North Toowoomba - Harlaxton,5075,38,10,19,23,37,10,5,5224
Rangeville,7286,58,14,42,177,42,127,8,7746
Toowoomba - Central,11445,90,30,137,194,115,264,9,12283
Toowoomba - East,8680,86,17,42,94,47,73,8,9046
Toowoomba - West,11603,111,30,51,65,88,86,3,12029
Wilsonton,11925,42,23,27,73,143,60,9,12295
Ayr,7833,337,3,3,44,57,91,16,8389
Burdekin,6932,292,7,0,6,47,44,0,7330
Charters Towers,7130,16,14,11,28,58,20,32,7311
Dalrymple,3320,8,0,0,0,7,0,0,3337
Ingham,3659,333,0,0,29,15,6,5,4054
Ingham Region,5662,230,0,0,0,23,8,30,5957
Palm Island,2238,0,0,0,0,0,0,63,2304
Aitkenvale,3811,62,23,22,113,140,79,12,4266
Annandale,8213,177,34,40,283,123,139,0,9007
Belgian Gardens - Pallarenda,2851,57,13,4,9,14,15,0,2969
Bohle Plains,6604,64,10,9,93,57,18,8,6851
Condon - Rasmussen,9270,78,8,17,31,138,62,54,9666
Cranbrook,4810,58,5,13,92,252,80,14,5329
Deeragun,20431,121,45,15,69,120,79,34,20912
Douglas,6026,101,36,67,591,164,187,5,7175
Garbutt - West End,5288,87,25,13,36,67,66,27,5604
Gulliver - Currajong - Vincent,6755,94,13,8,21,188,45,31,7154
Heatley,3440,48,4,4,3,90,33,9,3635
Hermit Park - Rosslea,4311,71,16,11,80,102,57,28,4677
Hyde Park - Pimlico,3973,96,10,27,58,74,46,9,4300
Kelso,9395,52,13,4,18,67,19,44,9607
Kirwan - East,6844,72,5,4,36,116,49,43,7174
Kirwan - West,13799,173,23,26,124,182,83,39,14448
Magnetic Island,1979,35,7,0,5,15,12,9,2063
Mount Louisa,8203,105,19,22,89,132,29,23,8626
Mundingburra,3118,77,6,27,53,45,45,18,3389
Northern Beaches,5696,28,17,4,0,34,6,0,5788
Oonoonba,5650,75,32,26,150,60,120,10,6116
South Townsville - Railway Estate,4327,76,19,10,28,52,29,8,4549
Townsville - South,3936,22,0,0,0,29,12,0,4011
Townsville City - North Ward,7183,214,46,47,126,107,154,25,7901
Wulguru - Roseneath,4613,34,13,13,5,42,14,22,4748
Ashfield - Kepnock,4707,28,9,39,36,37,52,8,4909
Bargara - Burnett Heads,15389,130,60,35,48,81,86,0,15827
Branyan - Kensington,4340,17,14,0,4,33,23,0,4440
Bundaberg,4833,73,6,25,170,115,227,5,5453
Bundaberg East - Kalkie,4929,36,12,23,83,40,29,0,5148
Bundaberg North - Gooburrum,6312,45,3,19,26,56,114,0,6592
Bundaberg Region - North,7790,46,13,5,0,17,74,0,7960
Bundaberg Region - South,8739,78,21,0,6,64,28,3,8926
Millbank - Avoca,6599,41,7,19,61,53,39,0,6828
Svensson Heights - Norville,5120,41,16,14,43,25,35,4,5298
Walkervale - Avenell Heights,9635,76,11,9,30,123,79,3,9969
Gayndah - Mundubbera,5612,44,3,7,52,39,127,0,5883
Gin Gin,4552,38,20,5,10,31,6,0,4656
Kingaroy,9407,16,4,3,38,142,35,4,9655
Kingaroy Region - North,8621,25,20,4,18,43,8,50,8786
Kingaroy Region - South,3612,8,3,3,0,21,9,0,3654
Monto - Eidsvold,3231,5,6,0,7,43,3,0,3295
Nanango,8678,29,5,8,13,33,16,0,8789
North Burnett,8,0,0,0,0,0,0,0,8
Cooloola,5571,37,17,3,12,27,3,0,5663
Gympie - North,12722,46,37,9,50,95,64,0,13019
Gympie - South,6159,23,14,3,28,34,13,9,6289
Gympie Region,16815,65,56,8,13,57,42,8,17059
Kilkivan,3329,4,3,0,7,15,6,0,3366
Booral - River Heads,4233,20,4,0,8,23,5,5,4297
Craignish - Dundowran Beach,4446,44,19,0,14,22,13,0,4559
Pialba - Eli Waters,12324,92,54,47,205,136,78,7,12934
Point Vernon,5160,34,20,0,10,25,16,0,5262
Torquay - Scarness - Kawungan,13268,107,46,11,64,89,60,11,13656
Urangan - Wondunna,11412,71,30,8,56,67,41,4,11695
Burrum - Fraser,8541,38,15,0,10,46,33,5,8690
Granville,2922,3,5,0,0,12,0,0,2943
Maryborough (Qld),16150,44,18,6,45,107,50,4,16431
Maryborough Region - South,7446,25,19,4,0,21,13,0,7523
Tinana,5060,6,8,3,20,26,18,0,5138
