SA2_NAME16,Total_ATSI,Total_pop, Pop_Labels 
Alexandra Hills,486,16346," 16,346 "
Belmont - Gumdale,82,7371," 7,371 "
Birkdale,262,14922," 14,922 "
Capalaba,469,17593," 17,593 "
Thorneside,91,3764," 3,764 "
Wellington Point,172,11581," 11,581 "
Cleveland,243,14798," 14,798 "
Ormiston,88,5795," 5,795 "
Redland Bay,344,15591," 15,591 "
Sheldon - Mount Cotton,142,7904," 7,904 "
Thornlands,240,14694," 14,694 "
Victoria Point,243,15018," 15,018 "
Redland Islands,652,9014," 9,014 "
Brisbane Port - Lytton,0,9, 9 
Manly - Lota,121,7425," 7,425 "
Manly West,282,11431," 11,431 "
Murarrie,100,4118," 4,118 "
Tingalpa,183,8705," 8,705 "
Wakerley,125,8998," 8,998 "
Wynnum,365,13230," 13,230 "
Wynnum West - Hemmant,417,14792," 14,792 "
Bald Hills,212,7274," 7,274 "
Bridgeman Downs,45,8145," 8,145 "
Carseldine,106,9033," 9,033 "
Everton Park,177,8795," 8,795 "
McDowall,81,7539," 7,539 "
Aspley,211,12315," 12,315 "
Chermside,275,9319," 9,319 "
Chermside West,92,6251," 6,251 "
Geebung,82,4323," 4,323 "
Kedron - Gordon Park,230,13715," 13,715 "
Stafford,176,6513," 6,513 "
Stafford Heights,171,6855," 6,855 "
Wavell Heights,131,9785," 9,785 "
Boondall,232,9218," 9,218 "
Brisbane Airport,0,192, 192 
Eagle Farm - Pinkenba,18,822, 822 
Northgate - Virginia,169,6591," 6,591 "
Nudgee - Banyo,215,9618," 9,618 "
Nundah,194,12231," 12,231 "
Bracken Ridge,440,16935," 16,935 "
Brighton (Qld),229,9476," 9,476 "
Deagon,95,3674," 3,674 "
Sandgate - Shorncliffe,126,6781," 6,781 "
Taigum - Fitzgibbon,240,12155," 12,155 "
Zillmere,373,8968," 8,968 "
Camp Hill,103,11178," 11,178 "
Cannon Hill,81,5720," 5,720 "
Carina,154,11029," 11,029 "
Carina Heights,163,6547," 6,547 "
Carindale,110,15706," 15,706 "
Annerley,154,11388," 11,388 "
Coorparoo,154,16037," 16,037 "
Fairfield - Dutton Park,56,4790," 4,790 "
Greenslopes,106,9121," 9,121 "
Holland Park,153,8306," 8,306 "
Holland Park West,76,6337," 6,337 "
Woolloongabba,65,5526," 5,526 "
Yeronga,98,9486," 9,486 "
Eight Mile Plains,134,15161," 15,161 "
Macgregor (Qld),34,5846," 5,846 "
Mansfield (Qld),135,8725," 8,725 "
Mount Gravatt,226,14942," 14,942 "
Rochedale - Burbank,38,6318," 6,318 "
Upper Mount Gravatt,189,9392," 9,392 "
Wishart,117,10817," 10,817 "
Coopers Plains,125,5483," 5,483 "
Moorooka,122,10423," 10,423 "
Robertson,20,5102," 5,102 "
Salisbury - Nathan,164,7183," 7,183 "
Tarragindi,97,10674," 10,674 "
Algester,152,8432," 8,432 "
Calamvale - Stretton,110,21250," 21,250 "
Pallara - Willawong,80,4701," 4,701 "
Parkinson - Drewvale,141,15581," 15,581 "
Rocklea - Acacia Ridge,375,9559," 9,559 "
Kuraby,61,8382," 8,382 "
Runcorn,127,14482," 14,482 "
Sunnybank,86,8856," 8,856 "
Sunnybank Hills,167,18087," 18,087 "
Jindalee - Mount Ommaney,62,7513," 7,513 "
Middle Park - Jamboree Heights,77,7066," 7,066 "
Riverhills,53,4043," 4,043 "
Seventeen Mile Rocks - Sinnamon Park,81,9557," 9,557 "
Westlake,25,4351," 4,351 "
Bellbowrie - Moggill,108,10103," 10,103 "
Brookfield - Kenmore Hills,22,6752," 6,752 "
Chapel Hill,33,10310," 10,310 "
Fig Tree Pocket,5,4044," 4,044 "
Kenmore,35,8766," 8,766 "
Pinjarra Hills - Pullenvale,12,5403," 5,403 "
Chelmer - Graceville,27,7410," 7,410 "
Corinda,56,4865," 4,865 "
Indooroopilly,68,12139," 12,139 "
Sherwood,43,5637," 5,637 "
St Lucia,60,12575," 12,575 "
Taringa,59,8453," 8,453 "
Enoggera,164,8160," 8,160 "
Enoggera Reservoir,0,26, 26 
Keperra,233,7082," 7,082 "
Mitchelton,172,8360," 8,360 "
Mount Coot-tha,0,0, -   
The Gap,132,16474," 16,474 "
Upper Kedron - Ferny Grove,182,9907," 9,907 "
Brisbane City,55,10189," 10,189 "
Fortitude Valley,96,7142," 7,142 "
Highgate Hill,78,6328," 6,328 "
Kangaroo Point,78,8213," 8,213 "
New Farm,134,12787," 12,787 "
South Brisbane,56,7229," 7,229 "
Spring Hill,67,6066," 6,066 "
West End,111,9618," 9,618 "
Balmoral,44,4227," 4,227 "
Bulimba,43,6698," 6,698 "
East Brisbane,72,5783," 5,783 "
Hawthorne,52,4972," 4,972 "
Morningside - Seven Hills,239,12613," 12,613 "
Norman Park,54,6302," 6,302 "
Albion,46,2793," 2,793 "
Alderley,62,6000," 6,000 "
Ascot,38,5142," 5,142 "
Clayfield,117,10473," 10,473 "
Grange,48,4247," 4,247 "
Hamilton (Qld),63,6289," 6,289 "
Hendra,49,4654," 4,654 "
Kelvin Grove - Herston,120,10079," 10,079 "
Newmarket,57,4978," 4,978 "
Newstead - Bowen Hills,71,10639," 10,639 "
Wilston,42,3937," 3,937 "
Windsor,105,7187," 7,187 "
Wooloowin - Lutwyche,126,9746," 9,746 "
Ashgrove,117,13313," 13,313 "
Auchenflower,32,5498," 5,498 "
Bardon,60,9717," 9,717 "
Paddington - Milton,106,10788," 10,788 "
Red Hill (Qld),57,5746," 5,746 "
Toowong,93,10803," 10,803 "
Brinsmead,267,5364," 5,364 "
Clifton Beach - Kewarra Beach,276,10834," 10,834 "
Freshwater - Stratford,141,3566," 3,566 "
Redlynch,541,12807," 12,807 "
Trinity Beach - Smithfield,520,13934," 13,934 "
Yorkeys Knob - Machans Beach,374,6153," 6,153 "
Bentley Park,1016,8015," 8,015 "
Cairns City,799,11435," 11,435 "
Earlville - Bayview Heights,630,8268," 8,268 "
Edmonton,1515,10750," 10,750 "
Gordonvale - Trinity,926,8666," 8,666 "
Kanimbla - Mooroobool,993,9885," 9,885 "
Lamb Range,0,0, -   
Manoora,1359,6023," 6,023 "
Manunda,905,5394," 5,394 "
Mount Sheridan,648,8275," 8,275 "
Westcourt - Bungalow,855,6334," 6,334 "
White Rock,798,4729," 4,729 "
Whitfield - Edge Hill,438,8191," 8,191 "
Woree,809,4821," 4,821 "
Babinda,308,4238," 4,238 "
Innisfail,1524,9377," 9,377 "
Johnstone,476,7892," 7,892 "
Tully,784,10662," 10,662 "
Wooroonooran,0,0, -   
Yarrabah,2492,2560," 2,560 "
Daintree,756,6350," 6,350 "
Port Douglas,114,5257," 5,257 "
Atherton,845,10713," 10,713 "
Herberton,655,5639," 5,639 "
Kuranda,511,4495," 4,495 "
Malanda - Yungaburra,327,8481," 8,481 "
Mareeba,1360,11078," 11,078 "
Balonne,698,4378," 4,378 "
Chinchilla,418,8132," 8,132 "
Goondiwindi,375,6356," 6,356 "
Inglewood - Waggamba,201,4246," 4,246 "
Miles - Wandoan,171,4063," 4,063 "
Roma,571,6853," 6,853 "
Roma Region,338,5815," 5,815 "
Tara,265,4222," 4,222 "
Crows Nest - Rosalie,267,8559," 8,559 "
Jondaryan,498,7511," 7,511 "
Millmerran,161,3309," 3,309 "
Pittsworth,154,5718," 5,718 "
Wambo,1030,17023," 17,023 "
Clifton - Greenmount,135,4894," 4,894 "
Southern Downs - East,128,4228," 4,228 "
Southern Downs - West,194,4655," 4,655 "
Stanthorpe,171,5409," 5,409 "
Stanthorpe Region,182,5781," 5,781 "
Warwick,899,15133," 15,133 "
Central Highlands - East,1355,7289," 7,289 "
Central Highlands - West,277,8139," 8,139 "
Emerald,483,13529," 13,529 "
Berserker,618,6878," 6,878 "
Bouldercombe,136,1865," 1,865 "
Emu Park,300,5462," 5,462 "
Frenchville - Mount Archer,502,9075," 9,075 "
Glenlee - Rockyview,302,4980," 4,980 "
Gracemere,978,11668," 11,668 "
Lakes Creek,508,4876," 4,876 "
Mount Morgan,387,2941," 2,941 "
Norman Gardens,585,10124," 10,124 "
Park Avenue,388,5089," 5,089 "
Parkhurst - Kawana,497,6899," 6,899 "
Rockhampton - West,455,5932," 5,932 "
Rockhampton City,293,3261," 3,261 "
Rockhampton Region - East,136,3455," 3,455 "
Rockhampton Region - North,96,4243," 4,243 "
Rockhampton Region - West,105,2917," 2,917 "
Shoalwater Bay,0,14, 14 
The Range - Allenstown,424,8193," 8,193 "
Yeppoon,779,18111," 18,111 "
Banana,329,8555," 8,555 "
Biloela,246,5764," 5,764 "
Agnes Water - Miriam Vale,200,6024," 6,024 "
Boyne Island - Tannum Sands,343,9898," 9,898 "
Callemondah,0,21, 21 
Clinton - New Auckland,599,13462," 13,462 "
Gladstone,309,6017," 6,017 "
Gladstone Hinterland,401,11745," 11,745 "
Kin Kora - Sun Valley,143,3616," 3,616 "
South Trees,0,0, -   
Telina - Toolooa,291,6143," 6,143 "
West Gladstone,230,4708," 4,708 "
Broadbeach Waters,76,7775," 7,775 "
Burleigh Heads,100,8769," 8,769 "
Burleigh Waters,172,14159," 14,159 "
Mermaid Beach - Broadbeach,112,11916," 11,916 "
Mermaid Waters,137,12168," 12,168 "
Miami,106,6846," 6,846 "
Coolangatta,134,5950," 5,950 "
Currumbin - Tugun,265,11313," 11,313 "
Currumbin Waters,237,9122," 9,122 "
Elanora,264,12150," 12,150 "
Palm Beach,306,14654," 14,654 "
Arundel,156,10244," 10,244 "
Biggera Waters,111,8535," 8,535 "
Coombabah,225,10388," 10,388 "
Labrador,389,18261," 18,261 "
Paradise Point - Hollywell,72,9396," 9,396 "
Runaway Bay,105,9069," 9,069 "
Guanaba - Springbrook,93,4238," 4,238 "
Tamborine - Canungra,220,14272," 14,272 "
Currumbin Valley - Tallebudgera,107,7150," 7,150 "
Mudgeeraba - Bonogin,298,18261," 18,261 "
Reedy Creek - Andrews,119,7976," 7,976 "
Carrara,199,12191," 12,191 "
Highland Park,181,8365," 8,365 "
Nerang - Mount Nathan,475,20532," 20,532 "
Pacific Pines - Gaven,317,18317," 18,317 "
Worongary - Tallai,110,7881," 7,881 "
Coomera,331,13305," 13,305 "
Helensvale,198,16861," 16,861 "
Hope Island,75,11230," 11,230 "
Jacobs Well - Alberton,93,3640," 3,640 "
Ormeau - Yatala,344,19677," 19,677 "
Oxenford - Maudsland,264,15790," 15,790 "
Pimpama,302,9166," 9,166 "
Upper Coomera - Willow Vale,739,31216," 31,216 "
Clear Island Waters,27,4118," 4,118 "
Merrimac,89,7070," 7,070 "
Robina,253,23109," 23,109 "
Varsity Lakes,270,15182," 15,182 "
Ashmore,156,11910," 11,910 "
Molendinar,161,6378," 6,378 "
Parkwood,183,8706," 8,706 "
Southport - North,265,14692," 14,692 "
Southport - South,325,17210," 17,210 "
Benowa,73,8739," 8,739 "
Bundall,46,4522," 4,522 "
Main Beach,34,3883," 3,883 "
Surfers Paradise,194,23686," 23,686 "
Darra - Sumner,71,4933," 4,933 "
Durack,221,7952," 7,952 "
Forest Lake - Doolandella,476,27708," 27,708 "
Inala - Richlands,865,18007," 18,007 "
Oxley (Qld),118,7819," 7,819 "
Wacol,779,5813," 5,813 "
Boonah,278,11884," 11,884 "
Esk,151,5158," 5,158 "
Lake Manchester - England Creek,0,0, -   
Lockyer Valley - East,934,19816," 19,816 "
Lowood,576,14047," 14,047 "
Rosewood,473,11807," 11,807 "
Brassall,598,10902," 10,902 "
Bundamba,446,8921," 8,921 "
Churchill - Yamanto,304,6766," 6,766 "
Ipswich - Central,377,6558," 6,558 "
Ipswich - East,932,17893," 17,893 "
Ipswich - North,90,4642," 4,642 "
Karalee - Barellan Point,114,5507," 5,507 "
Karana Downs,89,6092," 6,092 "
Leichhardt - One Mile,680,7659," 7,659 "
North Ipswich - Tivoli,328,6397," 6,397 "
Raceview,668,15174," 15,174 "
Ripley,130,4619," 4,619 "
Riverview,276,3071," 3,071 "
Bellbird Park - Brookwater,375,13761," 13,761 "
Camira - Gailes,362,9238," 9,238 "
Carole Park,0,7, 7 
Collingwood Park - Redbank,311,8519," 8,519 "
Goodna,619,10883," 10,883 "
New Chum,0,0, -   
Redbank Plains,808,19304," 19,304 "
Springfield,207,6777," 6,777 "
Springfield Lakes,318,15428," 15,428 "
Beaudesert,727,13917," 13,917 "
Beenleigh,436,8253," 8,253 "
Eagleby,590,13327," 13,327 "
Edens Landing - Holmview,219,7452," 7,452 "
Mount Warren Park,136,5789," 5,789 "
Wolffdene - Bahrs Scrub,126,6105," 6,105 "
Boronia Heights - Park Ridge,391,12239," 12,239 "
Browns Plains,255,7374," 7,374 "
Chambers Flat - Logan Reserve,116,5060," 5,060 "
Crestmead,520,11989," 11,989 "
Greenbank Military Camp,0,0, -   
Hillcrest,237,8153," 8,153 "
Marsden,537,14448," 14,448 "
Munruben - Park Ridge South,102,4613," 4,613 "
Regents Park - Heritage Park,392,15938," 15,938 "
Greenbank,366,12845," 12,845 "
Jimboomba,850,25744," 25,744 "
Logan Village,172,7000," 7,000 "
Bethania - Waterford,346,10869," 10,869 "
Cornubia - Carbrook,159,8452," 8,452 "
Loganholme - Tanah Merah,243,11129," 11,129 "
Loganlea,457,10434," 10,434 "
Shailer Park,166,11645," 11,645 "
Waterford West,285,7243," 7,243 "
Daisy Hill,130,6636," 6,636 "
Kingston (Qld.),626,10412," 10,412 "
Logan Central,323,6136," 6,136 "
Rochedale South - Priestdale,249,15455," 15,455 "
Slacks Creek,513,10431," 10,431 "
Springwood,150,9278," 9,278 "
Underwood,85,6344," 6,344 "
Woodridge,632,12580," 12,580 "
Bowen,851,9100," 9,100 "
Broadsound - Nebo,317,8505," 8,505 "
Clermont,93,3697," 3,697 "
Collinsville,199,3460," 3,460 "
Moranbah,342,8735," 8,735 "
Andergrove - Beaconsfield,1135,14910," 14,910 "
East Mackay,119,3573," 3,573 "
Eimeo - Rural View,655,12327," 12,327 "
Eungella Hinterland,0,13, 13 
Mackay,201,3655," 3,655 "
Mackay Harbour,3,518, 518 
Mount Pleasant - Glenella,334,10708," 10,708 "
North Mackay,376,5999," 5,999 "
Ooralea - Bakers Creek,161,5034," 5,034 "
Pioneer Valley,306,8211," 8,211 "
Sarina,711,11616," 11,616 "
Seaforth - Calen,267,8126," 8,126 "
Shoal Point - Bucasia,377,5749," 5,749 "
Slade Point,414,3348," 3,348 "
South Mackay,403,6708," 6,708 "
Walkerston - Eton,261,8324," 8,324 "
West Mackay,185,6160," 6,160 "
Airlie - Whitsundays,248,12932," 12,932 "
Cape Conway,0,0, -   
Proserpine,338,8294," 8,294 "
Beachmere - Sandstone Point,509,14892," 14,892 "
Bribie Island,403,18145," 18,145 "
Burpengary - East,105,3967," 3,967 "
Caboolture,1379,26825," 26,825 "
Caboolture - South,1159,20344," 20,344 "
Elimbah,124,3962," 3,962 "
Morayfield - East,412,8433," 8,433 "
Wamuran,90,3928," 3,928 "
Kilcoy,174,5383," 5,383 "
Woodford - D'Aguilar,426,7851," 7,851 "
Burpengary,416,14022," 14,022 "
Deception Bay,1094,22449," 22,449 "
Morayfield,118,4826," 4,826 "
Narangba,402,18575," 18,575 "
Upper Caboolture,66,3021," 3,021 "
Clontarf,245,8252," 8,252 "
Margate - Woody Point,412,11695," 11,695 "
Redcliffe,261,10161," 10,161 "
Rothwell - Kippa-Ring,652,17139," 17,139 "
Scarborough - Newport - Moreton Island,202,12226," 12,226 "
Albany Creek,222,15800," 15,800 "
Cashmere,279,18805," 18,805 "
Dayboro,110,8490," 8,490 "
Eatons Hill,79,7972," 7,972 "
The Hills District,335,23364," 23,364 "
Samford Valley,101,11757," 11,757 "
Dakabin - Kallangur,778,23929," 23,929 "
Murrumba Downs - Griffin,386,17519," 17,519 "
North Lakes - Mango Hill,601,30104," 30,104 "
Bray Park,372,10246," 10,246 "
Lawnton,233,6016," 6,016 "
Petrie,234,8689," 8,689 "
Strathpine - Brendale,377,12266," 12,266 "
Aurukun,1151,1275," 1,275 "
Cape York,3876,7516," 7,516 "
Croydon - Etheridge,90,1090," 1,090 "
Kowanyama - Pormpuraaw,1487,1698," 1,698 "
Northern Peninsula,2442,2796," 2,796 "
Tablelands,926,5981," 5,981 "
Torres,2476,3612," 3,612 "
Torres Strait Islands,4144,4517," 4,517 "
Weipa,760,3903," 3,903 "
Carpentaria,3236,4828," 4,828 "
Mount Isa,3046,18342," 18,342 "
Mount Isa Region,796,3357," 3,357 "
Northern Highlands,191,3124," 3,124 "
Barcaldine - Blackall,273,4765," 4,765 "
Charleville,542,4309," 4,309 "
Far Central West,297,2117," 2,117 "
Far South West,632,2803," 2,803 "
Longreach,195,3663," 3,663 "
Buderim - North,189,16616," 16,616 "
Buderim - South,197,16322," 16,322 "
Mountain Creek,205,11255," 11,255 "
Sippy Downs,219,10298," 10,298 "
Aroona - Currimundi,241,10072," 10,072 "
Buddina - Minyama,92,6428," 6,428 "
Caloundra - Kings Beach,116,6704," 6,704 "
Caloundra - West,428,20278," 20,278 "
Golden Beach - Pelican Waters,217,11851," 11,851 "
Moffat Beach - Battery Hill,141,7835," 7,835 "
Parrearra - Warana,185,9505," 9,505 "
Wurtulla - Birtinya,158,7838," 7,838 "
Coolum Beach,291,14590," 14,590 "
Marcoola - Mudjimba,210,10867," 10,867 "
Maroochydore - Kuluin,371,19163," 19,163 "
Mooloolaba - Alexandra Headland,155,11692," 11,692 "
Noosa Heads,29,4489," 4,489 "
Noosaville,72,8734," 8,734 "
Sunshine Beach,54,6530," 6,530 "
Tewantin,201,10306," 10,306 "
Peregian Beach - Marcus Beach,39,3755," 3,755 "
Peregian Springs,96,7340," 7,340 "
Beerwah,215,8201," 8,201 "
Caloundra Hinterland,123,8539," 8,539 "
Glass House Mountains,107,5838," 5,838 "
Landsborough,241,10140," 10,140 "
Maroochy Hinterland,95,6255," 6,255 "
Palmwoods,175,10612," 10,612 "
Bli Bli,207,8355," 8,355 "
Diddillibah - Rosemount,56,3766," 3,766 "
Eumundi - Yandina,255,10546," 10,546 "
Nambour,691,19961," 19,961 "
Noosa Hinterland,418,21851," 21,851 "
Cambooya - Wyreema,187,6961," 6,961 "
Darling Heights,489,13743," 13,743 "
Drayton - Harristown,559,10195," 10,195 "
Gatton,238,7431," 7,431 "
Gowrie (Qld),284,6413," 6,413 "
Highfields,306,13177," 13,177 "
Lockyer Valley - West,335,11361," 11,361 "
Middle Ridge,78,7142," 7,142 "
Newtown (Qld),622,9596," 9,596 "
North Toowoomba - Harlaxton,331,5738," 5,738 "
Rangeville,167,8309," 8,309 "
Toowoomba - Central,572,13375," 13,375 "
Toowoomba - East,243,9754," 9,754 "
Toowoomba - West,495,13004," 13,004 "
Wilsonton,886,13312," 13,312 "
Ayr,649,9097," 9,097 "
Burdekin,325,7916," 7,916 "
Charters Towers,884,8126," 8,126 "
Dalrymple,151,3755," 3,755 "
Ingham,331,4428," 4,428 "
Ingham Region,334,6454," 6,454 "
Palm Island,2299,2443," 2,443 "
Aitkenvale,319,4792," 4,792 "
Annandale,270,10066," 10,066 "
Belgian Gardens - Pallarenda,112,3284," 3,284 "
Bohle Plains,289,7235," 7,235 "
Condon - Rasmussen,1319,10476," 10,476 "
Cranbrook,461,5913," 5,913 "
Deeragun,1331,22405," 22,405 "
Douglas,207,7741," 7,741 "
Garbutt - West End,579,6532," 6,532 "
Gulliver - Currajong - Vincent,839,7728," 7,728 "
Heatley,452,4036," 4,036 "
Hermit Park - Rosslea,320,5151," 5,151 "
Hyde Park - Pimlico,291,4650," 4,650 "
Kelso,1260,10627," 10,627 "
Kirwan - East,890,7818," 7,818 "
Kirwan - West,1028,15555," 15,555 "
Magnetic Island,60,2342," 2,342 "
Mount Louisa,611,9260," 9,260 "
Mundingburra,157,3625," 3,625 "
Northern Beaches,278,6363," 6,363 "
Oonoonba,284,6552," 6,552 "
South Townsville - Railway Estate,309,5209," 5,209 "
Townsville - South,120,4300," 4,300 "
Townsville City - North Ward,319,9053," 9,053 "
Wulguru - Roseneath,944,6098," 6,098 "
Ashfield - Kepnock,272,5228," 5,228 "
Bargara - Burnett Heads,458,16595," 16,595 "
Branyan - Kensington,142,4706," 4,706 "
Bundaberg,334,6122," 6,122 "
Bundaberg East - Kalkie,201,5473," 5,473 "
Bundaberg North - Gooburrum,328,7217," 7,217 "
Bundaberg Region - North,317,8866," 8,866 "
Bundaberg Region - South,300,9837," 9,837 "
Millbank - Avoca,340,7417," 7,417 "
Svensson Heights - Norville,301,5613," 5,613 "
Walkervale - Avenell Heights,567,10696," 10,696 "
Gayndah - Mundubbera,405,6657," 6,657 "
Gin Gin,140,5115," 5,115 "
Kingaroy,497,10288," 10,288 "
Kingaroy Region - North,1977,9570," 9,570 "
Kingaroy Region - South,77,3922," 3,922 "
Monto - Eidsvold,273,3830," 3,830 "
Nanango,456,9679," 9,679 "
North Burnett,0,8, 8 
Cooloola,248,6265," 6,265 "
Gympie - North,608,14217," 14,217 "
Gympie - South,214,6748," 6,748 "
Gympie Region,543,18567," 18,567 "
Kilkivan,152,3687," 3,687 "
Booral - River Heads,217,4602," 4,602 "
Craignish - Dundowran Beach,156,4815," 4,815 "
Pialba - Eli Waters,558,13950," 13,950 "
Point Vernon,241,5693," 5,693 "
Torquay - Scarness - Kawungan,644,15001," 15,001 "
Urangan - Wondunna,462,12614," 12,614 "
Burrum - Fraser,417,9570," 9,570 "
Granville,166,3208," 3,208 "
Maryborough (Qld),974,18240," 18,240 "
Maryborough Region - South,233,8390," 8,390 "
Tinana,166,5477," 5,477 "
