SA2_NAME16,CALD,DISABILTIE,FINANCIAL,LAW,OLDERPEOPL
Agnes Water - Miriam Vale,0,3,22,4,1
Airlie - Whitsundays,1,0,97,14,10
Aitkenvale,1,7,170,22,9
Albany Creek,1,8,20,12,8
Albion,18,0,35,2,1
Alderley,0,1,17,5,0
Alexandra Hills,0,10,87,10,0
Algester,0,1,5,0,0
Andergrove - Beaconsfield,0,0,4,1,0
Annandale,0,0,0,0,0
Annerley,6,4,100,18,0
Aroona - Currimundi,0,0,11,2,3
Arundel,0,7,9,1,0
Ascot,1,2,66,11,0
Ashfield - Kepnock,0,0,3,0,0
Ashgrove,1,7,32,3,0
Ashmore,0,1,17,1,3
Aspley,2,3,14,4,1
Atherton,0,7,39,6,0
Auchenflower,0,0,4,0,0
Aurukun,0,7,6,6,0
Ayr,0,1,11,1,0
Babinda,0,0,3,2,0
Bald Hills,1,4,29,8,0
Balmoral,0,0,47,2,0
Balonne,1,1,13,11,0
Banana,0,1,24,6,3
Barcaldine - Blackall,9,0,8,4,0
Bardon,0,8,5,11,1
Bargara - Burnett Heads,0,0,2,0,0
Beachmere - Sandstone Point,0,3,37,14,0
Beaudesert,0,7,114,12,2
Beenleigh,0,5,115,19,2
Beerwah,0,2,15,4,4
Belgian Gardens - Pallarenda,0,0,2,0,0
Bellbird Park - Brookwater,1,21,348,31,4
Bellbowrie - Moggill,0,0,0,3,0
Belmont - Gumdale,0,1,31,6,0
Benowa,2,10,260,24,5
Bentley Park,0,0,11,2,0
Berserker,0,0,4,0,0
Bethania - Waterford,1,7,159,11,2
Biggera Waters,0,2,13,1,0
Biloela,0,5,6,6,3
Birkdale,3,4,60,7,2
Bli Bli,0,1,2,1,2
Bohle Plains,0,0,0,0,0
Boonah,0,0,56,7,0
Boondall,0,2,17,3,0
Booral - River Heads,4,25,160,43,21
Boronia Heights - Park Ridge,1,11,39,3,2
Bouldercombe,0,0,0,0,0
Bowen,0,0,4,1,0
Boyne Island - Tannum Sands,0,1,7,2,0
Bracken Ridge,0,3,21,5,0
Branyan - Kensington,0,0,0,0,0
Brassall,5,0,31,1,0
Bray Park,0,1,57,39,0
Bribie Island,1,8,84,19,3
Bridgeman Downs,0,0,5,1,2
Brighton (Qld),0,1,9,3,1
Brinsmead,0,0,2,0,0
Brisbane Airport,0,1,5,0,2
Brisbane City,89,224,1757,452,88
Brisbane Port - Lytton,0,1,0,1,3
Broadbeach Waters,0,0,5,3,0
Broadsound - Nebo,0,0,10,11,0
Brookfield - Kenmore Hills,3,2,34,7,0
Browns Plains,0,1,57,5,4
Buddina - Minyama,0,1,3,1,1
Buderim - North,0,0,3,1,0
Buderim - South,0,10,107,13,9
Bulimba,0,3,7,0,0
Bundaberg,0,29,83,13,19
Bundaberg East - Kalkie,0,0,4,0,0
Bundaberg North - Gooburrum,0,0,3,2,0
Bundaberg Region - North,4,27,245,23,5
Bundaberg Region - South,0,0,22,2,3
Bundall,0,0,3,0,0
Bundamba,0,4,175,14,0
Burdekin,0,3,49,0,0
Burleigh Heads,0,11,26,1,0
Burleigh Waters,0,6,129,17,1
Burpengary,0,5,46,0,0
Burpengary - East,0,4,101,12,16
Burrum - Fraser,0,1,8,4,0
Caboolture,12,83,495,66,16
Caboolture - South,1,7,49,6,7
Cairns City,7,30,208,143,33
Calamvale - Stretton,0,1,60,11,1
Callemondah,1,0,0,0,0
Caloundra - Kings Beach,1,8,290,26,67
Caloundra - West,1,11,176,24,12
Caloundra Hinterland,0,1,11,3,0
Cambooya - Wyreema,0,0,0,1,0
Camira - Gailes,0,0,25,0,0
Camp Hill,0,0,13,2,0
Cannon Hill,1,3,76,16,1
Capalaba,0,5,50,14,0
Cape Conway,0,0,0,0,0
Cape York,19,2,96,6,0
Carina,2,2,6,0,0
Carina Heights,0,11,107,17,3
Carindale,0,0,5,0,0
Carole Park,0,0,1,0,0
Carpentaria,7,2,34,3,1
Carrara,0,2,9,2,0
Carseldine,0,1,6,0,0
Cashmere,5,11,152,28,1
Central Highlands - East,0,2,64,23,0
Central Highlands - West,0,2,48,3,4
Chambers Flat - Logan Reserve,0,0,20,0,1
Chapel Hill,0,0,0,0,0
Charleville,2,7,19,5,0
Charters Towers,0,3,4,0,0
Chelmer - Graceville,0,0,3,1,0
Chermside,0,13,144,16,4
Chermside West,0,2,23,0,1
Chinchilla,0,4,61,3,2
Churchill - Yamanto,0,2,7,0,0
Clayfield,0,0,3,9,0
Clear Island Waters,0,0,2,1,0
Clermont,0,0,4,0,0
Cleveland,0,3,48,18,4
Clifton - Greenmount,0,1,15,0,0
Clifton Beach - Kewarra Beach,0,2,25,6,1
Clinton - New Auckland,0,0,8,2,0
Clontarf,0,4,130,17,3
Collingwood Park - Redbank,0,14,298,31,0
Collinsville,11,16,32,3,3
Condon - Rasmussen,0,0,17,0,0
Coolangatta,0,8,6,15,8
Cooloola,0,2,18,3,0
Coolum Beach,0,1,0,2,1
Coombabah,0,7,130,25,6
Coomera,1,5,66,7,2
Coopers Plains,0,0,11,1,1
Coorparoo,0,0,46,10,3
Corinda,1,1,40,4,3
Cornubia - Carbrook,1,5,22,9,0
Craignish - Dundowran Beach,0,0,2,0,0
Cranbrook,0,0,21,0,0
Crestmead,3,21,224,13,10
Crows Nest - Rosalie,3,0,70,21,0
Croydon - Etheridge,0,0,28,2,5
Currumbin - Tugun,0,6,48,10,19
Currumbin Valley - Tallebudgera,0,3,48,1,1
Currumbin Waters,0,2,1,4,0
Daintree,0,2,30,6,6
Daisy Hill,0,0,5,0,0
Dakabin - Kallangur,14,5,128,16,7
Dalrymple,1,5,155,7,2
Darling Heights,0,2,2,0,1
Darra - Sumner,1,0,27,0,0
Dayboro,1,10,235,26,4
Deagon,0,0,5,7,0
Deception Bay,21,69,262,36,1
Deeragun,0,5,7,1,0
Diddillibah - Rosemount,0,0,7,0,0
Douglas,1,5,34,4,0
Drayton - Harristown,0,0,4,2,0
Durack,0,0,21,0,0
Eagle Farm - Pinkenba,1,1,4,0,1
Eagleby,0,0,46,3,1
Earlville - Bayview Heights,0,0,5,3,0
East Brisbane,2,1,99,22,0
East Mackay,0,0,3,0,0
Eatons Hill,0,5,4,4,0
Edens Landing - Holmview,0,0,13,0,0
Edmonton,0,2,69,1,0
Eight Mile Plains,15,9,96,11,5
Eimeo - Rural View,0,0,4,0,0
Elanora,0,8,69,23,1
Elimbah,0,0,8,1,0
Emerald,0,0,4,0,0
Emu Park,0,0,18,0,0
Enoggera,3,11,90,17,9
Enoggera Reservoir,0,0,0,0,0
Esk,0,0,25,5,0
Eumundi - Yandina,0,1,29,1,19
Eungella Hinterland,0,0,21,1,0
Everton Park,12,14,97,56,7
Fairfield - Dutton Park,0,3,5,0,0
Far Central West,0,0,4,5,0
Far South West,0,3,16,3,0
Fig Tree Pocket,0,0,0,0,0
Forest Lake - Doolandella,0,10,117,23,12
Fortitude Valley,2,13,57,13,0
Frenchville - Mount Archer,8,0,21,1,2
Freshwater - Stratford,0,0,6,0,0
Garbutt - West End,0,0,3,0,0
Gatton,3,0,16,4,0
Gayndah - Mundubbera,0,0,22,6,0
Geebung,2,7,171,24,2
Gin Gin,0,0,15,0,2
Gladstone,3,5,100,20,9
Gladstone Hinterland,7,14,277,41,9
Glass House Mountains,0,4,20,5,0
Glenlee - Rockyview,0,0,1,4,2
Golden Beach - Pelican Waters,0,0,2,0,2
Goodna,1,4,128,4,0
Goondiwindi,0,2,4,2,1
Gordonvale - Trinity,0,0,33,2,0
Gowrie (Qld),4,0,0,0,0
Gracemere,0,0,33,0,0
Grange,0,0,0,2,0
Granville,0,0,5,0,0
Greenbank,0,4,57,20,10
Greenbank Military Camp,0,0,0,0,0
Greenslopes,0,9,73,22,4
Guanaba - Springbrook,1,31,307,15,8
Gulliver - Currajong - Vincent,0,0,4,1,0
Gympie - North,0,17,70,19,7
Gympie - South,0,0,0,0,4
Gympie Region,1,9,124,19,1
Hamilton (Qld),0,0,2,0,0
Hawthorne,0,0,2,0,0
Heatley,0,0,80,0,0
Helensvale,1,6,98,10,4
Hendra,1,2,41,5,9
Herberton,0,4,19,4,2
Hermit Park - Rosslea,0,0,5,1,0
Highfields,0,0,1,0,0
Highgate Hill,0,0,8,1,0
Highland Park,0,0,13,0,0
Hillcrest,0,0,5,0,0
Holland Park,0,9,13,4,1
Holland Park West,4,19,63,14,1
Hope Island,0,0,10,8,1
Hyde Park - Pimlico,0,0,75,6,6
Inala - Richlands,10,16,277,71,23
Indooroopilly,0,4,74,18,0
Ingham,0,0,9,2,0
Ingham Region,0,0,4,0,0
Inglewood - Waggamba,1,3,102,14,0
Innisfail,1,5,35,3,1
Ipswich - Central,2,80,666,54,13
Ipswich - East,0,4,50,18,0
Ipswich - North,1,1,58,9,0
Jacobs Well - Alberton,0,0,6,1,0
Jimboomba,0,5,90,26,8
Jindalee - Mount Ommaney,1,6,6,0,1
Johnstone,0,0,16,0,0
Jondaryan,0,2,66,1,0
Kangaroo Point,0,4,19,5,0
Kanimbla - Mooroobool,0,0,7,0,5
Karalee - Barellan Point,0,0,2,0,0
Karana Downs,0,0,0,0,0
Kedron - Gordon Park,0,2,41,7,0
Kelso,0,0,26,2,0
Kelvin Grove - Herston,1,3,89,2,0
Kenmore,1,0,4,1,0
Keperra,0,3,32,10,2
Kilcoy,0,1,26,2,0
Kilkivan,0,0,3,9,0
Kin Kora - Sun Valley,0,0,0,0,0
Kingaroy,0,10,28,4,0
Kingaroy Region - North,0,3,45,8,1
Kingaroy Region - South,0,4,66,11,2
Kingston (Qld.),0,2,49,27,1
Kirwan - East,0,0,1,0,0
Kirwan - West,0,4,29,2,1
Kowanyama - Pormpuraaw,0,0,5,17,0
Kuraby,3,7,18,5,1
Kuranda,0,1,18,4,0
Labrador,0,1,56,3,1
Lake Manchester - England Creek,0,0,0,0,0
Lakes Creek,0,0,2,0,0
Lamb Range,13,40,326,80,8
Landsborough,0,3,18,3,0
Lawnton,0,0,55,2,0
Leichhardt - One Mile,0,1,50,1,0
Lockyer Valley - East,0,4,70,13,2
Lockyer Valley - West,1,0,42,6,0
Logan Central,6,33,400,45,12
Logan Village,2,20,457,55,2
Loganholme - Tanah Merah,0,1,48,3,0
Loganlea,2,12,162,17,1
Longreach,0,0,8,1,0
Lowood,0,0,72,3,2
Macgregor (Qld),0,0,29,3,0
Mackay,6,30,142,51,16
Mackay Harbour,0,0,0,0,0
Magnetic Island,0,0,26,4,0
Main Beach,0,0,4,0,0
Malanda - Yungaburra,0,1,21,1,0
Manly - Lota,0,0,12,0,0
Manly West,0,27,64,12,0
Manoora,0,0,7,0,0
Mansfield (Qld),0,1,19,0,0
Manunda,0,1,20,1,1
Marcoola - Mudjimba,0,1,20,3,1
Mareeba,1,1,18,2,6
Margate - Woody Point,0,3,29,7,1
Maroochy Hinterland,1,0,1,1,0
Maroochydore - Kuluin,2,45,159,43,8
Marsden,2,0,57,3,5
Maryborough (Qld),4,14,87,18,16
Maryborough Region - South,0,10,178,20,2
McDowall,0,1,1,4,0
Mermaid Beach - Broadbeach,0,6,27,3,1
Mermaid Waters,0,13,108,13,3
Merrimac,0,0,6,1,0
Miami,1,1,1,1,0
Middle Park - Jamboree Heights,0,4,52,15,0
Middle Ridge,0,0,1,2,0
Miles - Wandoan,0,0,31,4,0
Millbank - Avoca,0,0,0,0,0
Millmerran,6,3,25,0,1
Mitchelton,0,1,14,6,6
Moffat Beach - Battery Hill,0,1,0,1,0
Molendinar,0,16,7,4,2
Monto - Eidsvold,0,3,14,1,1
Mooloolaba - Alexandra Headland,0,12,27,3,1
Moorooka,2,24,76,6,2
Moranbah,0,1,21,4,0
Morayfield,1,12,192,18,5
Morayfield - East,0,2,2,2,0
Morningside - Seven Hills,0,8,38,11,10
Mount Coot-tha,0,1,40,9,0
Mount Gravatt,7,9,167,52,7
Mount Isa,0,2,19,0,1
Mount Isa Region,1,8,129,20,4
Mount Louisa,0,0,12,1,0
Mount Morgan,0,2,22,1,1
Mount Pleasant - Glenella,0,0,3,4,0
Mount Sheridan,0,0,1,0,0
Mount Warren Park,0,0,3,0,0
Mountain Creek,4,0,43,8,0
Mudgeeraba - Bonogin,0,0,22,0,7
Mundingburra,0,0,14,0,0
Munruben - Park Ridge South,0,0,51,4,0
Murarrie,0,0,33,7,0
Murrumba Downs - Griffin,0,2,28,9,0
Nambour,0,19,129,31,7
Nanango,0,4,51,9,14
Narangba,7,2,66,10,1
Nerang - Mount Nathan,2,5,84,16,1
New Chum,0,1,24,3,4
New Farm,0,13,51,6,11
Newmarket,0,0,4,3,0
Newstead - Bowen Hills,5,7,128,20,3
Newtown (Qld),0,0,0,0,0
Noosa Heads,0,6,19,1,4
Noosa Hinterland,0,1,80,17,1
Noosaville,2,3,18,5,3
Norman Gardens,0,0,6,0,0
Norman Park,0,0,6,10,0
North Burnett,0,0,0,0,0
North Ipswich - Tivoli,0,0,4,0,0
North Lakes - Mango Hill,2,48,182,21,4
North Mackay,0,0,1,0,0
North Toowoomba - Harlaxton,0,0,12,1,0
Northern Beaches,0,0,58,7,0
Northern Highlands,0,0,20,0,0
Northern Peninsula,0,0,7,4,0
Northgate - Virginia,0,0,21,0,6
Nudgee - Banyo,0,1,66,11,0
Nundah,4,25,106,39,4
Oonoonba,0,0,3,0,0
Ooralea - Bakers Creek,0,0,5,0,0
Ormeau - Yatala,0,3,106,26,0
Ormiston,0,6,2,5,1
Oxenford - Maudsland,0,1,51,1,1
Oxley (Qld),2,11,23,0,0
Pacific Pines - Gaven,0,1,19,2,0
Paddington - Milton,19,7,48,121,2
Pallara - Willawong,6,2,57,6,0
Palm Beach,1,2,28,14,1
Palm Island,0,0,6,5,0
Palmwoods,0,0,16,3,0
Paradise Point - Hollywell,0,0,11,0,0
Park Avenue,0,0,12,0,0
Parkhurst - Kawana,0,0,7,1,0
Parkinson - Drewvale,1,2,65,7,0
Parkwood,2,20,166,29,8
Parrearra - Warana,0,0,12,2,0
Peregian Beach - Marcus Beach,0,0,4,13,0
Peregian Springs,0,13,94,12,0
Petrie,0,9,36,12,1
Pialba - Eli Waters,0,0,21,4,2
Pimpama,3,13,384,47,6
Pinjarra Hills - Pullenvale,0,1,14,2,1
Pioneer Valley,0,0,15,1,0
Pittsworth,0,6,53,2,1
Point Vernon,0,1,0,1,0
Port Douglas,0,2,4,1,0
Proserpine,0,1,36,4,0
Raceview,1,0,28,0,0
Rangeville,0,0,4,0,0
Red Hill (Qld),0,0,1,0,0
Redbank Plains,6,16,82,1,1
Redcliffe,5,20,162,109,19
Redland Bay,0,2,25,10,3
Redland Islands,0,4,74,11,3
Redlynch,0,0,2,0,0
Reedy Creek - Andrews,1,2,68,3,2
Regents Park - Heritage Park,0,6,153,24,2
Ripley,0,0,13,2,0
Riverhills,0,0,0,0,0
Riverview,0,0,15,5,0
Robertson,0,0,4,0,0
Robina,0,10,159,41,12
Rochedale - Burbank,1,2,83,10,1
Rochedale South - Priestdale,0,0,9,0,0
Rockhampton - West,0,0,2,1,0
Rockhampton City,5,14,157,48,19
Rockhampton Region - East,0,6,147,5,1
Rockhampton Region - North,0,4,38,4,1
Rockhampton Region - West,0,0,1,0,0
Rocklea - Acacia Ridge,23,3,174,12,6
Roma,0,4,19,9,1
Roma Region,1,1,33,6,1
Rosewood,0,3,26,4,0
Rothwell - Kippa-Ring,1,7,149,18,4
Runaway Bay,0,0,3,0,3
Runcorn,2,3,9,0,2
Salisbury - Nathan,0,3,57,11,9
Samford Valley,0,0,14,0,0
Sandgate - Shorncliffe,6,12,150,24,5
Sarina,0,2,32,1,2
Scarborough - Newport - Moreton Island,0,3,7,4,1
Seaforth - Calen,0,0,6,0,0
Seventeen Mile Rocks - Sinnamon Park,1,3,13,10,5
Shailer Park,1,4,33,11,0
Sheldon - Mount Cotton,6,6,232,22,3
Sherwood,0,0,0,1,0
Shoal Point - Bucasia,0,2,11,2,0
Shoalwater Bay,0,0,0,0,0
Sippy Downs,0,0,20,5,0
Slacks Creek,0,0,25,6,0
Slade Point,0,0,4,0,0
South Brisbane,1,6,42,8,1
South Mackay,0,0,0,0,0
South Townsville - Railway Estate,0,0,11,0,0
South Trees,0,0,0,0,0
Southern Downs - East,0,1,12,1,0
Southern Downs - West,0,0,18,3,2
Southport - North,7,25,399,75,17
Southport - South,12,5,164,26,6
Spring Hill,25,87,478,210,28
Springfield,0,13,12,9,0
Springfield Lakes,0,0,17,7,0
Springwood,2,0,123,21,1
St Lucia,1,0,13,14,1
Stafford,0,0,6,0,0
Stafford Heights,0,0,6,0,0
Stanthorpe,0,1,17,12,0
Stanthorpe Region,0,0,15,3,0
Strathpine - Brendale,23,25,31,9,1
Sunnybank,4,11,198,19,5
Sunnybank Hills,0,0,16,3,0
Sunshine Beach,0,0,3,0,0
Surfers Paradise,1,5,84,9,5
Svensson Heights - Norville,0,0,0,1,0
Tablelands,0,4,50,4,1
Taigum - Fitzgibbon,0,5,55,17,2
Tamborine - Canungra,1,4,50,3,0
Tara,0,0,15,4,0
Taringa,0,0,10,1,0
Tarragindi,0,0,17,1,0
Telina - Toolooa,0,0,0,0,0
Tewantin,0,1,7,4,0
The Gap,0,5,9,9,5
The Hills District,0,6,48,5,5
The Range - Allenstown,0,0,1,3,0
Thorneside,0,0,6,2,2
Thornlands,0,1,42,4,1
Tinana,0,0,0,0,0
Tingalpa,1,2,49,2,0
Toowong,2,3,22,10,2
Toowoomba - Central,2,31,205,49,18
Toowoomba - East,0,0,4,1,0
Toowoomba - West,1,8,337,43,3
Torquay - Scarness - Kawungan,8,0,14,0,0
Torres,1,0,40,4,8
Torres Strait Islands,0,0,3,0,0
Townsville - South,0,11,409,27,7
Townsville City - North Ward,1,35,196,77,15
Trinity Beach - Smithfield,0,0,2,1,0
Tully,0,1,43,4,0
Underwood,0,0,27,3,0
Upper Caboolture,1,1,0,0,0
Upper Coomera - Willow Vale,1,11,75,19,4
Upper Kedron - Ferny Grove,1,2,14,3,7
Upper Mount Gravatt,9,0,11,5,18
Urangan - Wondunna,0,0,1,0,1
Varsity Lakes,0,1,23,3,0
Victoria Point,0,0,10,0,1
Wacol,0,0,48,8,0
Wakerley,0,0,8,5,0
Walkerston - Eton,2,40,219,24,12
Walkervale - Avenell Heights,0,0,6,0,0
Wambo,2,6,63,6,2
Wamuran,0,4,6,1,0
Warwick,0,5,120,13,2
Waterford West,2,0,16,2,0
Wavell Heights,0,10,1,6,1
Weipa,0,1,0,0,0
Wellington Point,0,2,28,12,0
West End,7,4,159,38,1
West Gladstone,0,0,0,0,0
West Mackay,0,0,5,0,0
Westcourt - Bungalow,0,1,11,3,0
Westlake,0,0,1,0,0
White Rock,0,0,4,0,0
Whitfield - Edge Hill,0,0,1,0,0
Wilsonton,0,0,15,0,1
Wilston,0,1,1,1,0
Windsor,2,19,56,6,5
Wishart,0,2,0,0,0
Wolffdene - Bahrs Scrub,0,0,1,0,0
Woodford - D'Aguilar,1,5,26,2,0
Woodridge,0,1,50,5,0
Woolloongabba,4,15,76,8,22
Wooloowin - Lutwyche,8,7,18,1,2
Wooroonooran,0,0,34,1,0
Woree,0,4,48,1,0
Worongary - Tallai,0,0,0,0,0
Wulguru - Roseneath,4,4,5,0,0
Wurtulla - Birtinya,0,5,77,14,6
Wynnum,0,2,49,16,3
Wynnum West - Hemmant,4,6,84,20,6
Yarrabah,1,0,4,2,0
Yeppoon,0,0,18,0,1
Yeronga,0,2,12,4,2
Yorkeys Knob - Machans Beach,0,0,31,0,1
Zillmere,0,2,55,10,1
