Language,Total
Vietnamese,1357
Turkish,337
Thai,417
Tamil,381
Spanish,1460
Southeast Asian Austronesian languages,2709
Serbian,772
Samoan,4225
Russian,445
Polish,418
Persian (excluding Dari),489
Maltese,75
Macedonian,120
Korean,1100
Japanese,453
Italian,499
Indo-Aryan languages,5321
Greek,468
German,770
French,508
Dutch,475
Croatian,545
Chinese languages,4752
Australian Indigenous Languages ,93
Arabic,2116
Afrikaans,533
