"","SA2_NAME16","atsi_age_0","atsi_age_1","atsi_age_2","atsi_age_3","atsi_age_4","atsi_age_5","atsi_age_6","atsi_age_7","atsi_age_8","Total_atsi_age_0_8"
"1","Beenleigh","0","0","0","0","0","0","0","0","0","0"
"2","Eagleby","0","3","0","4","0","3","0","0","0","12"
"3","Edens Landing - Holmview","0","0","0","0","0","0","0","0","0","0"
"4","Mount Warren Park","0","0","0","0","0","0","0","0","0","0"
"5","Wolffdene - Bahrs Scrub","0","0","0","0","0","0","0","0","0","0"
"6","Boronia Heights - Park Ridge","0","0","0","3","0","0","4","0","0","11"
"7","Browns Plains","0","4","3","0","0","0","0","0","0","10"
"8","Chambers Flat - Logan Reserve","0","0","0","0","0","0","0","0","0","0"
"9","Crestmead","4","0","0","0","3","0","0","0","3","15"
"10","Hillcrest","0","0","0","0","0","0","0","0","0","4"
"11","Marsden","0","0","0","0","6","0","0","0","0","17"
"12","Munruben - Park Ridge South","0","0","0","0","0","0","0","0","0","0"
"13","Regents Park - Heritage Park","0","3","0","0","0","0","3","0","0","3"
"14","Greenbank","0","0","0","0","0","0","0","0","0","3"
"15","Jimboomba","0","0","0","0","0","5","0","0","0","6"
"16","Logan Village","0","0","0","0","0","0","0","0","0","0"
"17","Bethania - Waterford","0","0","0","0","0","0","0","0","0","8"
"18","Cornubia - Carbrook","0","0","0","0","0","0","0","0","0","0"
"19","Loganholme - Tanah Merah","0","6","0","0","0","0","0","0","0","4"
"20","Loganlea","5","0","0","0","0","0","0","0","3","14"
"21","Shailer Park","0","0","0","0","0","0","0","0","0","0"
"22","Waterford West","0","0","0","0","0","0","0","0","0","5"
"23","Daisy Hill","0","0","0","0","0","0","0","0","0","0"
"24","Kingston (Qld.)","0","4","0","0","0","0","8","0","0","13"
"25","Logan Central","0","4","0","0","0","0","0","3","0","6"
"26","Rochedale South - Priestdale","0","0","0","0","0","0","0","0","0","6"
"27","Slacks Creek","0","4","0","3","0","0","0","0","0","4"
"28","Springwood","0","0","0","0","0","0","0","0","0","6"
"29","Underwood","0","0","0","0","0","0","0","0","0","0"
"30","Woodridge","3","0","0","3","0","0","3","5","0","14"
