Variable,Males_x_2006,Females_x_2006,Persons_x_2006,Males_x_2011,Females_x_2011,Persons_x_2011,Males_x_2016,Females_x_2016,Persons_x_2016
Unemployment_rate,4.7,6.5,5.5,6.9,7.4,7.2,8.5,9.3,8.9
Participation_rate,71.8,57.3,64.4,70.5,58.2,64.2,67.2,56.3,61.6
Employment_to_pop_15_up,68.4,53.6,60.9,65.6,53.9,59.7,61.5,51.1,56.2
Same_address_1_yr,94248.00,95763.00,190011.00,108063.00,109843.00,217905.00,112169.00,114643.00,226809.00
Diff_address_1_yr,20925.00,21902.00,42827.00,20557.00,21685.00,42248.00,23425.00,24304.00,47731.00
Same_address_5_yr,54575.00,54999.00,109571.00,65544.00,65922.00,131466.00,71648.00,72270.00,143922.00
Diff_address_5_yr,51474.00,54109.00,105583.00,52650.00,55635.00,108282.00,56564.00,59671.00,116235.00
Postgraduate_Degree,837.00,723.00,1552.00,1414.00,1326.00,2741.00,2061.00,2216.00,4274.00
Graduate_Diploma_Graduate_Cert,439.00,747.00,1180.00,588.00,1125.00,1718.00,834.00,1751.00,2584.00
Bachelor_Degree,4498.00,6970.00,11469.00,6010.00,9749.00,15760.00,7502.00,12154.00,19656.00
Advanced_Diploma_Diploma,4275.00,6226.00,10501.00,5509.00,8567.00,14068.00,7437.00,11952.00,19389.00
