LOC,LF,BP,YEAR,COUNT,YR_AR
Logan (C),"Employed, worked full-time",Oceania and Antarctica,Arrived 2006,434,2006-2010
Logan (C),"Employed, worked full-time",Oceania and Antarctica,Arrived 2007,476,2006-2010
Logan (C),"Employed, worked full-time",Oceania and Antarctica,Arrived 2008,567,2006-2010
Logan (C),"Employed, worked full-time",Oceania and Antarctica,Arrived 2009,393,2006-2010
Logan (C),"Employed, worked full-time",Oceania and Antarctica,Arrived 2010,362,2006-2010
Logan (C),"Employed, worked full-time",Oceania and Antarctica,Arrived 2011,415,2011-2016
Logan (C),"Employed, worked full-time",Oceania and Antarctica,Arrived 2012,475,2011-2016
Logan (C),"Employed, worked full-time",Oceania and Antarctica,Arrived 2013,323,2011-2016
Logan (C),"Employed, worked full-time",Oceania and Antarctica,Arrived 2014,231,2011-2016
Logan (C),"Employed, worked full-time",Oceania and Antarctica,Arrived 2015,187,2011-2016
Logan (C),"Employed, worked full-time",Oceania and Antarctica,Arrived 2016,70,2011-2016
Logan (C),"Employed, worked full-time",North-West Europe,Arrived 2006,149,2006-2010
Logan (C),"Employed, worked full-time",North-West Europe,Arrived 2007,163,2006-2010
Logan (C),"Employed, worked full-time",North-West Europe,Arrived 2008,124,2006-2010
Logan (C),"Employed, worked full-time",North-West Europe,Arrived 2009,79,2006-2010
Logan (C),"Employed, worked full-time",North-West Europe,Arrived 2010,65,2006-2010
Logan (C),"Employed, worked full-time",North-West Europe,Arrived 2011,63,2011-2016
Logan (C),"Employed, worked full-time",North-West Europe,Arrived 2012,60,2011-2016
Logan (C),"Employed, worked full-time",North-West Europe,Arrived 2013,28,2011-2016
Logan (C),"Employed, worked full-time",North-West Europe,Arrived 2014,37,2011-2016
Logan (C),"Employed, worked full-time",North-West Europe,Arrived 2015,29,2011-2016
Logan (C),"Employed, worked full-time",North-West Europe,Arrived 2016,3,2011-2016
Logan (C),"Employed, worked full-time",Southern and Eastern Europe,Arrived 2006,26,2006-2010
Logan (C),"Employed, worked full-time",Southern and Eastern Europe,Arrived 2007,30,2006-2010
Logan (C),"Employed, worked full-time",Southern and Eastern Europe,Arrived 2008,47,2006-2010
Logan (C),"Employed, worked full-time",Southern and Eastern Europe,Arrived 2009,17,2006-2010
Logan (C),"Employed, worked full-time",Southern and Eastern Europe,Arrived 2010,22,2006-2010
Logan (C),"Employed, worked full-time",Southern and Eastern Europe,Arrived 2011,24,2011-2016
Logan (C),"Employed, worked full-time",Southern and Eastern Europe,Arrived 2012,17,2011-2016
Logan (C),"Employed, worked full-time",Southern and Eastern Europe,Arrived 2013,28,2011-2016
Logan (C),"Employed, worked full-time",Southern and Eastern Europe,Arrived 2014,15,2011-2016
Logan (C),"Employed, worked full-time",Southern and Eastern Europe,Arrived 2015,17,2011-2016
Logan (C),"Employed, worked full-time",Southern and Eastern Europe,Arrived 2016,0,2011-2016
Logan (C),"Employed, worked full-time",North Africa and the Middle East,Arrived 2006,26,2006-2010
Logan (C),"Employed, worked full-time",North Africa and the Middle East,Arrived 2007,15,2006-2010
Logan (C),"Employed, worked full-time",North Africa and the Middle East,Arrived 2008,21,2006-2010
Logan (C),"Employed, worked full-time",North Africa and the Middle East,Arrived 2009,13,2006-2010
Logan (C),"Employed, worked full-time",North Africa and the Middle East,Arrived 2010,18,2006-2010
Logan (C),"Employed, worked full-time",North Africa and the Middle East,Arrived 2011,14,2011-2016
Logan (C),"Employed, worked full-time",North Africa and the Middle East,Arrived 2012,17,2011-2016
Logan (C),"Employed, worked full-time",North Africa and the Middle East,Arrived 2013,23,2011-2016
Logan (C),"Employed, worked full-time",North Africa and the Middle East,Arrived 2014,6,2011-2016
Logan (C),"Employed, worked full-time",North Africa and the Middle East,Arrived 2015,3,2011-2016
Logan (C),"Employed, worked full-time",North Africa and the Middle East,Arrived 2016,0,2011-2016
Logan (C),"Employed, worked full-time",South-East Asia,Arrived 2006,119,2006-2010
Logan (C),"Employed, worked full-time",South-East Asia,Arrived 2007,159,2006-2010
Logan (C),"Employed, worked full-time",South-East Asia,Arrived 2008,176,2006-2010
Logan (C),"Employed, worked full-time",South-East Asia,Arrived 2009,140,2006-2010
Logan (C),"Employed, worked full-time",South-East Asia,Arrived 2010,115,2006-2010
Logan (C),"Employed, worked full-time",South-East Asia,Arrived 2011,97,2011-2016
Logan (C),"Employed, worked full-time",South-East Asia,Arrived 2012,97,2011-2016
Logan (C),"Employed, worked full-time",South-East Asia,Arrived 2013,81,2011-2016
Logan (C),"Employed, worked full-time",South-East Asia,Arrived 2014,46,2011-2016
Logan (C),"Employed, worked full-time",South-East Asia,Arrived 2015,25,2011-2016
Logan (C),"Employed, worked full-time",South-East Asia,Arrived 2016,4,2011-2016
Logan (C),"Employed, worked full-time",North-East Asia,Arrived 2006,74,2006-2010
Logan (C),"Employed, worked full-time",North-East Asia,Arrived 2007,78,2006-2010
Logan (C),"Employed, worked full-time",North-East Asia,Arrived 2008,91,2006-2010
Logan (C),"Employed, worked full-time",North-East Asia,Arrived 2009,77,2006-2010
Logan (C),"Employed, worked full-time",North-East Asia,Arrived 2010,54,2006-2010
Logan (C),"Employed, worked full-time",North-East Asia,Arrived 2011,42,2011-2016
Logan (C),"Employed, worked full-time",North-East Asia,Arrived 2012,36,2011-2016
Logan (C),"Employed, worked full-time",North-East Asia,Arrived 2013,26,2011-2016
Logan (C),"Employed, worked full-time",North-East Asia,Arrived 2014,21,2011-2016
Logan (C),"Employed, worked full-time",North-East Asia,Arrived 2015,26,2011-2016
Logan (C),"Employed, worked full-time",North-East Asia,Arrived 2016,5,2011-2016
Logan (C),"Employed, worked full-time",Southern and Central Asia,Arrived 2006,98,2006-2010
Logan (C),"Employed, worked full-time",Southern and Central Asia,Arrived 2007,163,2006-2010
Logan (C),"Employed, worked full-time",Southern and Central Asia,Arrived 2008,251,2006-2010
Logan (C),"Employed, worked full-time",Southern and Central Asia,Arrived 2009,225,2006-2010
Logan (C),"Employed, worked full-time",Southern and Central Asia,Arrived 2010,112,2006-2010
Logan (C),"Employed, worked full-time",Southern and Central Asia,Arrived 2011,93,2011-2016
Logan (C),"Employed, worked full-time",Southern and Central Asia,Arrived 2012,165,2011-2016
Logan (C),"Employed, worked full-time",Southern and Central Asia,Arrived 2013,124,2011-2016
Logan (C),"Employed, worked full-time",Southern and Central Asia,Arrived 2014,71,2011-2016
Logan (C),"Employed, worked full-time",Southern and Central Asia,Arrived 2015,31,2011-2016
Logan (C),"Employed, worked full-time",Southern and Central Asia,Arrived 2016,10,2011-2016
Logan (C),"Employed, worked full-time",Americas,Arrived 2006,32,2006-2010
Logan (C),"Employed, worked full-time",Americas,Arrived 2007,28,2006-2010
Logan (C),"Employed, worked full-time",Americas,Arrived 2008,19,2006-2010
Logan (C),"Employed, worked full-time",Americas,Arrived 2009,27,2006-2010
Logan (C),"Employed, worked full-time",Americas,Arrived 2010,20,2006-2010
Logan (C),"Employed, worked full-time",Americas,Arrived 2011,19,2011-2016
Logan (C),"Employed, worked full-time",Americas,Arrived 2012,14,2011-2016
Logan (C),"Employed, worked full-time",Americas,Arrived 2013,11,2011-2016
Logan (C),"Employed, worked full-time",Americas,Arrived 2014,3,2011-2016
Logan (C),"Employed, worked full-time",Americas,Arrived 2015,12,2011-2016
Logan (C),"Employed, worked full-time",Americas,Arrived 2016,3,2011-2016
Logan (C),"Employed, worked full-time",Sub-Saharan Africa,Arrived 2006,97,2006-2010
Logan (C),"Employed, worked full-time",Sub-Saharan Africa,Arrived 2007,95,2006-2010
Logan (C),"Employed, worked full-time",Sub-Saharan Africa,Arrived 2008,85,2006-2010
Logan (C),"Employed, worked full-time",Sub-Saharan Africa,Arrived 2009,94,2006-2010
Logan (C),"Employed, worked full-time",Sub-Saharan Africa,Arrived 2010,57,2006-2010
Logan (C),"Employed, worked full-time",Sub-Saharan Africa,Arrived 2011,44,2011-2016
Logan (C),"Employed, worked full-time",Sub-Saharan Africa,Arrived 2012,42,2011-2016
Logan (C),"Employed, worked full-time",Sub-Saharan Africa,Arrived 2013,41,2011-2016
Logan (C),"Employed, worked full-time",Sub-Saharan Africa,Arrived 2014,29,2011-2016
Logan (C),"Employed, worked full-time",Sub-Saharan Africa,Arrived 2015,23,2011-2016
Logan (C),"Employed, worked full-time",Sub-Saharan Africa,Arrived 2016,8,2011-2016
Logan (C),"Employed, worked part-time",Oceania and Antarctica,Arrived 2006,170,2006-2010
Logan (C),"Employed, worked part-time",Oceania and Antarctica,Arrived 2007,201,2006-2010
Logan (C),"Employed, worked part-time",Oceania and Antarctica,Arrived 2008,223,2006-2010
Logan (C),"Employed, worked part-time",Oceania and Antarctica,Arrived 2009,148,2006-2010
Logan (C),"Employed, worked part-time",Oceania and Antarctica,Arrived 2010,133,2006-2010
Logan (C),"Employed, worked part-time",Oceania and Antarctica,Arrived 2011,161,2011-2016
Logan (C),"Employed, worked part-time",Oceania and Antarctica,Arrived 2012,173,2011-2016
Logan (C),"Employed, worked part-time",Oceania and Antarctica,Arrived 2013,154,2011-2016
Logan (C),"Employed, worked part-time",Oceania and Antarctica,Arrived 2014,105,2011-2016
Logan (C),"Employed, worked part-time",Oceania and Antarctica,Arrived 2015,84,2011-2016
Logan (C),"Employed, worked part-time",Oceania and Antarctica,Arrived 2016,39,2011-2016
Logan (C),"Employed, worked part-time",North-West Europe,Arrived 2006,75,2006-2010
Logan (C),"Employed, worked part-time",North-West Europe,Arrived 2007,67,2006-2010
Logan (C),"Employed, worked part-time",North-West Europe,Arrived 2008,44,2006-2010
Logan (C),"Employed, worked part-time",North-West Europe,Arrived 2009,28,2006-2010
Logan (C),"Employed, worked part-time",North-West Europe,Arrived 2010,16,2006-2010
Logan (C),"Employed, worked part-time",North-West Europe,Arrived 2011,22,2011-2016
Logan (C),"Employed, worked part-time",North-West Europe,Arrived 2012,24,2011-2016
Logan (C),"Employed, worked part-time",North-West Europe,Arrived 2013,16,2011-2016
Logan (C),"Employed, worked part-time",North-West Europe,Arrived 2014,12,2011-2016
Logan (C),"Employed, worked part-time",North-West Europe,Arrived 2015,16,2011-2016
Logan (C),"Employed, worked part-time",North-West Europe,Arrived 2016,8,2011-2016
Logan (C),"Employed, worked part-time",Southern and Eastern Europe,Arrived 2006,21,2006-2010
Logan (C),"Employed, worked part-time",Southern and Eastern Europe,Arrived 2007,16,2006-2010
Logan (C),"Employed, worked part-time",Southern and Eastern Europe,Arrived 2008,22,2006-2010
Logan (C),"Employed, worked part-time",Southern and Eastern Europe,Arrived 2009,14,2006-2010
Logan (C),"Employed, worked part-time",Southern and Eastern Europe,Arrived 2010,11,2006-2010
Logan (C),"Employed, worked part-time",Southern and Eastern Europe,Arrived 2011,10,2011-2016
Logan (C),"Employed, worked part-time",Southern and Eastern Europe,Arrived 2012,9,2011-2016
Logan (C),"Employed, worked part-time",Southern and Eastern Europe,Arrived 2013,13,2011-2016
Logan (C),"Employed, worked part-time",Southern and Eastern Europe,Arrived 2014,10,2011-2016
Logan (C),"Employed, worked part-time",Southern and Eastern Europe,Arrived 2015,23,2011-2016
Logan (C),"Employed, worked part-time",Southern and Eastern Europe,Arrived 2016,0,2011-2016
Logan (C),"Employed, worked part-time",North Africa and the Middle East,Arrived 2006,15,2006-2010
Logan (C),"Employed, worked part-time",North Africa and the Middle East,Arrived 2007,4,2006-2010
Logan (C),"Employed, worked part-time",North Africa and the Middle East,Arrived 2008,9,2006-2010
Logan (C),"Employed, worked part-time",North Africa and the Middle East,Arrived 2009,12,2006-2010
Logan (C),"Employed, worked part-time",North Africa and the Middle East,Arrived 2010,9,2006-2010
Logan (C),"Employed, worked part-time",North Africa and the Middle East,Arrived 2011,4,2011-2016
Logan (C),"Employed, worked part-time",North Africa and the Middle East,Arrived 2012,8,2011-2016
Logan (C),"Employed, worked part-time",North Africa and the Middle East,Arrived 2013,22,2011-2016
Logan (C),"Employed, worked part-time",North Africa and the Middle East,Arrived 2014,7,2011-2016
Logan (C),"Employed, worked part-time",North Africa and the Middle East,Arrived 2015,0,2011-2016
Logan (C),"Employed, worked part-time",North Africa and the Middle East,Arrived 2016,0,2011-2016
Logan (C),"Employed, worked part-time",South-East Asia,Arrived 2006,56,2006-2010
Logan (C),"Employed, worked part-time",South-East Asia,Arrived 2007,82,2006-2010
Logan (C),"Employed, worked part-time",South-East Asia,Arrived 2008,79,2006-2010
Logan (C),"Employed, worked part-time",South-East Asia,Arrived 2009,82,2006-2010
Logan (C),"Employed, worked part-time",South-East Asia,Arrived 2010,70,2006-2010
Logan (C),"Employed, worked part-time",South-East Asia,Arrived 2011,61,2011-2016
Logan (C),"Employed, worked part-time",South-East Asia,Arrived 2012,60,2011-2016
Logan (C),"Employed, worked part-time",South-East Asia,Arrived 2013,67,2011-2016
Logan (C),"Employed, worked part-time",South-East Asia,Arrived 2014,36,2011-2016
Logan (C),"Employed, worked part-time",South-East Asia,Arrived 2015,45,2011-2016
Logan (C),"Employed, worked part-time",South-East Asia,Arrived 2016,14,2011-2016
Logan (C),"Employed, worked part-time",North-East Asia,Arrived 2006,45,2006-2010
Logan (C),"Employed, worked part-time",North-East Asia,Arrived 2007,51,2006-2010
Logan (C),"Employed, worked part-time",North-East Asia,Arrived 2008,60,2006-2010
Logan (C),"Employed, worked part-time",North-East Asia,Arrived 2009,41,2006-2010
Logan (C),"Employed, worked part-time",North-East Asia,Arrived 2010,46,2006-2010
Logan (C),"Employed, worked part-time",North-East Asia,Arrived 2011,39,2011-2016
Logan (C),"Employed, worked part-time",North-East Asia,Arrived 2012,40,2011-2016
Logan (C),"Employed, worked part-time",North-East Asia,Arrived 2013,33,2011-2016
Logan (C),"Employed, worked part-time",North-East Asia,Arrived 2014,38,2011-2016
Logan (C),"Employed, worked part-time",North-East Asia,Arrived 2015,16,2011-2016
Logan (C),"Employed, worked part-time",North-East Asia,Arrived 2016,8,2011-2016
Logan (C),"Employed, worked part-time",Southern and Central Asia,Arrived 2006,45,2006-2010
Logan (C),"Employed, worked part-time",Southern and Central Asia,Arrived 2007,71,2006-2010
Logan (C),"Employed, worked part-time",Southern and Central Asia,Arrived 2008,104,2006-2010
Logan (C),"Employed, worked part-time",Southern and Central Asia,Arrived 2009,107,2006-2010
Logan (C),"Employed, worked part-time",Southern and Central Asia,Arrived 2010,40,2006-2010
Logan (C),"Employed, worked part-time",Southern and Central Asia,Arrived 2011,40,2011-2016
Logan (C),"Employed, worked part-time",Southern and Central Asia,Arrived 2012,89,2011-2016
Logan (C),"Employed, worked part-time",Southern and Central Asia,Arrived 2013,107,2011-2016
Logan (C),"Employed, worked part-time",Southern and Central Asia,Arrived 2014,111,2011-2016
Logan (C),"Employed, worked part-time",Southern and Central Asia,Arrived 2015,69,2011-2016
Logan (C),"Employed, worked part-time",Southern and Central Asia,Arrived 2016,11,2011-2016
Logan (C),"Employed, worked part-time",Americas,Arrived 2006,21,2006-2010
Logan (C),"Employed, worked part-time",Americas,Arrived 2007,11,2006-2010
Logan (C),"Employed, worked part-time",Americas,Arrived 2008,18,2006-2010
Logan (C),"Employed, worked part-time",Americas,Arrived 2009,20,2006-2010
Logan (C),"Employed, worked part-time",Americas,Arrived 2010,11,2006-2010
Logan (C),"Employed, worked part-time",Americas,Arrived 2011,13,2011-2016
Logan (C),"Employed, worked part-time",Americas,Arrived 2012,11,2011-2016
Logan (C),"Employed, worked part-time",Americas,Arrived 2013,10,2011-2016
Logan (C),"Employed, worked part-time",Americas,Arrived 2014,15,2011-2016
Logan (C),"Employed, worked part-time",Americas,Arrived 2015,13,2011-2016
Logan (C),"Employed, worked part-time",Americas,Arrived 2016,0,2011-2016
Logan (C),"Employed, worked part-time",Sub-Saharan Africa,Arrived 2006,55,2006-2010
Logan (C),"Employed, worked part-time",Sub-Saharan Africa,Arrived 2007,62,2006-2010
Logan (C),"Employed, worked part-time",Sub-Saharan Africa,Arrived 2008,44,2006-2010
Logan (C),"Employed, worked part-time",Sub-Saharan Africa,Arrived 2009,52,2006-2010
Logan (C),"Employed, worked part-time",Sub-Saharan Africa,Arrived 2010,25,2006-2010
Logan (C),"Employed, worked part-time",Sub-Saharan Africa,Arrived 2011,17,2011-2016
Logan (C),"Employed, worked part-time",Sub-Saharan Africa,Arrived 2012,15,2011-2016
Logan (C),"Employed, worked part-time",Sub-Saharan Africa,Arrived 2013,19,2011-2016
Logan (C),"Employed, worked part-time",Sub-Saharan Africa,Arrived 2014,29,2011-2016
Logan (C),"Employed, worked part-time",Sub-Saharan Africa,Arrived 2015,26,2011-2016
Logan (C),"Employed, worked part-time",Sub-Saharan Africa,Arrived 2016,14,2011-2016
Logan (C),"Employed, away from work",Oceania and Antarctica,Arrived 2006,32,2006-2010
Logan (C),"Employed, away from work",Oceania and Antarctica,Arrived 2007,41,2006-2010
Logan (C),"Employed, away from work",Oceania and Antarctica,Arrived 2008,43,2006-2010
Logan (C),"Employed, away from work",Oceania and Antarctica,Arrived 2009,42,2006-2010
Logan (C),"Employed, away from work",Oceania and Antarctica,Arrived 2010,25,2006-2010
Logan (C),"Employed, away from work",Oceania and Antarctica,Arrived 2011,37,2011-2016
Logan (C),"Employed, away from work",Oceania and Antarctica,Arrived 2012,34,2011-2016
Logan (C),"Employed, away from work",Oceania and Antarctica,Arrived 2013,37,2011-2016
Logan (C),"Employed, away from work",Oceania and Antarctica,Arrived 2014,19,2011-2016
Logan (C),"Employed, away from work",Oceania and Antarctica,Arrived 2015,18,2011-2016
Logan (C),"Employed, away from work",Oceania and Antarctica,Arrived 2016,7,2011-2016
Logan (C),"Employed, away from work",North-West Europe,Arrived 2006,6,2006-2010
Logan (C),"Employed, away from work",North-West Europe,Arrived 2007,6,2006-2010
Logan (C),"Employed, away from work",North-West Europe,Arrived 2008,17,2006-2010
Logan (C),"Employed, away from work",North-West Europe,Arrived 2009,3,2006-2010
Logan (C),"Employed, away from work",North-West Europe,Arrived 2010,6,2006-2010
Logan (C),"Employed, away from work",North-West Europe,Arrived 2011,3,2011-2016
Logan (C),"Employed, away from work",North-West Europe,Arrived 2012,4,2011-2016
Logan (C),"Employed, away from work",North-West Europe,Arrived 2013,0,2011-2016
Logan (C),"Employed, away from work",North-West Europe,Arrived 2014,0,2011-2016
Logan (C),"Employed, away from work",North-West Europe,Arrived 2015,0,2011-2016
Logan (C),"Employed, away from work",North-West Europe,Arrived 2016,0,2011-2016
Logan (C),"Employed, away from work",Southern and Eastern Europe,Arrived 2006,5,2006-2010
Logan (C),"Employed, away from work",Southern and Eastern Europe,Arrived 2007,5,2006-2010
Logan (C),"Employed, away from work",Southern and Eastern Europe,Arrived 2008,4,2006-2010
Logan (C),"Employed, away from work",Southern and Eastern Europe,Arrived 2009,3,2006-2010
Logan (C),"Employed, away from work",Southern and Eastern Europe,Arrived 2010,0,2006-2010
Logan (C),"Employed, away from work",Southern and Eastern Europe,Arrived 2011,0,2011-2016
Logan (C),"Employed, away from work",Southern and Eastern Europe,Arrived 2012,0,2011-2016
Logan (C),"Employed, away from work",Southern and Eastern Europe,Arrived 2013,4,2011-2016
Logan (C),"Employed, away from work",Southern and Eastern Europe,Arrived 2014,0,2011-2016
Logan (C),"Employed, away from work",Southern and Eastern Europe,Arrived 2015,0,2011-2016
Logan (C),"Employed, away from work",Southern and Eastern Europe,Arrived 2016,0,2011-2016
Logan (C),"Employed, away from work",North Africa and the Middle East,Arrived 2006,11,2006-2010
Logan (C),"Employed, away from work",North Africa and the Middle East,Arrived 2007,0,2006-2010
Logan (C),"Employed, away from work",North Africa and the Middle East,Arrived 2008,0,2006-2010
Logan (C),"Employed, away from work",North Africa and the Middle East,Arrived 2009,7,2006-2010
Logan (C),"Employed, away from work",North Africa and the Middle East,Arrived 2010,4,2006-2010
Logan (C),"Employed, away from work",North Africa and the Middle East,Arrived 2011,0,2011-2016
Logan (C),"Employed, away from work",North Africa and the Middle East,Arrived 2012,5,2011-2016
Logan (C),"Employed, away from work",North Africa and the Middle East,Arrived 2013,4,2011-2016
Logan (C),"Employed, away from work",North Africa and the Middle East,Arrived 2014,0,2011-2016
Logan (C),"Employed, away from work",North Africa and the Middle East,Arrived 2015,0,2011-2016
Logan (C),"Employed, away from work",North Africa and the Middle East,Arrived 2016,0,2011-2016
Logan (C),"Employed, away from work",South-East Asia,Arrived 2006,14,2006-2010
Logan (C),"Employed, away from work",South-East Asia,Arrived 2007,17,2006-2010
Logan (C),"Employed, away from work",South-East Asia,Arrived 2008,9,2006-2010
Logan (C),"Employed, away from work",South-East Asia,Arrived 2009,0,2006-2010
Logan (C),"Employed, away from work",South-East Asia,Arrived 2010,6,2006-2010
Logan (C),"Employed, away from work",South-East Asia,Arrived 2011,5,2011-2016
Logan (C),"Employed, away from work",South-East Asia,Arrived 2012,7,2011-2016
Logan (C),"Employed, away from work",South-East Asia,Arrived 2013,7,2011-2016
Logan (C),"Employed, away from work",South-East Asia,Arrived 2014,4,2011-2016
Logan (C),"Employed, away from work",South-East Asia,Arrived 2015,3,2011-2016
Logan (C),"Employed, away from work",South-East Asia,Arrived 2016,0,2011-2016
Logan (C),"Employed, away from work",North-East Asia,Arrived 2006,8,2006-2010
Logan (C),"Employed, away from work",North-East Asia,Arrived 2007,3,2006-2010
Logan (C),"Employed, away from work",North-East Asia,Arrived 2008,7,2006-2010
Logan (C),"Employed, away from work",North-East Asia,Arrived 2009,6,2006-2010
Logan (C),"Employed, away from work",North-East Asia,Arrived 2010,6,2006-2010
Logan (C),"Employed, away from work",North-East Asia,Arrived 2011,0,2011-2016
Logan (C),"Employed, away from work",North-East Asia,Arrived 2012,4,2011-2016
Logan (C),"Employed, away from work",North-East Asia,Arrived 2013,9,2011-2016
Logan (C),"Employed, away from work",North-East Asia,Arrived 2014,0,2011-2016
Logan (C),"Employed, away from work",North-East Asia,Arrived 2015,3,2011-2016
Logan (C),"Employed, away from work",North-East Asia,Arrived 2016,0,2011-2016
Logan (C),"Employed, away from work",Southern and Central Asia,Arrived 2006,3,2006-2010
Logan (C),"Employed, away from work",Southern and Central Asia,Arrived 2007,16,2006-2010
Logan (C),"Employed, away from work",Southern and Central Asia,Arrived 2008,15,2006-2010
Logan (C),"Employed, away from work",Southern and Central Asia,Arrived 2009,15,2006-2010
Logan (C),"Employed, away from work",Southern and Central Asia,Arrived 2010,9,2006-2010
Logan (C),"Employed, away from work",Southern and Central Asia,Arrived 2011,7,2011-2016
Logan (C),"Employed, away from work",Southern and Central Asia,Arrived 2012,14,2011-2016
Logan (C),"Employed, away from work",Southern and Central Asia,Arrived 2013,13,2011-2016
Logan (C),"Employed, away from work",Southern and Central Asia,Arrived 2014,6,2011-2016
Logan (C),"Employed, away from work",Southern and Central Asia,Arrived 2015,3,2011-2016
Logan (C),"Employed, away from work",Southern and Central Asia,Arrived 2016,0,2011-2016
Logan (C),"Employed, away from work",Americas,Arrived 2006,5,2006-2010
Logan (C),"Employed, away from work",Americas,Arrived 2007,0,2006-2010
Logan (C),"Employed, away from work",Americas,Arrived 2008,0,2006-2010
Logan (C),"Employed, away from work",Americas,Arrived 2009,0,2006-2010
Logan (C),"Employed, away from work",Americas,Arrived 2010,0,2006-2010
Logan (C),"Employed, away from work",Americas,Arrived 2011,0,2011-2016
Logan (C),"Employed, away from work",Americas,Arrived 2012,4,2011-2016
Logan (C),"Employed, away from work",Americas,Arrived 2013,0,2011-2016
Logan (C),"Employed, away from work",Americas,Arrived 2014,0,2011-2016
Logan (C),"Employed, away from work",Americas,Arrived 2015,0,2011-2016
Logan (C),"Employed, away from work",Americas,Arrived 2016,0,2011-2016
Logan (C),"Employed, away from work",Sub-Saharan Africa,Arrived 2006,14,2006-2010
Logan (C),"Employed, away from work",Sub-Saharan Africa,Arrived 2007,15,2006-2010
Logan (C),"Employed, away from work",Sub-Saharan Africa,Arrived 2008,12,2006-2010
Logan (C),"Employed, away from work",Sub-Saharan Africa,Arrived 2009,10,2006-2010
Logan (C),"Employed, away from work",Sub-Saharan Africa,Arrived 2010,12,2006-2010
Logan (C),"Employed, away from work",Sub-Saharan Africa,Arrived 2011,3,2011-2016
Logan (C),"Employed, away from work",Sub-Saharan Africa,Arrived 2012,0,2011-2016
Logan (C),"Employed, away from work",Sub-Saharan Africa,Arrived 2013,3,2011-2016
Logan (C),"Employed, away from work",Sub-Saharan Africa,Arrived 2014,4,2011-2016
Logan (C),"Employed, away from work",Sub-Saharan Africa,Arrived 2015,0,2011-2016
Logan (C),"Employed, away from work",Sub-Saharan Africa,Arrived 2016,3,2011-2016
Logan (C),"Unemployed, looking for full-time work",Oceania and Antarctica,Arrived 2006,37,2006-2010
Logan (C),"Unemployed, looking for full-time work",Oceania and Antarctica,Arrived 2007,43,2006-2010
Logan (C),"Unemployed, looking for full-time work",Oceania and Antarctica,Arrived 2008,67,2006-2010
Logan (C),"Unemployed, looking for full-time work",Oceania and Antarctica,Arrived 2009,38,2006-2010
Logan (C),"Unemployed, looking for full-time work",Oceania and Antarctica,Arrived 2010,34,2006-2010
Logan (C),"Unemployed, looking for full-time work",Oceania and Antarctica,Arrived 2011,45,2011-2016
Logan (C),"Unemployed, looking for full-time work",Oceania and Antarctica,Arrived 2012,56,2011-2016
Logan (C),"Unemployed, looking for full-time work",Oceania and Antarctica,Arrived 2013,58,2011-2016
Logan (C),"Unemployed, looking for full-time work",Oceania and Antarctica,Arrived 2014,33,2011-2016
Logan (C),"Unemployed, looking for full-time work",Oceania and Antarctica,Arrived 2015,28,2011-2016
Logan (C),"Unemployed, looking for full-time work",Oceania and Antarctica,Arrived 2016,58,2011-2016
Logan (C),"Unemployed, looking for full-time work",North-West Europe,Arrived 2006,9,2006-2010
Logan (C),"Unemployed, looking for full-time work",North-West Europe,Arrived 2007,12,2006-2010
Logan (C),"Unemployed, looking for full-time work",North-West Europe,Arrived 2008,9,2006-2010
Logan (C),"Unemployed, looking for full-time work",North-West Europe,Arrived 2009,3,2006-2010
Logan (C),"Unemployed, looking for full-time work",North-West Europe,Arrived 2010,0,2006-2010
Logan (C),"Unemployed, looking for full-time work",North-West Europe,Arrived 2011,0,2011-2016
Logan (C),"Unemployed, looking for full-time work",North-West Europe,Arrived 2012,4,2011-2016
Logan (C),"Unemployed, looking for full-time work",North-West Europe,Arrived 2013,0,2011-2016
Logan (C),"Unemployed, looking for full-time work",North-West Europe,Arrived 2014,0,2011-2016
Logan (C),"Unemployed, looking for full-time work",North-West Europe,Arrived 2015,5,2011-2016
Logan (C),"Unemployed, looking for full-time work",North-West Europe,Arrived 2016,3,2011-2016
Logan (C),"Unemployed, looking for full-time work",Southern and Eastern Europe,Arrived 2006,3,2006-2010
Logan (C),"Unemployed, looking for full-time work",Southern and Eastern Europe,Arrived 2007,0,2006-2010
Logan (C),"Unemployed, looking for full-time work",Southern and Eastern Europe,Arrived 2008,3,2006-2010
Logan (C),"Unemployed, looking for full-time work",Southern and Eastern Europe,Arrived 2009,3,2006-2010
Logan (C),"Unemployed, looking for full-time work",Southern and Eastern Europe,Arrived 2010,0,2006-2010
Logan (C),"Unemployed, looking for full-time work",Southern and Eastern Europe,Arrived 2011,3,2011-2016
Logan (C),"Unemployed, looking for full-time work",Southern and Eastern Europe,Arrived 2012,0,2011-2016
Logan (C),"Unemployed, looking for full-time work",Southern and Eastern Europe,Arrived 2013,0,2011-2016
Logan (C),"Unemployed, looking for full-time work",Southern and Eastern Europe,Arrived 2014,4,2011-2016
Logan (C),"Unemployed, looking for full-time work",Southern and Eastern Europe,Arrived 2015,0,2011-2016
Logan (C),"Unemployed, looking for full-time work",Southern and Eastern Europe,Arrived 2016,0,2011-2016
Logan (C),"Unemployed, looking for full-time work",North Africa and the Middle East,Arrived 2006,6,2006-2010
Logan (C),"Unemployed, looking for full-time work",North Africa and the Middle East,Arrived 2007,3,2006-2010
Logan (C),"Unemployed, looking for full-time work",North Africa and the Middle East,Arrived 2008,19,2006-2010
Logan (C),"Unemployed, looking for full-time work",North Africa and the Middle East,Arrived 2009,10,2006-2010
Logan (C),"Unemployed, looking for full-time work",North Africa and the Middle East,Arrived 2010,3,2006-2010
Logan (C),"Unemployed, looking for full-time work",North Africa and the Middle East,Arrived 2011,0,2011-2016
Logan (C),"Unemployed, looking for full-time work",North Africa and the Middle East,Arrived 2012,10,2011-2016
Logan (C),"Unemployed, looking for full-time work",North Africa and the Middle East,Arrived 2013,30,2011-2016
Logan (C),"Unemployed, looking for full-time work",North Africa and the Middle East,Arrived 2014,5,2011-2016
Logan (C),"Unemployed, looking for full-time work",North Africa and the Middle East,Arrived 2015,6,2011-2016
Logan (C),"Unemployed, looking for full-time work",North Africa and the Middle East,Arrived 2016,4,2011-2016
Logan (C),"Unemployed, looking for full-time work",South-East Asia,Arrived 2006,13,2006-2010
Logan (C),"Unemployed, looking for full-time work",South-East Asia,Arrived 2007,12,2006-2010
Logan (C),"Unemployed, looking for full-time work",South-East Asia,Arrived 2008,13,2006-2010
Logan (C),"Unemployed, looking for full-time work",South-East Asia,Arrived 2009,9,2006-2010
Logan (C),"Unemployed, looking for full-time work",South-East Asia,Arrived 2010,17,2006-2010
Logan (C),"Unemployed, looking for full-time work",South-East Asia,Arrived 2011,21,2011-2016
Logan (C),"Unemployed, looking for full-time work",South-East Asia,Arrived 2012,12,2011-2016
Logan (C),"Unemployed, looking for full-time work",South-East Asia,Arrived 2013,16,2011-2016
Logan (C),"Unemployed, looking for full-time work",South-East Asia,Arrived 2014,11,2011-2016
Logan (C),"Unemployed, looking for full-time work",South-East Asia,Arrived 2015,18,2011-2016
Logan (C),"Unemployed, looking for full-time work",South-East Asia,Arrived 2016,6,2011-2016
Logan (C),"Unemployed, looking for full-time work",North-East Asia,Arrived 2006,5,2006-2010
Logan (C),"Unemployed, looking for full-time work",North-East Asia,Arrived 2007,0,2006-2010
Logan (C),"Unemployed, looking for full-time work",North-East Asia,Arrived 2008,12,2006-2010
Logan (C),"Unemployed, looking for full-time work",North-East Asia,Arrived 2009,5,2006-2010
Logan (C),"Unemployed, looking for full-time work",North-East Asia,Arrived 2010,5,2006-2010
Logan (C),"Unemployed, looking for full-time work",North-East Asia,Arrived 2011,0,2011-2016
Logan (C),"Unemployed, looking for full-time work",North-East Asia,Arrived 2012,3,2011-2016
Logan (C),"Unemployed, looking for full-time work",North-East Asia,Arrived 2013,4,2011-2016
Logan (C),"Unemployed, looking for full-time work",North-East Asia,Arrived 2014,8,2011-2016
Logan (C),"Unemployed, looking for full-time work",North-East Asia,Arrived 2015,8,2011-2016
Logan (C),"Unemployed, looking for full-time work",North-East Asia,Arrived 2016,0,2011-2016
Logan (C),"Unemployed, looking for full-time work",Southern and Central Asia,Arrived 2006,4,2006-2010
Logan (C),"Unemployed, looking for full-time work",Southern and Central Asia,Arrived 2007,14,2006-2010
Logan (C),"Unemployed, looking for full-time work",Southern and Central Asia,Arrived 2008,12,2006-2010
Logan (C),"Unemployed, looking for full-time work",Southern and Central Asia,Arrived 2009,22,2006-2010
Logan (C),"Unemployed, looking for full-time work",Southern and Central Asia,Arrived 2010,15,2006-2010
Logan (C),"Unemployed, looking for full-time work",Southern and Central Asia,Arrived 2011,26,2011-2016
Logan (C),"Unemployed, looking for full-time work",Southern and Central Asia,Arrived 2012,38,2011-2016
Logan (C),"Unemployed, looking for full-time work",Southern and Central Asia,Arrived 2013,42,2011-2016
Logan (C),"Unemployed, looking for full-time work",Southern and Central Asia,Arrived 2014,18,2011-2016
Logan (C),"Unemployed, looking for full-time work",Southern and Central Asia,Arrived 2015,18,2011-2016
Logan (C),"Unemployed, looking for full-time work",Southern and Central Asia,Arrived 2016,14,2011-2016
Logan (C),"Unemployed, looking for full-time work",Americas,Arrived 2006,3,2006-2010
Logan (C),"Unemployed, looking for full-time work",Americas,Arrived 2007,4,2006-2010
Logan (C),"Unemployed, looking for full-time work",Americas,Arrived 2008,4,2006-2010
Logan (C),"Unemployed, looking for full-time work",Americas,Arrived 2009,4,2006-2010
Logan (C),"Unemployed, looking for full-time work",Americas,Arrived 2010,0,2006-2010
Logan (C),"Unemployed, looking for full-time work",Americas,Arrived 2011,0,2011-2016
Logan (C),"Unemployed, looking for full-time work",Americas,Arrived 2012,0,2011-2016
Logan (C),"Unemployed, looking for full-time work",Americas,Arrived 2013,0,2011-2016
Logan (C),"Unemployed, looking for full-time work",Americas,Arrived 2014,6,2011-2016
Logan (C),"Unemployed, looking for full-time work",Americas,Arrived 2015,0,2011-2016
Logan (C),"Unemployed, looking for full-time work",Americas,Arrived 2016,4,2011-2016
Logan (C),"Unemployed, looking for full-time work",Sub-Saharan Africa,Arrived 2006,12,2006-2010
Logan (C),"Unemployed, looking for full-time work",Sub-Saharan Africa,Arrived 2007,13,2006-2010
Logan (C),"Unemployed, looking for full-time work",Sub-Saharan Africa,Arrived 2008,10,2006-2010
Logan (C),"Unemployed, looking for full-time work",Sub-Saharan Africa,Arrived 2009,15,2006-2010
Logan (C),"Unemployed, looking for full-time work",Sub-Saharan Africa,Arrived 2010,6,2006-2010
Logan (C),"Unemployed, looking for full-time work",Sub-Saharan Africa,Arrived 2011,0,2011-2016
Logan (C),"Unemployed, looking for full-time work",Sub-Saharan Africa,Arrived 2012,4,2011-2016
Logan (C),"Unemployed, looking for full-time work",Sub-Saharan Africa,Arrived 2013,19,2011-2016
Logan (C),"Unemployed, looking for full-time work",Sub-Saharan Africa,Arrived 2014,10,2011-2016
Logan (C),"Unemployed, looking for full-time work",Sub-Saharan Africa,Arrived 2015,12,2011-2016
Logan (C),"Unemployed, looking for full-time work",Sub-Saharan Africa,Arrived 2016,10,2011-2016
Logan (C),"Unemployed, looking for part-time work",Oceania and Antarctica,Arrived 2006,26,2006-2010
Logan (C),"Unemployed, looking for part-time work",Oceania and Antarctica,Arrived 2007,36,2006-2010
Logan (C),"Unemployed, looking for part-time work",Oceania and Antarctica,Arrived 2008,40,2006-2010
Logan (C),"Unemployed, looking for part-time work",Oceania and Antarctica,Arrived 2009,32,2006-2010
Logan (C),"Unemployed, looking for part-time work",Oceania and Antarctica,Arrived 2010,19,2006-2010
Logan (C),"Unemployed, looking for part-time work",Oceania and Antarctica,Arrived 2011,24,2011-2016
Logan (C),"Unemployed, looking for part-time work",Oceania and Antarctica,Arrived 2012,27,2011-2016
Logan (C),"Unemployed, looking for part-time work",Oceania and Antarctica,Arrived 2013,30,2011-2016
Logan (C),"Unemployed, looking for part-time work",Oceania and Antarctica,Arrived 2014,23,2011-2016
Logan (C),"Unemployed, looking for part-time work",Oceania and Antarctica,Arrived 2015,31,2011-2016
Logan (C),"Unemployed, looking for part-time work",Oceania and Antarctica,Arrived 2016,10,2011-2016
Logan (C),"Unemployed, looking for part-time work",North-West Europe,Arrived 2006,4,2006-2010
Logan (C),"Unemployed, looking for part-time work",North-West Europe,Arrived 2007,7,2006-2010
Logan (C),"Unemployed, looking for part-time work",North-West Europe,Arrived 2008,8,2006-2010
Logan (C),"Unemployed, looking for part-time work",North-West Europe,Arrived 2009,6,2006-2010
Logan (C),"Unemployed, looking for part-time work",North-West Europe,Arrived 2010,3,2006-2010
Logan (C),"Unemployed, looking for part-time work",North-West Europe,Arrived 2011,0,2011-2016
Logan (C),"Unemployed, looking for part-time work",North-West Europe,Arrived 2012,6,2011-2016
Logan (C),"Unemployed, looking for part-time work",North-West Europe,Arrived 2013,0,2011-2016
Logan (C),"Unemployed, looking for part-time work",North-West Europe,Arrived 2014,6,2011-2016
Logan (C),"Unemployed, looking for part-time work",North-West Europe,Arrived 2015,0,2011-2016
Logan (C),"Unemployed, looking for part-time work",North-West Europe,Arrived 2016,0,2011-2016
Logan (C),"Unemployed, looking for part-time work",Southern and Eastern Europe,Arrived 2006,0,2006-2010
Logan (C),"Unemployed, looking for part-time work",Southern and Eastern Europe,Arrived 2007,3,2006-2010
Logan (C),"Unemployed, looking for part-time work",Southern and Eastern Europe,Arrived 2008,0,2006-2010
Logan (C),"Unemployed, looking for part-time work",Southern and Eastern Europe,Arrived 2009,0,2006-2010
Logan (C),"Unemployed, looking for part-time work",Southern and Eastern Europe,Arrived 2010,5,2006-2010
Logan (C),"Unemployed, looking for part-time work",Southern and Eastern Europe,Arrived 2011,0,2011-2016
Logan (C),"Unemployed, looking for part-time work",Southern and Eastern Europe,Arrived 2012,0,2011-2016
Logan (C),"Unemployed, looking for part-time work",Southern and Eastern Europe,Arrived 2013,0,2011-2016
Logan (C),"Unemployed, looking for part-time work",Southern and Eastern Europe,Arrived 2014,0,2011-2016
Logan (C),"Unemployed, looking for part-time work",Southern and Eastern Europe,Arrived 2015,0,2011-2016
Logan (C),"Unemployed, looking for part-time work",Southern and Eastern Europe,Arrived 2016,0,2011-2016
Logan (C),"Unemployed, looking for part-time work",North Africa and the Middle East,Arrived 2006,7,2006-2010
Logan (C),"Unemployed, looking for part-time work",North Africa and the Middle East,Arrived 2007,4,2006-2010
Logan (C),"Unemployed, looking for part-time work",North Africa and the Middle East,Arrived 2008,4,2006-2010
Logan (C),"Unemployed, looking for part-time work",North Africa and the Middle East,Arrived 2009,3,2006-2010
Logan (C),"Unemployed, looking for part-time work",North Africa and the Middle East,Arrived 2010,0,2006-2010
Logan (C),"Unemployed, looking for part-time work",North Africa and the Middle East,Arrived 2011,4,2011-2016
Logan (C),"Unemployed, looking for part-time work",North Africa and the Middle East,Arrived 2012,4,2011-2016
Logan (C),"Unemployed, looking for part-time work",North Africa and the Middle East,Arrived 2013,17,2011-2016
Logan (C),"Unemployed, looking for part-time work",North Africa and the Middle East,Arrived 2014,0,2011-2016
Logan (C),"Unemployed, looking for part-time work",North Africa and the Middle East,Arrived 2015,0,2011-2016
Logan (C),"Unemployed, looking for part-time work",North Africa and the Middle East,Arrived 2016,0,2011-2016
Logan (C),"Unemployed, looking for part-time work",South-East Asia,Arrived 2006,9,2006-2010
Logan (C),"Unemployed, looking for part-time work",South-East Asia,Arrived 2007,18,2006-2010
Logan (C),"Unemployed, looking for part-time work",South-East Asia,Arrived 2008,5,2006-2010
Logan (C),"Unemployed, looking for part-time work",South-East Asia,Arrived 2009,10,2006-2010
Logan (C),"Unemployed, looking for part-time work",South-East Asia,Arrived 2010,6,2006-2010
Logan (C),"Unemployed, looking for part-time work",South-East Asia,Arrived 2011,13,2011-2016
Logan (C),"Unemployed, looking for part-time work",South-East Asia,Arrived 2012,11,2011-2016
Logan (C),"Unemployed, looking for part-time work",South-East Asia,Arrived 2013,15,2011-2016
Logan (C),"Unemployed, looking for part-time work",South-East Asia,Arrived 2014,8,2011-2016
Logan (C),"Unemployed, looking for part-time work",South-East Asia,Arrived 2015,11,2011-2016
Logan (C),"Unemployed, looking for part-time work",South-East Asia,Arrived 2016,3,2011-2016
Logan (C),"Unemployed, looking for part-time work",North-East Asia,Arrived 2006,8,2006-2010
Logan (C),"Unemployed, looking for part-time work",North-East Asia,Arrived 2007,9,2006-2010
Logan (C),"Unemployed, looking for part-time work",North-East Asia,Arrived 2008,6,2006-2010
Logan (C),"Unemployed, looking for part-time work",North-East Asia,Arrived 2009,5,2006-2010
Logan (C),"Unemployed, looking for part-time work",North-East Asia,Arrived 2010,7,2006-2010
Logan (C),"Unemployed, looking for part-time work",North-East Asia,Arrived 2011,5,2011-2016
Logan (C),"Unemployed, looking for part-time work",North-East Asia,Arrived 2012,7,2011-2016
Logan (C),"Unemployed, looking for part-time work",North-East Asia,Arrived 2013,3,2011-2016
Logan (C),"Unemployed, looking for part-time work",North-East Asia,Arrived 2014,4,2011-2016
Logan (C),"Unemployed, looking for part-time work",North-East Asia,Arrived 2015,3,2011-2016
Logan (C),"Unemployed, looking for part-time work",North-East Asia,Arrived 2016,0,2011-2016
Logan (C),"Unemployed, looking for part-time work",Southern and Central Asia,Arrived 2006,7,2006-2010
Logan (C),"Unemployed, looking for part-time work",Southern and Central Asia,Arrived 2007,4,2006-2010
Logan (C),"Unemployed, looking for part-time work",Southern and Central Asia,Arrived 2008,12,2006-2010
Logan (C),"Unemployed, looking for part-time work",Southern and Central Asia,Arrived 2009,5,2006-2010
Logan (C),"Unemployed, looking for part-time work",Southern and Central Asia,Arrived 2010,11,2006-2010
Logan (C),"Unemployed, looking for part-time work",Southern and Central Asia,Arrived 2011,7,2011-2016
Logan (C),"Unemployed, looking for part-time work",Southern and Central Asia,Arrived 2012,7,2011-2016
Logan (C),"Unemployed, looking for part-time work",Southern and Central Asia,Arrived 2013,22,2011-2016
Logan (C),"Unemployed, looking for part-time work",Southern and Central Asia,Arrived 2014,9,2011-2016
Logan (C),"Unemployed, looking for part-time work",Southern and Central Asia,Arrived 2015,16,2011-2016
Logan (C),"Unemployed, looking for part-time work",Southern and Central Asia,Arrived 2016,14,2011-2016
Logan (C),"Unemployed, looking for part-time work",Americas,Arrived 2006,0,2006-2010
Logan (C),"Unemployed, looking for part-time work",Americas,Arrived 2007,0,2006-2010
Logan (C),"Unemployed, looking for part-time work",Americas,Arrived 2008,4,2006-2010
Logan (C),"Unemployed, looking for part-time work",Americas,Arrived 2009,0,2006-2010
Logan (C),"Unemployed, looking for part-time work",Americas,Arrived 2010,0,2006-2010
Logan (C),"Unemployed, looking for part-time work",Americas,Arrived 2011,5,2011-2016
Logan (C),"Unemployed, looking for part-time work",Americas,Arrived 2012,0,2011-2016
Logan (C),"Unemployed, looking for part-time work",Americas,Arrived 2013,4,2011-2016
Logan (C),"Unemployed, looking for part-time work",Americas,Arrived 2014,0,2011-2016
Logan (C),"Unemployed, looking for part-time work",Americas,Arrived 2015,0,2011-2016
Logan (C),"Unemployed, looking for part-time work",Americas,Arrived 2016,6,2011-2016
Logan (C),"Unemployed, looking for part-time work",Sub-Saharan Africa,Arrived 2006,10,2006-2010
Logan (C),"Unemployed, looking for part-time work",Sub-Saharan Africa,Arrived 2007,7,2006-2010
Logan (C),"Unemployed, looking for part-time work",Sub-Saharan Africa,Arrived 2008,9,2006-2010
Logan (C),"Unemployed, looking for part-time work",Sub-Saharan Africa,Arrived 2009,7,2006-2010
Logan (C),"Unemployed, looking for part-time work",Sub-Saharan Africa,Arrived 2010,11,2006-2010
Logan (C),"Unemployed, looking for part-time work",Sub-Saharan Africa,Arrived 2011,0,2011-2016
Logan (C),"Unemployed, looking for part-time work",Sub-Saharan Africa,Arrived 2012,7,2011-2016
Logan (C),"Unemployed, looking for part-time work",Sub-Saharan Africa,Arrived 2013,10,2011-2016
Logan (C),"Unemployed, looking for part-time work",Sub-Saharan Africa,Arrived 2014,7,2011-2016
Logan (C),"Unemployed, looking for part-time work",Sub-Saharan Africa,Arrived 2015,18,2011-2016
Logan (C),"Unemployed, looking for part-time work",Sub-Saharan Africa,Arrived 2016,9,2011-2016
Logan (C),Not in the labour force,Oceania and Antarctica,Arrived 2006,153,2006-2010
Logan (C),Not in the labour force,Oceania and Antarctica,Arrived 2007,208,2006-2010
Logan (C),Not in the labour force,Oceania and Antarctica,Arrived 2008,252,2006-2010
Logan (C),Not in the labour force,Oceania and Antarctica,Arrived 2009,165,2006-2010
Logan (C),Not in the labour force,Oceania and Antarctica,Arrived 2010,140,2006-2010
Logan (C),Not in the labour force,Oceania and Antarctica,Arrived 2011,219,2011-2016
Logan (C),Not in the labour force,Oceania and Antarctica,Arrived 2012,216,2011-2016
Logan (C),Not in the labour force,Oceania and Antarctica,Arrived 2013,171,2011-2016
Logan (C),Not in the labour force,Oceania and Antarctica,Arrived 2014,163,2011-2016
Logan (C),Not in the labour force,Oceania and Antarctica,Arrived 2015,135,2011-2016
Logan (C),Not in the labour force,Oceania and Antarctica,Arrived 2016,82,2011-2016
Logan (C),Not in the labour force,North-West Europe,Arrived 2006,41,2006-2010
Logan (C),Not in the labour force,North-West Europe,Arrived 2007,38,2006-2010
Logan (C),Not in the labour force,North-West Europe,Arrived 2008,51,2006-2010
Logan (C),Not in the labour force,North-West Europe,Arrived 2009,20,2006-2010
Logan (C),Not in the labour force,North-West Europe,Arrived 2010,24,2006-2010
Logan (C),Not in the labour force,North-West Europe,Arrived 2011,24,2011-2016
Logan (C),Not in the labour force,North-West Europe,Arrived 2012,31,2011-2016
Logan (C),Not in the labour force,North-West Europe,Arrived 2013,13,2011-2016
Logan (C),Not in the labour force,North-West Europe,Arrived 2014,12,2011-2016
Logan (C),Not in the labour force,North-West Europe,Arrived 2015,13,2011-2016
Logan (C),Not in the labour force,North-West Europe,Arrived 2016,11,2011-2016
Logan (C),Not in the labour force,Southern and Eastern Europe,Arrived 2006,6,2006-2010
Logan (C),Not in the labour force,Southern and Eastern Europe,Arrived 2007,14,2006-2010
Logan (C),Not in the labour force,Southern and Eastern Europe,Arrived 2008,21,2006-2010
Logan (C),Not in the labour force,Southern and Eastern Europe,Arrived 2009,14,2006-2010
Logan (C),Not in the labour force,Southern and Eastern Europe,Arrived 2010,17,2006-2010
Logan (C),Not in the labour force,Southern and Eastern Europe,Arrived 2011,6,2011-2016
Logan (C),Not in the labour force,Southern and Eastern Europe,Arrived 2012,16,2011-2016
Logan (C),Not in the labour force,Southern and Eastern Europe,Arrived 2013,13,2011-2016
Logan (C),Not in the labour force,Southern and Eastern Europe,Arrived 2014,15,2011-2016
Logan (C),Not in the labour force,Southern and Eastern Europe,Arrived 2015,16,2011-2016
Logan (C),Not in the labour force,Southern and Eastern Europe,Arrived 2016,6,2011-2016
Logan (C),Not in the labour force,North Africa and the Middle East,Arrived 2006,52,2006-2010
Logan (C),Not in the labour force,North Africa and the Middle East,Arrived 2007,25,2006-2010
Logan (C),Not in the labour force,North Africa and the Middle East,Arrived 2008,42,2006-2010
Logan (C),Not in the labour force,North Africa and the Middle East,Arrived 2009,27,2006-2010
Logan (C),Not in the labour force,North Africa and the Middle East,Arrived 2010,37,2006-2010
Logan (C),Not in the labour force,North Africa and the Middle East,Arrived 2011,34,2011-2016
Logan (C),Not in the labour force,North Africa and the Middle East,Arrived 2012,41,2011-2016
Logan (C),Not in the labour force,North Africa and the Middle East,Arrived 2013,151,2011-2016
Logan (C),Not in the labour force,North Africa and the Middle East,Arrived 2014,60,2011-2016
Logan (C),Not in the labour force,North Africa and the Middle East,Arrived 2015,27,2011-2016
Logan (C),Not in the labour force,North Africa and the Middle East,Arrived 2016,162,2011-2016
Logan (C),Not in the labour force,South-East Asia,Arrived 2006,74,2006-2010
Logan (C),Not in the labour force,South-East Asia,Arrived 2007,119,2006-2010
Logan (C),Not in the labour force,South-East Asia,Arrived 2008,113,2006-2010
Logan (C),Not in the labour force,South-East Asia,Arrived 2009,215,2006-2010
Logan (C),Not in the labour force,South-East Asia,Arrived 2010,179,2006-2010
Logan (C),Not in the labour force,South-East Asia,Arrived 2011,167,2011-2016
Logan (C),Not in the labour force,South-East Asia,Arrived 2012,111,2011-2016
Logan (C),Not in the labour force,South-East Asia,Arrived 2013,208,2011-2016
Logan (C),Not in the labour force,South-East Asia,Arrived 2014,117,2011-2016
Logan (C),Not in the labour force,South-East Asia,Arrived 2015,118,2011-2016
Logan (C),Not in the labour force,South-East Asia,Arrived 2016,127,2011-2016
Logan (C),Not in the labour force,North-East Asia,Arrived 2006,49,2006-2010
Logan (C),Not in the labour force,North-East Asia,Arrived 2007,63,2006-2010
Logan (C),Not in the labour force,North-East Asia,Arrived 2008,92,2006-2010
Logan (C),Not in the labour force,North-East Asia,Arrived 2009,75,2006-2010
Logan (C),Not in the labour force,North-East Asia,Arrived 2010,56,2006-2010
Logan (C),Not in the labour force,North-East Asia,Arrived 2011,68,2011-2016
Logan (C),Not in the labour force,North-East Asia,Arrived 2012,49,2011-2016
Logan (C),Not in the labour force,North-East Asia,Arrived 2013,83,2011-2016
Logan (C),Not in the labour force,North-East Asia,Arrived 2014,107,2011-2016
Logan (C),Not in the labour force,North-East Asia,Arrived 2015,94,2011-2016
Logan (C),Not in the labour force,North-East Asia,Arrived 2016,87,2011-2016
Logan (C),Not in the labour force,Southern and Central Asia,Arrived 2006,66,2006-2010
Logan (C),Not in the labour force,Southern and Central Asia,Arrived 2007,72,2006-2010
Logan (C),Not in the labour force,Southern and Central Asia,Arrived 2008,88,2006-2010
Logan (C),Not in the labour force,Southern and Central Asia,Arrived 2009,90,2006-2010
Logan (C),Not in the labour force,Southern and Central Asia,Arrived 2010,82,2006-2010
Logan (C),Not in the labour force,Southern and Central Asia,Arrived 2011,98,2011-2016
Logan (C),Not in the labour force,Southern and Central Asia,Arrived 2012,134,2011-2016
Logan (C),Not in the labour force,Southern and Central Asia,Arrived 2013,293,2011-2016
Logan (C),Not in the labour force,Southern and Central Asia,Arrived 2014,171,2011-2016
Logan (C),Not in the labour force,Southern and Central Asia,Arrived 2015,144,2011-2016
Logan (C),Not in the labour force,Southern and Central Asia,Arrived 2016,99,2011-2016
Logan (C),Not in the labour force,Americas,Arrived 2006,9,2006-2010
Logan (C),Not in the labour force,Americas,Arrived 2007,15,2006-2010
Logan (C),Not in the labour force,Americas,Arrived 2008,9,2006-2010
Logan (C),Not in the labour force,Americas,Arrived 2009,9,2006-2010
Logan (C),Not in the labour force,Americas,Arrived 2010,11,2006-2010
Logan (C),Not in the labour force,Americas,Arrived 2011,9,2011-2016
Logan (C),Not in the labour force,Americas,Arrived 2012,15,2011-2016
Logan (C),Not in the labour force,Americas,Arrived 2013,12,2011-2016
Logan (C),Not in the labour force,Americas,Arrived 2014,7,2011-2016
Logan (C),Not in the labour force,Americas,Arrived 2015,18,2011-2016
Logan (C),Not in the labour force,Americas,Arrived 2016,10,2011-2016
Logan (C),Not in the labour force,Sub-Saharan Africa,Arrived 2006,78,2006-2010
Logan (C),Not in the labour force,Sub-Saharan Africa,Arrived 2007,115,2006-2010
Logan (C),Not in the labour force,Sub-Saharan Africa,Arrived 2008,48,2006-2010
Logan (C),Not in the labour force,Sub-Saharan Africa,Arrived 2009,79,2006-2010
Logan (C),Not in the labour force,Sub-Saharan Africa,Arrived 2010,78,2006-2010
Logan (C),Not in the labour force,Sub-Saharan Africa,Arrived 2011,39,2011-2016
Logan (C),Not in the labour force,Sub-Saharan Africa,Arrived 2012,31,2011-2016
Logan (C),Not in the labour force,Sub-Saharan Africa,Arrived 2013,45,2011-2016
Logan (C),Not in the labour force,Sub-Saharan Africa,Arrived 2014,49,2011-2016
Logan (C),Not in the labour force,Sub-Saharan Africa,Arrived 2015,60,2011-2016
Logan (C),Not in the labour force,Sub-Saharan Africa,Arrived 2016,65,2011-2016
