LF,LOC,BP,YEAR,COUNT,YR_AR
"Employed, worked full-time",Australia,Oceania and Antarctica,Arrived 2006,7892,2006-2010
"Employed, worked full-time",Australia,Oceania and Antarctica,Arrived 2007,8608,2006-2010
"Employed, worked full-time",Australia,Oceania and Antarctica,Arrived 2008,10495,2006-2010
"Employed, worked full-time",Australia,Oceania and Antarctica,Arrived 2009,7568,2006-2010
"Employed, worked full-time",Australia,Oceania and Antarctica,Arrived 2010,8700,2006-2010
"Employed, worked full-time",Australia,Oceania and Antarctica,Arrived 2011,11432,2011-2016
"Employed, worked full-time",Australia,Oceania and Antarctica,Arrived 2012,11702,2011-2016
"Employed, worked full-time",Australia,Oceania and Antarctica,Arrived 2013,8521,2011-2016
"Employed, worked full-time",Australia,Oceania and Antarctica,Arrived 2014,6392,2011-2016
"Employed, worked full-time",Australia,Oceania and Antarctica,Arrived 2015,5268,2011-2016
"Employed, worked full-time",Australia,Oceania and Antarctica,Arrived 2016,2500,2011-2016
"Employed, worked full-time",Australia,North-West Europe,Arrived 2006,13783,2006-2010
"Employed, worked full-time",Australia,North-West Europe,Arrived 2007,14129,2006-2010
"Employed, worked full-time",Australia,North-West Europe,Arrived 2008,14862,2006-2010
"Employed, worked full-time",Australia,North-West Europe,Arrived 2009,12820,2006-2010
"Employed, worked full-time",Australia,North-West Europe,Arrived 2010,13133,2006-2010
"Employed, worked full-time",Australia,North-West Europe,Arrived 2011,17040,2011-2016
"Employed, worked full-time",Australia,North-West Europe,Arrived 2012,17556,2011-2016
"Employed, worked full-time",Australia,North-West Europe,Arrived 2013,13778,2011-2016
"Employed, worked full-time",Australia,North-West Europe,Arrived 2014,12030,2011-2016
"Employed, worked full-time",Australia,North-West Europe,Arrived 2015,11537,2011-2016
"Employed, worked full-time",Australia,North-West Europe,Arrived 2016,5455,2011-2016
"Employed, worked full-time",Australia,Southern and Eastern Europe,Arrived 2006,2085,2006-2010
"Employed, worked full-time",Australia,Southern and Eastern Europe,Arrived 2007,2068,2006-2010
"Employed, worked full-time",Australia,Southern and Eastern Europe,Arrived 2008,2255,2006-2010
"Employed, worked full-time",Australia,Southern and Eastern Europe,Arrived 2009,2111,2006-2010
"Employed, worked full-time",Australia,Southern and Eastern Europe,Arrived 2010,2345,2006-2010
"Employed, worked full-time",Australia,Southern and Eastern Europe,Arrived 2011,2792,2011-2016
"Employed, worked full-time",Australia,Southern and Eastern Europe,Arrived 2012,3801,2011-2016
"Employed, worked full-time",Australia,Southern and Eastern Europe,Arrived 2013,3638,2011-2016
"Employed, worked full-time",Australia,Southern and Eastern Europe,Arrived 2014,3239,2011-2016
"Employed, worked full-time",Australia,Southern and Eastern Europe,Arrived 2015,2680,2011-2016
"Employed, worked full-time",Australia,Southern and Eastern Europe,Arrived 2016,1059,2011-2016
"Employed, worked full-time",Australia,North Africa and the Middle East,Arrived 2006,2599,2006-2010
"Employed, worked full-time",Australia,North Africa and the Middle East,Arrived 2007,2485,2006-2010
"Employed, worked full-time",Australia,North Africa and the Middle East,Arrived 2008,2595,2006-2010
"Employed, worked full-time",Australia,North Africa and the Middle East,Arrived 2009,2496,2006-2010
"Employed, worked full-time",Australia,North Africa and the Middle East,Arrived 2010,2690,2006-2010
"Employed, worked full-time",Australia,North Africa and the Middle East,Arrived 2011,2965,2011-2016
"Employed, worked full-time",Australia,North Africa and the Middle East,Arrived 2012,3172,2011-2016
"Employed, worked full-time",Australia,North Africa and the Middle East,Arrived 2013,2897,2011-2016
"Employed, worked full-time",Australia,North Africa and the Middle East,Arrived 2014,1947,2011-2016
"Employed, worked full-time",Australia,North Africa and the Middle East,Arrived 2015,1751,2011-2016
"Employed, worked full-time",Australia,North Africa and the Middle East,Arrived 2016,589,2011-2016
"Employed, worked full-time",Australia,South-East Asia,Arrived 2006,10107,2006-2010
"Employed, worked full-time",Australia,South-East Asia,Arrived 2007,11439,2006-2010
"Employed, worked full-time",Australia,South-East Asia,Arrived 2008,13367,2006-2010
"Employed, worked full-time",Australia,South-East Asia,Arrived 2009,10462,2006-2010
"Employed, worked full-time",Australia,South-East Asia,Arrived 2010,8507,2006-2010
"Employed, worked full-time",Australia,South-East Asia,Arrived 2011,8715,2011-2016
"Employed, worked full-time",Australia,South-East Asia,Arrived 2012,9733,2011-2016
"Employed, worked full-time",Australia,South-East Asia,Arrived 2013,8212,2011-2016
"Employed, worked full-time",Australia,South-East Asia,Arrived 2014,6161,2011-2016
"Employed, worked full-time",Australia,South-East Asia,Arrived 2015,5260,2011-2016
"Employed, worked full-time",Australia,South-East Asia,Arrived 2016,2189,2011-2016
"Employed, worked full-time",Australia,North-East Asia,Arrived 2006,10665,2006-2010
"Employed, worked full-time",Australia,North-East Asia,Arrived 2007,12105,2006-2010
"Employed, worked full-time",Australia,North-East Asia,Arrived 2008,12774,2006-2010
"Employed, worked full-time",Australia,North-East Asia,Arrived 2009,10989,2006-2010
"Employed, worked full-time",Australia,North-East Asia,Arrived 2010,9098,2006-2010
"Employed, worked full-time",Australia,North-East Asia,Arrived 2011,7487,2011-2016
"Employed, worked full-time",Australia,North-East Asia,Arrived 2012,7522,2011-2016
"Employed, worked full-time",Australia,North-East Asia,Arrived 2013,6922,2011-2016
"Employed, worked full-time",Australia,North-East Asia,Arrived 2014,6645,2011-2016
"Employed, worked full-time",Australia,North-East Asia,Arrived 2015,7275,2011-2016
"Employed, worked full-time",Australia,North-East Asia,Arrived 2016,3463,2011-2016
"Employed, worked full-time",Australia,Southern and Central Asia,Arrived 2006,18465,2006-2010
"Employed, worked full-time",Australia,Southern and Central Asia,Arrived 2007,26009,2006-2010
"Employed, worked full-time",Australia,Southern and Central Asia,Arrived 2008,30784,2006-2010
"Employed, worked full-time",Australia,Southern and Central Asia,Arrived 2009,25401,2006-2010
"Employed, worked full-time",Australia,Southern and Central Asia,Arrived 2010,12621,2006-2010
"Employed, worked full-time",Australia,Southern and Central Asia,Arrived 2011,12540,2011-2016
"Employed, worked full-time",Australia,Southern and Central Asia,Arrived 2012,16689,2011-2016
"Employed, worked full-time",Australia,Southern and Central Asia,Arrived 2013,15800,2011-2016
"Employed, worked full-time",Australia,Southern and Central Asia,Arrived 2014,14249,2011-2016
"Employed, worked full-time",Australia,Southern and Central Asia,Arrived 2015,12603,2011-2016
"Employed, worked full-time",Australia,Southern and Central Asia,Arrived 2016,5424,2011-2016
"Employed, worked full-time",Australia,Americas,Arrived 2006,2989,2006-2010
"Employed, worked full-time",Australia,Americas,Arrived 2007,3347,2006-2010
"Employed, worked full-time",Australia,Americas,Arrived 2008,3945,2006-2010
"Employed, worked full-time",Australia,Americas,Arrived 2009,3553,2006-2010
"Employed, worked full-time",Australia,Americas,Arrived 2010,3718,2006-2010
"Employed, worked full-time",Australia,Americas,Arrived 2011,3833,2011-2016
"Employed, worked full-time",Australia,Americas,Arrived 2012,4030,2011-2016
"Employed, worked full-time",Australia,Americas,Arrived 2013,3507,2011-2016
"Employed, worked full-time",Australia,Americas,Arrived 2014,3640,2011-2016
"Employed, worked full-time",Australia,Americas,Arrived 2015,3565,2011-2016
"Employed, worked full-time",Australia,Americas,Arrived 2016,1937,2011-2016
"Employed, worked full-time",Australia,Sub-Saharan Africa,Arrived 2006,6086,2006-2010
"Employed, worked full-time",Australia,Sub-Saharan Africa,Arrived 2007,6892,2006-2010
"Employed, worked full-time",Australia,Sub-Saharan Africa,Arrived 2008,8961,2006-2010
"Employed, worked full-time",Australia,Sub-Saharan Africa,Arrived 2009,6080,2006-2010
"Employed, worked full-time",Australia,Sub-Saharan Africa,Arrived 2010,4425,2006-2010
"Employed, worked full-time",Australia,Sub-Saharan Africa,Arrived 2011,4596,2011-2016
"Employed, worked full-time",Australia,Sub-Saharan Africa,Arrived 2012,4673,2011-2016
"Employed, worked full-time",Australia,Sub-Saharan Africa,Arrived 2013,3657,2011-2016
"Employed, worked full-time",Australia,Sub-Saharan Africa,Arrived 2014,3161,2011-2016
"Employed, worked full-time",Australia,Sub-Saharan Africa,Arrived 2015,2621,2011-2016
"Employed, worked full-time",Australia,Sub-Saharan Africa,Arrived 2016,1173,2011-2016
"Employed, worked part-time",Australia,Oceania and Antarctica,Arrived 2006,2879,2006-2010
"Employed, worked part-time",Australia,Oceania and Antarctica,Arrived 2007,3297,2006-2010
"Employed, worked part-time",Australia,Oceania and Antarctica,Arrived 2008,3593,2006-2010
"Employed, worked part-time",Australia,Oceania and Antarctica,Arrived 2009,2496,2006-2010
"Employed, worked part-time",Australia,Oceania and Antarctica,Arrived 2010,2698,2006-2010
"Employed, worked part-time",Australia,Oceania and Antarctica,Arrived 2011,3477,2011-2016
"Employed, worked part-time",Australia,Oceania and Antarctica,Arrived 2012,3504,2011-2016
"Employed, worked part-time",Australia,Oceania and Antarctica,Arrived 2013,2782,2011-2016
"Employed, worked part-time",Australia,Oceania and Antarctica,Arrived 2014,2061,2011-2016
"Employed, worked part-time",Australia,Oceania and Antarctica,Arrived 2015,1813,2011-2016
"Employed, worked part-time",Australia,Oceania and Antarctica,Arrived 2016,909,2011-2016
"Employed, worked part-time",Australia,North-West Europe,Arrived 2006,6116,2006-2010
"Employed, worked part-time",Australia,North-West Europe,Arrived 2007,5997,2006-2010
"Employed, worked part-time",Australia,North-West Europe,Arrived 2008,5891,2006-2010
"Employed, worked part-time",Australia,North-West Europe,Arrived 2009,4563,2006-2010
"Employed, worked part-time",Australia,North-West Europe,Arrived 2010,3878,2006-2010
"Employed, worked part-time",Australia,North-West Europe,Arrived 2011,4401,2011-2016
"Employed, worked part-time",Australia,North-West Europe,Arrived 2012,4692,2011-2016
"Employed, worked part-time",Australia,North-West Europe,Arrived 2013,3722,2011-2016
"Employed, worked part-time",Australia,North-West Europe,Arrived 2014,3266,2011-2016
"Employed, worked part-time",Australia,North-West Europe,Arrived 2015,3151,2011-2016
"Employed, worked part-time",Australia,North-West Europe,Arrived 2016,1681,2011-2016
"Employed, worked part-time",Australia,Southern and Eastern Europe,Arrived 2006,895,2006-2010
"Employed, worked part-time",Australia,Southern and Eastern Europe,Arrived 2007,901,2006-2010
"Employed, worked part-time",Australia,Southern and Eastern Europe,Arrived 2008,986,2006-2010
"Employed, worked part-time",Australia,Southern and Eastern Europe,Arrived 2009,974,2006-2010
"Employed, worked part-time",Australia,Southern and Eastern Europe,Arrived 2010,940,2006-2010
"Employed, worked part-time",Australia,Southern and Eastern Europe,Arrived 2011,1228,2011-2016
"Employed, worked part-time",Australia,Southern and Eastern Europe,Arrived 2012,1905,2011-2016
"Employed, worked part-time",Australia,Southern and Eastern Europe,Arrived 2013,2344,2011-2016
"Employed, worked part-time",Australia,Southern and Eastern Europe,Arrived 2014,2458,2011-2016
"Employed, worked part-time",Australia,Southern and Eastern Europe,Arrived 2015,2286,2011-2016
"Employed, worked part-time",Australia,Southern and Eastern Europe,Arrived 2016,894,2011-2016
"Employed, worked part-time",Australia,North Africa and the Middle East,Arrived 2006,1518,2006-2010
"Employed, worked part-time",Australia,North Africa and the Middle East,Arrived 2007,1394,2006-2010
"Employed, worked part-time",Australia,North Africa and the Middle East,Arrived 2008,1539,2006-2010
"Employed, worked part-time",Australia,North Africa and the Middle East,Arrived 2009,1468,2006-2010
"Employed, worked part-time",Australia,North Africa and the Middle East,Arrived 2010,1360,2006-2010
"Employed, worked part-time",Australia,North Africa and the Middle East,Arrived 2011,1606,2011-2016
"Employed, worked part-time",Australia,North Africa and the Middle East,Arrived 2012,1752,2011-2016
"Employed, worked part-time",Australia,North Africa and the Middle East,Arrived 2013,1977,2011-2016
"Employed, worked part-time",Australia,North Africa and the Middle East,Arrived 2014,1337,2011-2016
"Employed, worked part-time",Australia,North Africa and the Middle East,Arrived 2015,1131,2011-2016
"Employed, worked part-time",Australia,North Africa and the Middle East,Arrived 2016,306,2011-2016
"Employed, worked part-time",Australia,South-East Asia,Arrived 2006,4902,2006-2010
"Employed, worked part-time",Australia,South-East Asia,Arrived 2007,5752,2006-2010
"Employed, worked part-time",Australia,South-East Asia,Arrived 2008,6925,2006-2010
"Employed, worked part-time",Australia,South-East Asia,Arrived 2009,6826,2006-2010
"Employed, worked part-time",Australia,South-East Asia,Arrived 2010,5767,2006-2010
"Employed, worked part-time",Australia,South-East Asia,Arrived 2011,6082,2011-2016
"Employed, worked part-time",Australia,South-East Asia,Arrived 2012,7591,2011-2016
"Employed, worked part-time",Australia,South-East Asia,Arrived 2013,8841,2011-2016
"Employed, worked part-time",Australia,South-East Asia,Arrived 2014,9417,2011-2016
"Employed, worked part-time",Australia,South-East Asia,Arrived 2015,8722,2011-2016
"Employed, worked part-time",Australia,South-East Asia,Arrived 2016,3035,2011-2016
"Employed, worked part-time",Australia,North-East Asia,Arrived 2006,5185,2006-2010
"Employed, worked part-time",Australia,North-East Asia,Arrived 2007,5926,2006-2010
"Employed, worked part-time",Australia,North-East Asia,Arrived 2008,6861,2006-2010
"Employed, worked part-time",Australia,North-East Asia,Arrived 2009,6542,2006-2010
"Employed, worked part-time",Australia,North-East Asia,Arrived 2010,5751,2006-2010
"Employed, worked part-time",Australia,North-East Asia,Arrived 2011,5714,2011-2016
"Employed, worked part-time",Australia,North-East Asia,Arrived 2012,7062,2011-2016
"Employed, worked part-time",Australia,North-East Asia,Arrived 2013,8016,2011-2016
"Employed, worked part-time",Australia,North-East Asia,Arrived 2014,8244,2011-2016
"Employed, worked part-time",Australia,North-East Asia,Arrived 2015,7441,2011-2016
"Employed, worked part-time",Australia,North-East Asia,Arrived 2016,2807,2011-2016
"Employed, worked part-time",Australia,Southern and Central Asia,Arrived 2006,5856,2006-2010
"Employed, worked part-time",Australia,Southern and Central Asia,Arrived 2007,9103,2006-2010
"Employed, worked part-time",Australia,Southern and Central Asia,Arrived 2008,12836,2006-2010
"Employed, worked part-time",Australia,Southern and Central Asia,Arrived 2009,11833,2006-2010
"Employed, worked part-time",Australia,Southern and Central Asia,Arrived 2010,5563,2006-2010
"Employed, worked part-time",Australia,Southern and Central Asia,Arrived 2011,5782,2011-2016
"Employed, worked part-time",Australia,Southern and Central Asia,Arrived 2012,7671,2011-2016
"Employed, worked part-time",Australia,Southern and Central Asia,Arrived 2013,11595,2011-2016
"Employed, worked part-time",Australia,Southern and Central Asia,Arrived 2014,18034,2011-2016
"Employed, worked part-time",Australia,Southern and Central Asia,Arrived 2015,16495,2011-2016
"Employed, worked part-time",Australia,Southern and Central Asia,Arrived 2016,7158,2011-2016
"Employed, worked part-time",Australia,Americas,Arrived 2006,1385,2006-2010
"Employed, worked part-time",Australia,Americas,Arrived 2007,1425,2006-2010
"Employed, worked part-time",Australia,Americas,Arrived 2008,1747,2006-2010
"Employed, worked part-time",Australia,Americas,Arrived 2009,1582,2006-2010
"Employed, worked part-time",Australia,Americas,Arrived 2010,1563,2006-2010
"Employed, worked part-time",Australia,Americas,Arrived 2011,1708,2011-2016
"Employed, worked part-time",Australia,Americas,Arrived 2012,2144,2011-2016
"Employed, worked part-time",Australia,Americas,Arrived 2013,2729,2011-2016
"Employed, worked part-time",Australia,Americas,Arrived 2014,3663,2011-2016
"Employed, worked part-time",Australia,Americas,Arrived 2015,5680,2011-2016
"Employed, worked part-time",Australia,Americas,Arrived 2016,3078,2011-2016
"Employed, worked part-time",Australia,Sub-Saharan Africa,Arrived 2006,2861,2006-2010
"Employed, worked part-time",Australia,Sub-Saharan Africa,Arrived 2007,3234,2006-2010
"Employed, worked part-time",Australia,Sub-Saharan Africa,Arrived 2008,4052,2006-2010
"Employed, worked part-time",Australia,Sub-Saharan Africa,Arrived 2009,2938,2006-2010
"Employed, worked part-time",Australia,Sub-Saharan Africa,Arrived 2010,2211,2006-2010
"Employed, worked part-time",Australia,Sub-Saharan Africa,Arrived 2011,2104,2011-2016
"Employed, worked part-time",Australia,Sub-Saharan Africa,Arrived 2012,2164,2011-2016
"Employed, worked part-time",Australia,Sub-Saharan Africa,Arrived 2013,2009,2011-2016
"Employed, worked part-time",Australia,Sub-Saharan Africa,Arrived 2014,2106,2011-2016
"Employed, worked part-time",Australia,Sub-Saharan Africa,Arrived 2015,2060,2011-2016
"Employed, worked part-time",Australia,Sub-Saharan Africa,Arrived 2016,889,2011-2016
"Employed, away from work",Australia,Oceania and Antarctica,Arrived 2006,629,2006-2010
"Employed, away from work",Australia,Oceania and Antarctica,Arrived 2007,661,2006-2010
"Employed, away from work",Australia,Oceania and Antarctica,Arrived 2008,793,2006-2010
"Employed, away from work",Australia,Oceania and Antarctica,Arrived 2009,567,2006-2010
"Employed, away from work",Australia,Oceania and Antarctica,Arrived 2010,613,2006-2010
"Employed, away from work",Australia,Oceania and Antarctica,Arrived 2011,842,2011-2016
"Employed, away from work",Australia,Oceania and Antarctica,Arrived 2012,780,2011-2016
"Employed, away from work",Australia,Oceania and Antarctica,Arrived 2013,594,2011-2016
"Employed, away from work",Australia,Oceania and Antarctica,Arrived 2014,452,2011-2016
"Employed, away from work",Australia,Oceania and Antarctica,Arrived 2015,379,2011-2016
"Employed, away from work",Australia,Oceania and Antarctica,Arrived 2016,162,2011-2016
"Employed, away from work",Australia,North-West Europe,Arrived 2006,1011,2006-2010
"Employed, away from work",Australia,North-West Europe,Arrived 2007,1046,2006-2010
"Employed, away from work",Australia,North-West Europe,Arrived 2008,1080,2006-2010
"Employed, away from work",Australia,North-West Europe,Arrived 2009,934,2006-2010
"Employed, away from work",Australia,North-West Europe,Arrived 2010,946,2006-2010
"Employed, away from work",Australia,North-West Europe,Arrived 2011,1116,2011-2016
"Employed, away from work",Australia,North-West Europe,Arrived 2012,1097,2011-2016
"Employed, away from work",Australia,North-West Europe,Arrived 2013,834,2011-2016
"Employed, away from work",Australia,North-West Europe,Arrived 2014,726,2011-2016
"Employed, away from work",Australia,North-West Europe,Arrived 2015,616,2011-2016
"Employed, away from work",Australia,North-West Europe,Arrived 2016,307,2011-2016
"Employed, away from work",Australia,Southern and Eastern Europe,Arrived 2006,155,2006-2010
"Employed, away from work",Australia,Southern and Eastern Europe,Arrived 2007,144,2006-2010
"Employed, away from work",Australia,Southern and Eastern Europe,Arrived 2008,192,2006-2010
"Employed, away from work",Australia,Southern and Eastern Europe,Arrived 2009,199,2006-2010
"Employed, away from work",Australia,Southern and Eastern Europe,Arrived 2010,203,2006-2010
"Employed, away from work",Australia,Southern and Eastern Europe,Arrived 2011,214,2011-2016
"Employed, away from work",Australia,Southern and Eastern Europe,Arrived 2012,293,2011-2016
"Employed, away from work",Australia,Southern and Eastern Europe,Arrived 2013,290,2011-2016
"Employed, away from work",Australia,Southern and Eastern Europe,Arrived 2014,287,2011-2016
"Employed, away from work",Australia,Southern and Eastern Europe,Arrived 2015,238,2011-2016
"Employed, away from work",Australia,Southern and Eastern Europe,Arrived 2016,103,2011-2016
"Employed, away from work",Australia,North Africa and the Middle East,Arrived 2006,306,2006-2010
"Employed, away from work",Australia,North Africa and the Middle East,Arrived 2007,269,2006-2010
"Employed, away from work",Australia,North Africa and the Middle East,Arrived 2008,291,2006-2010
"Employed, away from work",Australia,North Africa and the Middle East,Arrived 2009,281,2006-2010
"Employed, away from work",Australia,North Africa and the Middle East,Arrived 2010,261,2006-2010
"Employed, away from work",Australia,North Africa and the Middle East,Arrived 2011,262,2011-2016
"Employed, away from work",Australia,North Africa and the Middle East,Arrived 2012,275,2011-2016
"Employed, away from work",Australia,North Africa and the Middle East,Arrived 2013,290,2011-2016
"Employed, away from work",Australia,North Africa and the Middle East,Arrived 2014,187,2011-2016
"Employed, away from work",Australia,North Africa and the Middle East,Arrived 2015,142,2011-2016
"Employed, away from work",Australia,North Africa and the Middle East,Arrived 2016,71,2011-2016
"Employed, away from work",Australia,South-East Asia,Arrived 2006,686,2006-2010
"Employed, away from work",Australia,South-East Asia,Arrived 2007,748,2006-2010
"Employed, away from work",Australia,South-East Asia,Arrived 2008,881,2006-2010
"Employed, away from work",Australia,South-East Asia,Arrived 2009,794,2006-2010
"Employed, away from work",Australia,South-East Asia,Arrived 2010,649,2006-2010
"Employed, away from work",Australia,South-East Asia,Arrived 2011,696,2011-2016
"Employed, away from work",Australia,South-East Asia,Arrived 2012,728,2011-2016
"Employed, away from work",Australia,South-East Asia,Arrived 2013,820,2011-2016
"Employed, away from work",Australia,South-East Asia,Arrived 2014,739,2011-2016
"Employed, away from work",Australia,South-East Asia,Arrived 2015,638,2011-2016
"Employed, away from work",Australia,South-East Asia,Arrived 2016,315,2011-2016
"Employed, away from work",Australia,North-East Asia,Arrived 2006,841,2006-2010
"Employed, away from work",Australia,North-East Asia,Arrived 2007,998,2006-2010
"Employed, away from work",Australia,North-East Asia,Arrived 2008,1018,2006-2010
"Employed, away from work",Australia,North-East Asia,Arrived 2009,903,2006-2010
"Employed, away from work",Australia,North-East Asia,Arrived 2010,745,2006-2010
"Employed, away from work",Australia,North-East Asia,Arrived 2011,625,2011-2016
"Employed, away from work",Australia,North-East Asia,Arrived 2012,675,2011-2016
"Employed, away from work",Australia,North-East Asia,Arrived 2013,687,2011-2016
"Employed, away from work",Australia,North-East Asia,Arrived 2014,765,2011-2016
"Employed, away from work",Australia,North-East Asia,Arrived 2015,741,2011-2016
"Employed, away from work",Australia,North-East Asia,Arrived 2016,354,2011-2016
"Employed, away from work",Australia,Southern and Central Asia,Arrived 2006,1168,2006-2010
"Employed, away from work",Australia,Southern and Central Asia,Arrived 2007,1676,2006-2010
"Employed, away from work",Australia,Southern and Central Asia,Arrived 2008,2261,2006-2010
"Employed, away from work",Australia,Southern and Central Asia,Arrived 2009,2028,2006-2010
"Employed, away from work",Australia,Southern and Central Asia,Arrived 2010,1012,2006-2010
"Employed, away from work",Australia,Southern and Central Asia,Arrived 2011,1040,2011-2016
"Employed, away from work",Australia,Southern and Central Asia,Arrived 2012,1433,2011-2016
"Employed, away from work",Australia,Southern and Central Asia,Arrived 2013,1404,2011-2016
"Employed, away from work",Australia,Southern and Central Asia,Arrived 2014,1460,2011-2016
"Employed, away from work",Australia,Southern and Central Asia,Arrived 2015,1142,2011-2016
"Employed, away from work",Australia,Southern and Central Asia,Arrived 2016,556,2011-2016
"Employed, away from work",Australia,Americas,Arrived 2006,247,2006-2010
"Employed, away from work",Australia,Americas,Arrived 2007,261,2006-2010
"Employed, away from work",Australia,Americas,Arrived 2008,288,2006-2010
"Employed, away from work",Australia,Americas,Arrived 2009,259,2006-2010
"Employed, away from work",Australia,Americas,Arrived 2010,222,2006-2010
"Employed, away from work",Australia,Americas,Arrived 2011,274,2011-2016
"Employed, away from work",Australia,Americas,Arrived 2012,265,2011-2016
"Employed, away from work",Australia,Americas,Arrived 2013,266,2011-2016
"Employed, away from work",Australia,Americas,Arrived 2014,256,2011-2016
"Employed, away from work",Australia,Americas,Arrived 2015,300,2011-2016
"Employed, away from work",Australia,Americas,Arrived 2016,151,2011-2016
"Employed, away from work",Australia,Sub-Saharan Africa,Arrived 2006,432,2006-2010
"Employed, away from work",Australia,Sub-Saharan Africa,Arrived 2007,456,2006-2010
"Employed, away from work",Australia,Sub-Saharan Africa,Arrived 2008,626,2006-2010
"Employed, away from work",Australia,Sub-Saharan Africa,Arrived 2009,423,2006-2010
"Employed, away from work",Australia,Sub-Saharan Africa,Arrived 2010,312,2006-2010
"Employed, away from work",Australia,Sub-Saharan Africa,Arrived 2011,273,2011-2016
"Employed, away from work",Australia,Sub-Saharan Africa,Arrived 2012,288,2011-2016
"Employed, away from work",Australia,Sub-Saharan Africa,Arrived 2013,245,2011-2016
"Employed, away from work",Australia,Sub-Saharan Africa,Arrived 2014,236,2011-2016
"Employed, away from work",Australia,Sub-Saharan Africa,Arrived 2015,204,2011-2016
"Employed, away from work",Australia,Sub-Saharan Africa,Arrived 2016,96,2011-2016
"Unemployed, looking for full-time work",Australia,Oceania and Antarctica,Arrived 2006,501,2006-2010
"Unemployed, looking for full-time work",Australia,Oceania and Antarctica,Arrived 2007,553,2006-2010
"Unemployed, looking for full-time work",Australia,Oceania and Antarctica,Arrived 2008,743,2006-2010
"Unemployed, looking for full-time work",Australia,Oceania and Antarctica,Arrived 2009,528,2006-2010
"Unemployed, looking for full-time work",Australia,Oceania and Antarctica,Arrived 2010,611,2006-2010
"Unemployed, looking for full-time work",Australia,Oceania and Antarctica,Arrived 2011,742,2011-2016
"Unemployed, looking for full-time work",Australia,Oceania and Antarctica,Arrived 2012,817,2011-2016
"Unemployed, looking for full-time work",Australia,Oceania and Antarctica,Arrived 2013,663,2011-2016
"Unemployed, looking for full-time work",Australia,Oceania and Antarctica,Arrived 2014,559,2011-2016
"Unemployed, looking for full-time work",Australia,Oceania and Antarctica,Arrived 2015,591,2011-2016
"Unemployed, looking for full-time work",Australia,Oceania and Antarctica,Arrived 2016,767,2011-2016
"Unemployed, looking for full-time work",Australia,North-West Europe,Arrived 2006,637,2006-2010
"Unemployed, looking for full-time work",Australia,North-West Europe,Arrived 2007,580,2006-2010
"Unemployed, looking for full-time work",Australia,North-West Europe,Arrived 2008,586,2006-2010
"Unemployed, looking for full-time work",Australia,North-West Europe,Arrived 2009,449,2006-2010
"Unemployed, looking for full-time work",Australia,North-West Europe,Arrived 2010,400,2006-2010
"Unemployed, looking for full-time work",Australia,North-West Europe,Arrived 2011,535,2011-2016
"Unemployed, looking for full-time work",Australia,North-West Europe,Arrived 2012,471,2011-2016
"Unemployed, looking for full-time work",Australia,North-West Europe,Arrived 2013,389,2011-2016
"Unemployed, looking for full-time work",Australia,North-West Europe,Arrived 2014,439,2011-2016
"Unemployed, looking for full-time work",Australia,North-West Europe,Arrived 2015,713,2011-2016
"Unemployed, looking for full-time work",Australia,North-West Europe,Arrived 2016,946,2011-2016
"Unemployed, looking for full-time work",Australia,Southern and Eastern Europe,Arrived 2006,145,2006-2010
"Unemployed, looking for full-time work",Australia,Southern and Eastern Europe,Arrived 2007,103,2006-2010
"Unemployed, looking for full-time work",Australia,Southern and Eastern Europe,Arrived 2008,103,2006-2010
"Unemployed, looking for full-time work",Australia,Southern and Eastern Europe,Arrived 2009,145,2006-2010
"Unemployed, looking for full-time work",Australia,Southern and Eastern Europe,Arrived 2010,134,2006-2010
"Unemployed, looking for full-time work",Australia,Southern and Eastern Europe,Arrived 2011,180,2011-2016
"Unemployed, looking for full-time work",Australia,Southern and Eastern Europe,Arrived 2012,227,2011-2016
"Unemployed, looking for full-time work",Australia,Southern and Eastern Europe,Arrived 2013,259,2011-2016
"Unemployed, looking for full-time work",Australia,Southern and Eastern Europe,Arrived 2014,283,2011-2016
"Unemployed, looking for full-time work",Australia,Southern and Eastern Europe,Arrived 2015,372,2011-2016
"Unemployed, looking for full-time work",Australia,Southern and Eastern Europe,Arrived 2016,306,2011-2016
"Unemployed, looking for full-time work",Australia,North Africa and the Middle East,Arrived 2006,503,2006-2010
"Unemployed, looking for full-time work",Australia,North Africa and the Middle East,Arrived 2007,393,2006-2010
"Unemployed, looking for full-time work",Australia,North Africa and the Middle East,Arrived 2008,436,2006-2010
"Unemployed, looking for full-time work",Australia,North Africa and the Middle East,Arrived 2009,452,2006-2010
"Unemployed, looking for full-time work",Australia,North Africa and the Middle East,Arrived 2010,472,2006-2010
"Unemployed, looking for full-time work",Australia,North Africa and the Middle East,Arrived 2011,657,2011-2016
"Unemployed, looking for full-time work",Australia,North Africa and the Middle East,Arrived 2012,954,2011-2016
"Unemployed, looking for full-time work",Australia,North Africa and the Middle East,Arrived 2013,1576,2011-2016
"Unemployed, looking for full-time work",Australia,North Africa and the Middle East,Arrived 2014,585,2011-2016
"Unemployed, looking for full-time work",Australia,North Africa and the Middle East,Arrived 2015,736,2011-2016
"Unemployed, looking for full-time work",Australia,North Africa and the Middle East,Arrived 2016,530,2011-2016
"Unemployed, looking for full-time work",Australia,South-East Asia,Arrived 2006,630,2006-2010
"Unemployed, looking for full-time work",Australia,South-East Asia,Arrived 2007,705,2006-2010
"Unemployed, looking for full-time work",Australia,South-East Asia,Arrived 2008,851,2006-2010
"Unemployed, looking for full-time work",Australia,South-East Asia,Arrived 2009,757,2006-2010
"Unemployed, looking for full-time work",Australia,South-East Asia,Arrived 2010,727,2006-2010
"Unemployed, looking for full-time work",Australia,South-East Asia,Arrived 2011,779,2011-2016
"Unemployed, looking for full-time work",Australia,South-East Asia,Arrived 2012,959,2011-2016
"Unemployed, looking for full-time work",Australia,South-East Asia,Arrived 2013,1194,2011-2016
"Unemployed, looking for full-time work",Australia,South-East Asia,Arrived 2014,905,2011-2016
"Unemployed, looking for full-time work",Australia,South-East Asia,Arrived 2015,1148,2011-2016
"Unemployed, looking for full-time work",Australia,South-East Asia,Arrived 2016,1082,2011-2016
"Unemployed, looking for full-time work",Australia,North-East Asia,Arrived 2006,741,2006-2010
"Unemployed, looking for full-time work",Australia,North-East Asia,Arrived 2007,876,2006-2010
"Unemployed, looking for full-time work",Australia,North-East Asia,Arrived 2008,1043,2006-2010
"Unemployed, looking for full-time work",Australia,North-East Asia,Arrived 2009,1081,2006-2010
"Unemployed, looking for full-time work",Australia,North-East Asia,Arrived 2010,981,2006-2010
"Unemployed, looking for full-time work",Australia,North-East Asia,Arrived 2011,891,2011-2016
"Unemployed, looking for full-time work",Australia,North-East Asia,Arrived 2012,1110,2011-2016
"Unemployed, looking for full-time work",Australia,North-East Asia,Arrived 2013,1172,2011-2016
"Unemployed, looking for full-time work",Australia,North-East Asia,Arrived 2014,1212,2011-2016
"Unemployed, looking for full-time work",Australia,North-East Asia,Arrived 2015,1020,2011-2016
"Unemployed, looking for full-time work",Australia,North-East Asia,Arrived 2016,1000,2011-2016
"Unemployed, looking for full-time work",Australia,Southern and Central Asia,Arrived 2006,892,2006-2010
"Unemployed, looking for full-time work",Australia,Southern and Central Asia,Arrived 2007,1210,2006-2010
"Unemployed, looking for full-time work",Australia,Southern and Central Asia,Arrived 2008,1523,2006-2010
"Unemployed, looking for full-time work",Australia,Southern and Central Asia,Arrived 2009,1475,2006-2010
"Unemployed, looking for full-time work",Australia,Southern and Central Asia,Arrived 2010,1079,2006-2010
"Unemployed, looking for full-time work",Australia,Southern and Central Asia,Arrived 2011,1200,2011-2016
"Unemployed, looking for full-time work",Australia,Southern and Central Asia,Arrived 2012,2251,2011-2016
"Unemployed, looking for full-time work",Australia,Southern and Central Asia,Arrived 2013,2437,2011-2016
"Unemployed, looking for full-time work",Australia,Southern and Central Asia,Arrived 2014,2030,2011-2016
"Unemployed, looking for full-time work",Australia,Southern and Central Asia,Arrived 2015,2466,2011-2016
"Unemployed, looking for full-time work",Australia,Southern and Central Asia,Arrived 2016,3148,2011-2016
"Unemployed, looking for full-time work",Australia,Americas,Arrived 2006,161,2006-2010
"Unemployed, looking for full-time work",Australia,Americas,Arrived 2007,179,2006-2010
"Unemployed, looking for full-time work",Australia,Americas,Arrived 2008,193,2006-2010
"Unemployed, looking for full-time work",Australia,Americas,Arrived 2009,170,2006-2010
"Unemployed, looking for full-time work",Australia,Americas,Arrived 2010,220,2006-2010
"Unemployed, looking for full-time work",Australia,Americas,Arrived 2011,232,2011-2016
"Unemployed, looking for full-time work",Australia,Americas,Arrived 2012,255,2011-2016
"Unemployed, looking for full-time work",Australia,Americas,Arrived 2013,218,2011-2016
"Unemployed, looking for full-time work",Australia,Americas,Arrived 2014,278,2011-2016
"Unemployed, looking for full-time work",Australia,Americas,Arrived 2015,355,2011-2016
"Unemployed, looking for full-time work",Australia,Americas,Arrived 2016,467,2011-2016
"Unemployed, looking for full-time work",Australia,Sub-Saharan Africa,Arrived 2006,526,2006-2010
"Unemployed, looking for full-time work",Australia,Sub-Saharan Africa,Arrived 2007,563,2006-2010
"Unemployed, looking for full-time work",Australia,Sub-Saharan Africa,Arrived 2008,563,2006-2010
"Unemployed, looking for full-time work",Australia,Sub-Saharan Africa,Arrived 2009,513,2006-2010
"Unemployed, looking for full-time work",Australia,Sub-Saharan Africa,Arrived 2010,402,2006-2010
"Unemployed, looking for full-time work",Australia,Sub-Saharan Africa,Arrived 2011,378,2011-2016
"Unemployed, looking for full-time work",Australia,Sub-Saharan Africa,Arrived 2012,385,2011-2016
"Unemployed, looking for full-time work",Australia,Sub-Saharan Africa,Arrived 2013,387,2011-2016
"Unemployed, looking for full-time work",Australia,Sub-Saharan Africa,Arrived 2014,414,2011-2016
"Unemployed, looking for full-time work",Australia,Sub-Saharan Africa,Arrived 2015,468,2011-2016
"Unemployed, looking for full-time work",Australia,Sub-Saharan Africa,Arrived 2016,520,2011-2016
"Unemployed, looking for part-time work",Australia,Oceania and Antarctica,Arrived 2006,353,2006-2010
"Unemployed, looking for part-time work",Australia,Oceania and Antarctica,Arrived 2007,408,2006-2010
"Unemployed, looking for part-time work",Australia,Oceania and Antarctica,Arrived 2008,510,2006-2010
"Unemployed, looking for part-time work",Australia,Oceania and Antarctica,Arrived 2009,349,2006-2010
"Unemployed, looking for part-time work",Australia,Oceania and Antarctica,Arrived 2010,353,2006-2010
"Unemployed, looking for part-time work",Australia,Oceania and Antarctica,Arrived 2011,472,2011-2016
"Unemployed, looking for part-time work",Australia,Oceania and Antarctica,Arrived 2012,483,2011-2016
"Unemployed, looking for part-time work",Australia,Oceania and Antarctica,Arrived 2013,391,2011-2016
"Unemployed, looking for part-time work",Australia,Oceania and Antarctica,Arrived 2014,361,2011-2016
"Unemployed, looking for part-time work",Australia,Oceania and Antarctica,Arrived 2015,366,2011-2016
"Unemployed, looking for part-time work",Australia,Oceania and Antarctica,Arrived 2016,269,2011-2016
"Unemployed, looking for part-time work",Australia,North-West Europe,Arrived 2006,522,2006-2010
"Unemployed, looking for part-time work",Australia,North-West Europe,Arrived 2007,537,2006-2010
"Unemployed, looking for part-time work",Australia,North-West Europe,Arrived 2008,451,2006-2010
"Unemployed, looking for part-time work",Australia,North-West Europe,Arrived 2009,386,2006-2010
"Unemployed, looking for part-time work",Australia,North-West Europe,Arrived 2010,347,2006-2010
"Unemployed, looking for part-time work",Australia,North-West Europe,Arrived 2011,402,2011-2016
"Unemployed, looking for part-time work",Australia,North-West Europe,Arrived 2012,382,2011-2016
"Unemployed, looking for part-time work",Australia,North-West Europe,Arrived 2013,331,2011-2016
"Unemployed, looking for part-time work",Australia,North-West Europe,Arrived 2014,372,2011-2016
"Unemployed, looking for part-time work",Australia,North-West Europe,Arrived 2015,457,2011-2016
"Unemployed, looking for part-time work",Australia,North-West Europe,Arrived 2016,551,2011-2016
"Unemployed, looking for part-time work",Australia,Southern and Eastern Europe,Arrived 2006,113,2006-2010
"Unemployed, looking for part-time work",Australia,Southern and Eastern Europe,Arrived 2007,91,2006-2010
"Unemployed, looking for part-time work",Australia,Southern and Eastern Europe,Arrived 2008,105,2006-2010
"Unemployed, looking for part-time work",Australia,Southern and Eastern Europe,Arrived 2009,115,2006-2010
"Unemployed, looking for part-time work",Australia,Southern and Eastern Europe,Arrived 2010,96,2006-2010
"Unemployed, looking for part-time work",Australia,Southern and Eastern Europe,Arrived 2011,100,2011-2016
"Unemployed, looking for part-time work",Australia,Southern and Eastern Europe,Arrived 2012,193,2011-2016
"Unemployed, looking for part-time work",Australia,Southern and Eastern Europe,Arrived 2013,221,2011-2016
"Unemployed, looking for part-time work",Australia,Southern and Eastern Europe,Arrived 2014,277,2011-2016
"Unemployed, looking for part-time work",Australia,Southern and Eastern Europe,Arrived 2015,324,2011-2016
"Unemployed, looking for part-time work",Australia,Southern and Eastern Europe,Arrived 2016,321,2011-2016
"Unemployed, looking for part-time work",Australia,North Africa and the Middle East,Arrived 2006,381,2006-2010
"Unemployed, looking for part-time work",Australia,North Africa and the Middle East,Arrived 2007,276,2006-2010
"Unemployed, looking for part-time work",Australia,North Africa and the Middle East,Arrived 2008,311,2006-2010
"Unemployed, looking for part-time work",Australia,North Africa and the Middle East,Arrived 2009,302,2006-2010
"Unemployed, looking for part-time work",Australia,North Africa and the Middle East,Arrived 2010,357,2006-2010
"Unemployed, looking for part-time work",Australia,North Africa and the Middle East,Arrived 2011,438,2011-2016
"Unemployed, looking for part-time work",Australia,North Africa and the Middle East,Arrived 2012,497,2011-2016
"Unemployed, looking for part-time work",Australia,North Africa and the Middle East,Arrived 2013,851,2011-2016
"Unemployed, looking for part-time work",Australia,North Africa and the Middle East,Arrived 2014,643,2011-2016
"Unemployed, looking for part-time work",Australia,North Africa and the Middle East,Arrived 2015,663,2011-2016
"Unemployed, looking for part-time work",Australia,North Africa and the Middle East,Arrived 2016,427,2011-2016
"Unemployed, looking for part-time work",Australia,South-East Asia,Arrived 2006,625,2006-2010
"Unemployed, looking for part-time work",Australia,South-East Asia,Arrived 2007,667,2006-2010
"Unemployed, looking for part-time work",Australia,South-East Asia,Arrived 2008,921,2006-2010
"Unemployed, looking for part-time work",Australia,South-East Asia,Arrived 2009,815,2006-2010
"Unemployed, looking for part-time work",Australia,South-East Asia,Arrived 2010,766,2006-2010
"Unemployed, looking for part-time work",Australia,South-East Asia,Arrived 2011,881,2011-2016
"Unemployed, looking for part-time work",Australia,South-East Asia,Arrived 2012,1050,2011-2016
"Unemployed, looking for part-time work",Australia,South-East Asia,Arrived 2013,1343,2011-2016
"Unemployed, looking for part-time work",Australia,South-East Asia,Arrived 2014,1711,2011-2016
"Unemployed, looking for part-time work",Australia,South-East Asia,Arrived 2015,2431,2011-2016
"Unemployed, looking for part-time work",Australia,South-East Asia,Arrived 2016,2197,2011-2016
"Unemployed, looking for part-time work",Australia,North-East Asia,Arrived 2006,648,2006-2010
"Unemployed, looking for part-time work",Australia,North-East Asia,Arrived 2007,751,2006-2010
"Unemployed, looking for part-time work",Australia,North-East Asia,Arrived 2008,978,2006-2010
"Unemployed, looking for part-time work",Australia,North-East Asia,Arrived 2009,1085,2006-2010
"Unemployed, looking for part-time work",Australia,North-East Asia,Arrived 2010,1079,2006-2010
"Unemployed, looking for part-time work",Australia,North-East Asia,Arrived 2011,1277,2011-2016
"Unemployed, looking for part-time work",Australia,North-East Asia,Arrived 2012,1652,2011-2016
"Unemployed, looking for part-time work",Australia,North-East Asia,Arrived 2013,2046,2011-2016
"Unemployed, looking for part-time work",Australia,North-East Asia,Arrived 2014,3011,2011-2016
"Unemployed, looking for part-time work",Australia,North-East Asia,Arrived 2015,3736,2011-2016
"Unemployed, looking for part-time work",Australia,North-East Asia,Arrived 2016,2013,2011-2016
"Unemployed, looking for part-time work",Australia,Southern and Central Asia,Arrived 2006,663,2006-2010
"Unemployed, looking for part-time work",Australia,Southern and Central Asia,Arrived 2007,832,2006-2010
"Unemployed, looking for part-time work",Australia,Southern and Central Asia,Arrived 2008,1041,2006-2010
"Unemployed, looking for part-time work",Australia,Southern and Central Asia,Arrived 2009,1003,2006-2010
"Unemployed, looking for part-time work",Australia,Southern and Central Asia,Arrived 2010,783,2006-2010
"Unemployed, looking for part-time work",Australia,Southern and Central Asia,Arrived 2011,840,2011-2016
"Unemployed, looking for part-time work",Australia,Southern and Central Asia,Arrived 2012,1057,2011-2016
"Unemployed, looking for part-time work",Australia,Southern and Central Asia,Arrived 2013,1357,2011-2016
"Unemployed, looking for part-time work",Australia,Southern and Central Asia,Arrived 2014,1914,2011-2016
"Unemployed, looking for part-time work",Australia,Southern and Central Asia,Arrived 2015,2888,2011-2016
"Unemployed, looking for part-time work",Australia,Southern and Central Asia,Arrived 2016,4633,2011-2016
"Unemployed, looking for part-time work",Australia,Americas,Arrived 2006,125,2006-2010
"Unemployed, looking for part-time work",Australia,Americas,Arrived 2007,159,2006-2010
"Unemployed, looking for part-time work",Australia,Americas,Arrived 2008,163,2006-2010
"Unemployed, looking for part-time work",Australia,Americas,Arrived 2009,153,2006-2010
"Unemployed, looking for part-time work",Australia,Americas,Arrived 2010,152,2006-2010
"Unemployed, looking for part-time work",Australia,Americas,Arrived 2011,179,2011-2016
"Unemployed, looking for part-time work",Australia,Americas,Arrived 2012,219,2011-2016
"Unemployed, looking for part-time work",Australia,Americas,Arrived 2013,229,2011-2016
"Unemployed, looking for part-time work",Australia,Americas,Arrived 2014,347,2011-2016
"Unemployed, looking for part-time work",Australia,Americas,Arrived 2015,757,2011-2016
"Unemployed, looking for part-time work",Australia,Americas,Arrived 2016,1102,2011-2016
"Unemployed, looking for part-time work",Australia,Sub-Saharan Africa,Arrived 2006,452,2006-2010
"Unemployed, looking for part-time work",Australia,Sub-Saharan Africa,Arrived 2007,491,2006-2010
"Unemployed, looking for part-time work",Australia,Sub-Saharan Africa,Arrived 2008,573,2006-2010
"Unemployed, looking for part-time work",Australia,Sub-Saharan Africa,Arrived 2009,406,2006-2010
"Unemployed, looking for part-time work",Australia,Sub-Saharan Africa,Arrived 2010,408,2006-2010
"Unemployed, looking for part-time work",Australia,Sub-Saharan Africa,Arrived 2011,347,2011-2016
"Unemployed, looking for part-time work",Australia,Sub-Saharan Africa,Arrived 2012,334,2011-2016
"Unemployed, looking for part-time work",Australia,Sub-Saharan Africa,Arrived 2013,359,2011-2016
"Unemployed, looking for part-time work",Australia,Sub-Saharan Africa,Arrived 2014,395,2011-2016
"Unemployed, looking for part-time work",Australia,Sub-Saharan Africa,Arrived 2015,610,2011-2016
"Unemployed, looking for part-time work",Australia,Sub-Saharan Africa,Arrived 2016,844,2011-2016
Not in the labour force,Australia,Oceania and Antarctica,Arrived 2006,2847,2006-2010
Not in the labour force,Australia,Oceania and Antarctica,Arrived 2007,3144,2006-2010
Not in the labour force,Australia,Oceania and Antarctica,Arrived 2008,3596,2006-2010
Not in the labour force,Australia,Oceania and Antarctica,Arrived 2009,2677,2006-2010
Not in the labour force,Australia,Oceania and Antarctica,Arrived 2010,2879,2006-2010
Not in the labour force,Australia,Oceania and Antarctica,Arrived 2011,3588,2011-2016
Not in the labour force,Australia,Oceania and Antarctica,Arrived 2012,3784,2011-2016
Not in the labour force,Australia,Oceania and Antarctica,Arrived 2013,3224,2011-2016
Not in the labour force,Australia,Oceania and Antarctica,Arrived 2014,2737,2011-2016
Not in the labour force,Australia,Oceania and Antarctica,Arrived 2015,2773,2011-2016
Not in the labour force,Australia,Oceania and Antarctica,Arrived 2016,1908,2011-2016
Not in the labour force,Australia,North-West Europe,Arrived 2006,4480,2006-2010
Not in the labour force,Australia,North-West Europe,Arrived 2007,4271,2006-2010
Not in the labour force,Australia,North-West Europe,Arrived 2008,3999,2006-2010
Not in the labour force,Australia,North-West Europe,Arrived 2009,3195,2006-2010
Not in the labour force,Australia,North-West Europe,Arrived 2010,3081,2006-2010
Not in the labour force,Australia,North-West Europe,Arrived 2011,3394,2011-2016
Not in the labour force,Australia,North-West Europe,Arrived 2012,3286,2011-2016
Not in the labour force,Australia,North-West Europe,Arrived 2013,2797,2011-2016
Not in the labour force,Australia,North-West Europe,Arrived 2014,2829,2011-2016
Not in the labour force,Australia,North-West Europe,Arrived 2015,3256,2011-2016
Not in the labour force,Australia,North-West Europe,Arrived 2016,2970,2011-2016
Not in the labour force,Australia,Southern and Eastern Europe,Arrived 2006,969,2006-2010
Not in the labour force,Australia,Southern and Eastern Europe,Arrived 2007,917,2006-2010
Not in the labour force,Australia,Southern and Eastern Europe,Arrived 2008,1020,2006-2010
Not in the labour force,Australia,Southern and Eastern Europe,Arrived 2009,1032,2006-2010
Not in the labour force,Australia,Southern and Eastern Europe,Arrived 2010,961,2006-2010
Not in the labour force,Australia,Southern and Eastern Europe,Arrived 2011,1096,2011-2016
Not in the labour force,Australia,Southern and Eastern Europe,Arrived 2012,1487,2011-2016
Not in the labour force,Australia,Southern and Eastern Europe,Arrived 2013,1622,2011-2016
Not in the labour force,Australia,Southern and Eastern Europe,Arrived 2014,1599,2011-2016
Not in the labour force,Australia,Southern and Eastern Europe,Arrived 2015,1650,2011-2016
Not in the labour force,Australia,Southern and Eastern Europe,Arrived 2016,1199,2011-2016
Not in the labour force,Australia,North Africa and the Middle East,Arrived 2006,4071,2006-2010
Not in the labour force,Australia,North Africa and the Middle East,Arrived 2007,3494,2006-2010
Not in the labour force,Australia,North Africa and the Middle East,Arrived 2008,4049,2006-2010
Not in the labour force,Australia,North Africa and the Middle East,Arrived 2009,4249,2006-2010
Not in the labour force,Australia,North Africa and the Middle East,Arrived 2010,4249,2006-2010
Not in the labour force,Australia,North Africa and the Middle East,Arrived 2011,5547,2011-2016
Not in the labour force,Australia,North Africa and the Middle East,Arrived 2012,5810,2011-2016
Not in the labour force,Australia,North Africa and the Middle East,Arrived 2013,9772,2011-2016
Not in the labour force,Australia,North Africa and the Middle East,Arrived 2014,6906,2011-2016
Not in the labour force,Australia,North Africa and the Middle East,Arrived 2015,6539,2011-2016
Not in the labour force,Australia,North Africa and the Middle East,Arrived 2016,5571,2011-2016
Not in the labour force,Australia,South-East Asia,Arrived 2006,5577,2006-2010
Not in the labour force,Australia,South-East Asia,Arrived 2007,6419,2006-2010
Not in the labour force,Australia,South-East Asia,Arrived 2008,7747,2006-2010
Not in the labour force,Australia,South-East Asia,Arrived 2009,7629,2006-2010
Not in the labour force,Australia,South-East Asia,Arrived 2010,7074,2006-2010
Not in the labour force,Australia,South-East Asia,Arrived 2011,7328,2011-2016
Not in the labour force,Australia,South-East Asia,Arrived 2012,8863,2011-2016
Not in the labour force,Australia,South-East Asia,Arrived 2013,11378,2011-2016
Not in the labour force,Australia,South-East Asia,Arrived 2014,12456,2011-2016
Not in the labour force,Australia,South-East Asia,Arrived 2015,15573,2011-2016
Not in the labour force,Australia,South-East Asia,Arrived 2016,13299,2011-2016
Not in the labour force,Australia,North-East Asia,Arrived 2006,6930,2006-2010
Not in the labour force,Australia,North-East Asia,Arrived 2007,7964,2006-2010
Not in the labour force,Australia,North-East Asia,Arrived 2008,10153,2006-2010
Not in the labour force,Australia,North-East Asia,Arrived 2009,10591,2006-2010
Not in the labour force,Australia,North-East Asia,Arrived 2010,11210,2006-2010
Not in the labour force,Australia,North-East Asia,Arrived 2011,12269,2011-2016
Not in the labour force,Australia,North-East Asia,Arrived 2012,15929,2011-2016
Not in the labour force,Australia,North-East Asia,Arrived 2013,20244,2011-2016
Not in the labour force,Australia,North-East Asia,Arrived 2014,29886,2011-2016
Not in the labour force,Australia,North-East Asia,Arrived 2015,38263,2011-2016
Not in the labour force,Australia,North-East Asia,Arrived 2016,24973,2011-2016
Not in the labour force,Australia,Southern and Central Asia,Arrived 2006,5685,2006-2010
Not in the labour force,Australia,Southern and Central Asia,Arrived 2007,7025,2006-2010
Not in the labour force,Australia,Southern and Central Asia,Arrived 2008,9418,2006-2010
Not in the labour force,Australia,Southern and Central Asia,Arrived 2009,9476,2006-2010
Not in the labour force,Australia,Southern and Central Asia,Arrived 2010,7056,2006-2010
Not in the labour force,Australia,Southern and Central Asia,Arrived 2011,7564,2011-2016
Not in the labour force,Australia,Southern and Central Asia,Arrived 2012,10340,2011-2016
Not in the labour force,Australia,Southern and Central Asia,Arrived 2013,12428,2011-2016
Not in the labour force,Australia,Southern and Central Asia,Arrived 2014,12570,2011-2016
Not in the labour force,Australia,Southern and Central Asia,Arrived 2015,13436,2011-2016
Not in the labour force,Australia,Southern and Central Asia,Arrived 2016,14384,2011-2016
Not in the labour force,Australia,Americas,Arrived 2006,1067,2006-2010
Not in the labour force,Australia,Americas,Arrived 2007,1147,2006-2010
Not in the labour force,Australia,Americas,Arrived 2008,1277,2006-2010
Not in the labour force,Australia,Americas,Arrived 2009,1195,2006-2010
Not in the labour force,Australia,Americas,Arrived 2010,1205,2006-2010
Not in the labour force,Australia,Americas,Arrived 2011,1290,2011-2016
Not in the labour force,Australia,Americas,Arrived 2012,1475,2011-2016
Not in the labour force,Australia,Americas,Arrived 2013,1611,2011-2016
Not in the labour force,Australia,Americas,Arrived 2014,2059,2011-2016
Not in the labour force,Australia,Americas,Arrived 2015,3635,2011-2016
Not in the labour force,Australia,Americas,Arrived 2016,2963,2011-2016
Not in the labour force,Australia,Sub-Saharan Africa,Arrived 2006,2741,2006-2010
Not in the labour force,Australia,Sub-Saharan Africa,Arrived 2007,2999,2006-2010
Not in the labour force,Australia,Sub-Saharan Africa,Arrived 2008,3332,2006-2010
Not in the labour force,Australia,Sub-Saharan Africa,Arrived 2009,2787,2006-2010
Not in the labour force,Australia,Sub-Saharan Africa,Arrived 2010,2313,2006-2010
Not in the labour force,Australia,Sub-Saharan Africa,Arrived 2011,2202,2011-2016
Not in the labour force,Australia,Sub-Saharan Africa,Arrived 2012,2139,2011-2016
Not in the labour force,Australia,Sub-Saharan Africa,Arrived 2013,2147,2011-2016
Not in the labour force,Australia,Sub-Saharan Africa,Arrived 2014,2112,2011-2016
Not in the labour force,Australia,Sub-Saharan Africa,Arrived 2015,2565,2011-2016
Not in the labour force,Australia,Sub-Saharan Africa,Arrived 2016,2153,2011-2016
