LOC,BP,CITP,COUNT
Queensland,Oceania and Antarctica,Australian,1592922
Queensland,Oceania and Antarctica,Not Australian,91489
Queensland,North-West Europe,Australian,90919
Queensland,North-West Europe,Not Australian,44963
Queensland,Southern and Eastern Europe,Australian,18321
Queensland,Southern and Eastern Europe,Not Australian,5977
Queensland,North Africa and the Middle East,Australian,6848
Queensland,North Africa and the Middle East,Not Australian,2725
Queensland,South-East Asia,Australian,37468
Queensland,South-East Asia,Not Australian,18789
Queensland,North-East Asia,Australian,20523
Queensland,North-East Asia,Not Australian,31249
Queensland,Southern and Central Asia,Australian,21816
Queensland,Southern and Central Asia,Not Australian,23992
Queensland,Americas,Australian,16013
Queensland,Americas,Not Australian,14119
Queensland,Sub-Saharan Africa,Australian,29498
Queensland,Sub-Saharan Africa,Not Australian,10312
