NUM_EMP,LOC,BP,YEAR,COUNT,YR_AR
1-19 employees,Queensland,Oceania and Antarctica,Arrived 2006,137,2006-2010
1-19 employees,Queensland,Oceania and Antarctica,Arrived 2007,133,2006-2010
1-19 employees,Queensland,Oceania and Antarctica,Arrived 2008,137,2006-2010
1-19 employees,Queensland,Oceania and Antarctica,Arrived 2009,94,2006-2010
1-19 employees,Queensland,Oceania and Antarctica,Arrived 2010,78,2006-2010
1-19 employees,Queensland,Oceania and Antarctica,Arrived 2011,77,2011-2016
1-19 employees,Queensland,Oceania and Antarctica,Arrived 2012,106,2011-2016
1-19 employees,Queensland,Oceania and Antarctica,Arrived 2013,51,2011-2016
1-19 employees,Queensland,Oceania and Antarctica,Arrived 2014,41,2011-2016
1-19 employees,Queensland,Oceania and Antarctica,Arrived 2015,24,2011-2016
1-19 employees,Queensland,Oceania and Antarctica,Arrived 2016,14,2011-2016
1-19 employees,Queensland,North-West Europe,Arrived 2006,181,2006-2010
1-19 employees,Queensland,North-West Europe,Arrived 2007,173,2006-2010
1-19 employees,Queensland,North-West Europe,Arrived 2008,157,2006-2010
1-19 employees,Queensland,North-West Europe,Arrived 2009,133,2006-2010
1-19 employees,Queensland,North-West Europe,Arrived 2010,96,2006-2010
1-19 employees,Queensland,North-West Europe,Arrived 2011,100,2011-2016
1-19 employees,Queensland,North-West Europe,Arrived 2012,61,2011-2016
1-19 employees,Queensland,North-West Europe,Arrived 2013,52,2011-2016
1-19 employees,Queensland,North-West Europe,Arrived 2014,38,2011-2016
1-19 employees,Queensland,North-West Europe,Arrived 2015,21,2011-2016
1-19 employees,Queensland,North-West Europe,Arrived 2016,10,2011-2016
1-19 employees,Queensland,Southern and Eastern Europe,Arrived 2006,29,2006-2010
1-19 employees,Queensland,Southern and Eastern Europe,Arrived 2007,24,2006-2010
1-19 employees,Queensland,Southern and Eastern Europe,Arrived 2008,24,2006-2010
1-19 employees,Queensland,Southern and Eastern Europe,Arrived 2009,24,2006-2010
1-19 employees,Queensland,Southern and Eastern Europe,Arrived 2010,13,2006-2010
1-19 employees,Queensland,Southern and Eastern Europe,Arrived 2011,26,2011-2016
1-19 employees,Queensland,Southern and Eastern Europe,Arrived 2012,16,2011-2016
1-19 employees,Queensland,Southern and Eastern Europe,Arrived 2013,15,2011-2016
1-19 employees,Queensland,Southern and Eastern Europe,Arrived 2014,14,2011-2016
1-19 employees,Queensland,Southern and Eastern Europe,Arrived 2015,10,2011-2016
1-19 employees,Queensland,Southern and Eastern Europe,Arrived 2016,0,2011-2016
1-19 employees,Queensland,North Africa and the Middle East,Arrived 2006,29,2006-2010
1-19 employees,Queensland,North Africa and the Middle East,Arrived 2007,30,2006-2010
1-19 employees,Queensland,North Africa and the Middle East,Arrived 2008,27,2006-2010
1-19 employees,Queensland,North Africa and the Middle East,Arrived 2009,19,2006-2010
1-19 employees,Queensland,North Africa and the Middle East,Arrived 2010,25,2006-2010
1-19 employees,Queensland,North Africa and the Middle East,Arrived 2011,15,2011-2016
1-19 employees,Queensland,North Africa and the Middle East,Arrived 2012,29,2011-2016
1-19 employees,Queensland,North Africa and the Middle East,Arrived 2013,17,2011-2016
1-19 employees,Queensland,North Africa and the Middle East,Arrived 2014,4,2011-2016
1-19 employees,Queensland,North Africa and the Middle East,Arrived 2015,3,2011-2016
1-19 employees,Queensland,North Africa and the Middle East,Arrived 2016,0,2011-2016
1-19 employees,Queensland,South-East Asia,Arrived 2006,79,2006-2010
1-19 employees,Queensland,South-East Asia,Arrived 2007,76,2006-2010
1-19 employees,Queensland,South-East Asia,Arrived 2008,100,2006-2010
1-19 employees,Queensland,South-East Asia,Arrived 2009,70,2006-2010
1-19 employees,Queensland,South-East Asia,Arrived 2010,43,2006-2010
1-19 employees,Queensland,South-East Asia,Arrived 2011,36,2011-2016
1-19 employees,Queensland,South-East Asia,Arrived 2012,35,2011-2016
1-19 employees,Queensland,South-East Asia,Arrived 2013,29,2011-2016
1-19 employees,Queensland,South-East Asia,Arrived 2014,11,2011-2016
1-19 employees,Queensland,South-East Asia,Arrived 2015,14,2011-2016
1-19 employees,Queensland,South-East Asia,Arrived 2016,3,2011-2016
1-19 employees,Queensland,North-East Asia,Arrived 2006,209,2006-2010
1-19 employees,Queensland,North-East Asia,Arrived 2007,224,2006-2010
1-19 employees,Queensland,North-East Asia,Arrived 2008,219,2006-2010
1-19 employees,Queensland,North-East Asia,Arrived 2009,163,2006-2010
1-19 employees,Queensland,North-East Asia,Arrived 2010,136,2006-2010
1-19 employees,Queensland,North-East Asia,Arrived 2011,95,2011-2016
1-19 employees,Queensland,North-East Asia,Arrived 2012,109,2011-2016
1-19 employees,Queensland,North-East Asia,Arrived 2013,90,2011-2016
1-19 employees,Queensland,North-East Asia,Arrived 2014,61,2011-2016
1-19 employees,Queensland,North-East Asia,Arrived 2015,32,2011-2016
1-19 employees,Queensland,North-East Asia,Arrived 2016,12,2011-2016
1-19 employees,Queensland,Southern and Central Asia,Arrived 2006,149,2006-2010
1-19 employees,Queensland,Southern and Central Asia,Arrived 2007,177,2006-2010
1-19 employees,Queensland,Southern and Central Asia,Arrived 2008,244,2006-2010
1-19 employees,Queensland,Southern and Central Asia,Arrived 2009,153,2006-2010
1-19 employees,Queensland,Southern and Central Asia,Arrived 2010,75,2006-2010
1-19 employees,Queensland,Southern and Central Asia,Arrived 2011,59,2011-2016
1-19 employees,Queensland,Southern and Central Asia,Arrived 2012,68,2011-2016
1-19 employees,Queensland,Southern and Central Asia,Arrived 2013,46,2011-2016
1-19 employees,Queensland,Southern and Central Asia,Arrived 2014,29,2011-2016
1-19 employees,Queensland,Southern and Central Asia,Arrived 2015,15,2011-2016
1-19 employees,Queensland,Southern and Central Asia,Arrived 2016,7,2011-2016
1-19 employees,Queensland,Americas,Arrived 2006,37,2006-2010
1-19 employees,Queensland,Americas,Arrived 2007,51,2006-2010
1-19 employees,Queensland,Americas,Arrived 2008,45,2006-2010
1-19 employees,Queensland,Americas,Arrived 2009,23,2006-2010
1-19 employees,Queensland,Americas,Arrived 2010,30,2006-2010
1-19 employees,Queensland,Americas,Arrived 2011,16,2011-2016
1-19 employees,Queensland,Americas,Arrived 2012,19,2011-2016
1-19 employees,Queensland,Americas,Arrived 2013,12,2011-2016
1-19 employees,Queensland,Americas,Arrived 2014,21,2011-2016
1-19 employees,Queensland,Americas,Arrived 2015,6,2011-2016
1-19 employees,Queensland,Americas,Arrived 2016,6,2011-2016
1-19 employees,Queensland,Sub-Saharan Africa,Arrived 2006,80,2006-2010
1-19 employees,Queensland,Sub-Saharan Africa,Arrived 2007,117,2006-2010
1-19 employees,Queensland,Sub-Saharan Africa,Arrived 2008,145,2006-2010
1-19 employees,Queensland,Sub-Saharan Africa,Arrived 2009,88,2006-2010
1-19 employees,Queensland,Sub-Saharan Africa,Arrived 2010,69,2006-2010
1-19 employees,Queensland,Sub-Saharan Africa,Arrived 2011,48,2011-2016
1-19 employees,Queensland,Sub-Saharan Africa,Arrived 2012,33,2011-2016
1-19 employees,Queensland,Sub-Saharan Africa,Arrived 2013,36,2011-2016
1-19 employees,Queensland,Sub-Saharan Africa,Arrived 2014,18,2011-2016
1-19 employees,Queensland,Sub-Saharan Africa,Arrived 2015,17,2011-2016
1-19 employees,Queensland,Sub-Saharan Africa,Arrived 2016,8,2011-2016
20 or more employees,Queensland,Oceania and Antarctica,Arrived 2006,7,2006-2010
20 or more employees,Queensland,Oceania and Antarctica,Arrived 2007,14,2006-2010
20 or more employees,Queensland,Oceania and Antarctica,Arrived 2008,7,2006-2010
20 or more employees,Queensland,Oceania and Antarctica,Arrived 2009,10,2006-2010
20 or more employees,Queensland,Oceania and Antarctica,Arrived 2010,7,2006-2010
20 or more employees,Queensland,Oceania and Antarctica,Arrived 2011,14,2011-2016
20 or more employees,Queensland,Oceania and Antarctica,Arrived 2012,13,2011-2016
20 or more employees,Queensland,Oceania and Antarctica,Arrived 2013,3,2011-2016
20 or more employees,Queensland,Oceania and Antarctica,Arrived 2014,0,2011-2016
20 or more employees,Queensland,Oceania and Antarctica,Arrived 2015,12,2011-2016
20 or more employees,Queensland,Oceania and Antarctica,Arrived 2016,4,2011-2016
20 or more employees,Queensland,North-West Europe,Arrived 2006,23,2006-2010
20 or more employees,Queensland,North-West Europe,Arrived 2007,17,2006-2010
20 or more employees,Queensland,North-West Europe,Arrived 2008,17,2006-2010
20 or more employees,Queensland,North-West Europe,Arrived 2009,11,2006-2010
20 or more employees,Queensland,North-West Europe,Arrived 2010,9,2006-2010
20 or more employees,Queensland,North-West Europe,Arrived 2011,13,2011-2016
20 or more employees,Queensland,North-West Europe,Arrived 2012,5,2011-2016
20 or more employees,Queensland,North-West Europe,Arrived 2013,3,2011-2016
20 or more employees,Queensland,North-West Europe,Arrived 2014,3,2011-2016
20 or more employees,Queensland,North-West Europe,Arrived 2015,3,2011-2016
20 or more employees,Queensland,North-West Europe,Arrived 2016,0,2011-2016
20 or more employees,Queensland,Southern and Eastern Europe,Arrived 2006,0,2006-2010
20 or more employees,Queensland,Southern and Eastern Europe,Arrived 2007,0,2006-2010
20 or more employees,Queensland,Southern and Eastern Europe,Arrived 2008,0,2006-2010
20 or more employees,Queensland,Southern and Eastern Europe,Arrived 2009,0,2006-2010
20 or more employees,Queensland,Southern and Eastern Europe,Arrived 2010,0,2006-2010
20 or more employees,Queensland,Southern and Eastern Europe,Arrived 2011,0,2011-2016
20 or more employees,Queensland,Southern and Eastern Europe,Arrived 2012,0,2011-2016
20 or more employees,Queensland,Southern and Eastern Europe,Arrived 2013,0,2011-2016
20 or more employees,Queensland,Southern and Eastern Europe,Arrived 2014,0,2011-2016
20 or more employees,Queensland,Southern and Eastern Europe,Arrived 2015,0,2011-2016
20 or more employees,Queensland,Southern and Eastern Europe,Arrived 2016,0,2011-2016
20 or more employees,Queensland,North Africa and the Middle East,Arrived 2006,3,2006-2010
20 or more employees,Queensland,North Africa and the Middle East,Arrived 2007,0,2006-2010
20 or more employees,Queensland,North Africa and the Middle East,Arrived 2008,3,2006-2010
20 or more employees,Queensland,North Africa and the Middle East,Arrived 2009,0,2006-2010
20 or more employees,Queensland,North Africa and the Middle East,Arrived 2010,0,2006-2010
20 or more employees,Queensland,North Africa and the Middle East,Arrived 2011,0,2011-2016
20 or more employees,Queensland,North Africa and the Middle East,Arrived 2012,0,2011-2016
20 or more employees,Queensland,North Africa and the Middle East,Arrived 2013,0,2011-2016
20 or more employees,Queensland,North Africa and the Middle East,Arrived 2014,0,2011-2016
20 or more employees,Queensland,North Africa and the Middle East,Arrived 2015,0,2011-2016
20 or more employees,Queensland,North Africa and the Middle East,Arrived 2016,0,2011-2016
20 or more employees,Queensland,South-East Asia,Arrived 2006,0,2006-2010
20 or more employees,Queensland,South-East Asia,Arrived 2007,8,2006-2010
20 or more employees,Queensland,South-East Asia,Arrived 2008,5,2006-2010
20 or more employees,Queensland,South-East Asia,Arrived 2009,3,2006-2010
20 or more employees,Queensland,South-East Asia,Arrived 2010,5,2006-2010
20 or more employees,Queensland,South-East Asia,Arrived 2011,0,2011-2016
20 or more employees,Queensland,South-East Asia,Arrived 2012,5,2011-2016
20 or more employees,Queensland,South-East Asia,Arrived 2013,5,2011-2016
20 or more employees,Queensland,South-East Asia,Arrived 2014,0,2011-2016
20 or more employees,Queensland,South-East Asia,Arrived 2015,0,2011-2016
20 or more employees,Queensland,South-East Asia,Arrived 2016,0,2011-2016
20 or more employees,Queensland,North-East Asia,Arrived 2006,11,2006-2010
20 or more employees,Queensland,North-East Asia,Arrived 2007,9,2006-2010
20 or more employees,Queensland,North-East Asia,Arrived 2008,3,2006-2010
20 or more employees,Queensland,North-East Asia,Arrived 2009,5,2006-2010
20 or more employees,Queensland,North-East Asia,Arrived 2010,5,2006-2010
20 or more employees,Queensland,North-East Asia,Arrived 2011,11,2011-2016
20 or more employees,Queensland,North-East Asia,Arrived 2012,3,2011-2016
20 or more employees,Queensland,North-East Asia,Arrived 2013,10,2011-2016
20 or more employees,Queensland,North-East Asia,Arrived 2014,0,2011-2016
20 or more employees,Queensland,North-East Asia,Arrived 2015,11,2011-2016
20 or more employees,Queensland,North-East Asia,Arrived 2016,12,2011-2016
20 or more employees,Queensland,Southern and Central Asia,Arrived 2006,3,2006-2010
20 or more employees,Queensland,Southern and Central Asia,Arrived 2007,14,2006-2010
20 or more employees,Queensland,Southern and Central Asia,Arrived 2008,12,2006-2010
20 or more employees,Queensland,Southern and Central Asia,Arrived 2009,12,2006-2010
20 or more employees,Queensland,Southern and Central Asia,Arrived 2010,5,2006-2010
20 or more employees,Queensland,Southern and Central Asia,Arrived 2011,6,2011-2016
20 or more employees,Queensland,Southern and Central Asia,Arrived 2012,6,2011-2016
20 or more employees,Queensland,Southern and Central Asia,Arrived 2013,8,2011-2016
20 or more employees,Queensland,Southern and Central Asia,Arrived 2014,0,2011-2016
20 or more employees,Queensland,Southern and Central Asia,Arrived 2015,0,2011-2016
20 or more employees,Queensland,Southern and Central Asia,Arrived 2016,0,2011-2016
20 or more employees,Queensland,Americas,Arrived 2006,0,2006-2010
20 or more employees,Queensland,Americas,Arrived 2007,7,2006-2010
20 or more employees,Queensland,Americas,Arrived 2008,4,2006-2010
20 or more employees,Queensland,Americas,Arrived 2009,4,2006-2010
20 or more employees,Queensland,Americas,Arrived 2010,0,2006-2010
20 or more employees,Queensland,Americas,Arrived 2011,0,2011-2016
20 or more employees,Queensland,Americas,Arrived 2012,4,2011-2016
20 or more employees,Queensland,Americas,Arrived 2013,0,2011-2016
20 or more employees,Queensland,Americas,Arrived 2014,0,2011-2016
20 or more employees,Queensland,Americas,Arrived 2015,3,2011-2016
20 or more employees,Queensland,Americas,Arrived 2016,0,2011-2016
20 or more employees,Queensland,Sub-Saharan Africa,Arrived 2006,6,2006-2010
20 or more employees,Queensland,Sub-Saharan Africa,Arrived 2007,8,2006-2010
20 or more employees,Queensland,Sub-Saharan Africa,Arrived 2008,0,2006-2010
20 or more employees,Queensland,Sub-Saharan Africa,Arrived 2009,8,2006-2010
20 or more employees,Queensland,Sub-Saharan Africa,Arrived 2010,8,2006-2010
20 or more employees,Queensland,Sub-Saharan Africa,Arrived 2011,3,2011-2016
20 or more employees,Queensland,Sub-Saharan Africa,Arrived 2012,0,2011-2016
20 or more employees,Queensland,Sub-Saharan Africa,Arrived 2013,0,2011-2016
20 or more employees,Queensland,Sub-Saharan Africa,Arrived 2014,0,2011-2016
20 or more employees,Queensland,Sub-Saharan Africa,Arrived 2015,0,2011-2016
20 or more employees,Queensland,Sub-Saharan Africa,Arrived 2016,0,2011-2016
