Australian Bureau of Statistics

"2016 Census - Counting Persons, Place of Usual Residence (MB)"
"Australia (UR) by BPLP - 1 Digit Level and VOLWP Voluntary Work for an Organisation or Group"
"Counting: Persons Place of Usual Residence"

Filters:
"Default Summation","Persons Place of Usual Residence"

"Counting","Australia (UR)","BPLP - 1 Digit Level","VOLWP Voluntary Work for an Organisation or Group","Count",
"Persons Place of Usual Residence","Australia","Oceania and Antarctica","Not a volunteer",9366074
"Persons Place of Usual Residence","Australia","Oceania and Antarctica","Volunteer",2755155
"Persons Place of Usual Residence","Australia","North-West Europe","Not a volunteer",1053201
"Persons Place of Usual Residence","Australia","North-West Europe","Volunteer",274502
"Persons Place of Usual Residence","Australia","Southern and Eastern Europe","Not a volunteer",566498
"Persons Place of Usual Residence","Australia","Southern and Eastern Europe","Volunteer",59264
"Persons Place of Usual Residence","Australia","North Africa and the Middle East","Not a volunteer",292014
"Persons Place of Usual Residence","Australia","North Africa and the Middle East","Volunteer",40281
"Persons Place of Usual Residence","Australia","South-East Asia","Not a volunteer",679060
"Persons Place of Usual Residence","Australia","South-East Asia","Volunteer",122167
"Persons Place of Usual Residence","Australia","North-East Asia","Not a volunteer",643917
"Persons Place of Usual Residence","Australia","North-East Asia","Volunteer",98099
"Persons Place of Usual Residence","Australia","Southern and Central Asia","Not a volunteer",600172
"Persons Place of Usual Residence","Australia","Southern and Central Asia","Volunteer",101800
"Persons Place of Usual Residence","Australia","Americas","Not a volunteer",185439
"Persons Place of Usual Residence","Australia","Americas","Volunteer",56195
"Persons Place of Usual Residence","Australia","Sub-Saharan Africa","Not a volunteer",219185
"Persons Place of Usual Residence","Australia","Sub-Saharan Africa","Volunteer",65719
"Persons Place of Usual Residence","Australia","Total","Not a volunteer",13605574
"Persons Place of Usual Residence","Australia","Total","Volunteer",3573171
"Persons Place of Usual Residence","Total","Oceania and Antarctica","Not a volunteer",9366074
"Persons Place of Usual Residence","Total","Oceania and Antarctica","Volunteer",2755155
"Persons Place of Usual Residence","Total","North-West Europe","Not a volunteer",1053201
"Persons Place of Usual Residence","Total","North-West Europe","Volunteer",274502
"Persons Place of Usual Residence","Total","Southern and Eastern Europe","Not a volunteer",566498
"Persons Place of Usual Residence","Total","Southern and Eastern Europe","Volunteer",59264
"Persons Place of Usual Residence","Total","North Africa and the Middle East","Not a volunteer",292014
"Persons Place of Usual Residence","Total","North Africa and the Middle East","Volunteer",40281
"Persons Place of Usual Residence","Total","South-East Asia","Not a volunteer",679060
"Persons Place of Usual Residence","Total","South-East Asia","Volunteer",122167
"Persons Place of Usual Residence","Total","North-East Asia","Not a volunteer",643917
"Persons Place of Usual Residence","Total","North-East Asia","Volunteer",98099
"Persons Place of Usual Residence","Total","Southern and Central Asia","Not a volunteer",600172
"Persons Place of Usual Residence","Total","Southern and Central Asia","Volunteer",101800
"Persons Place of Usual Residence","Total","Americas","Not a volunteer",185439
"Persons Place of Usual Residence","Total","Americas","Volunteer",56195
"Persons Place of Usual Residence","Total","Sub-Saharan Africa","Not a volunteer",219185
"Persons Place of Usual Residence","Total","Sub-Saharan Africa","Volunteer",65719
"Persons Place of Usual Residence","Total","Total","Not a volunteer",13605574
"Persons Place of Usual Residence","Total","Total","Volunteer",3573171

"Data Source: Census of Population and Housing, 2016, TableBuilder"

"INFO","Cells in this table have been randomly adjusted to avoid the release of confidential data. No reliance should be placed on small cells."


"Copyright Commonwealth of Australia, 2018, see abs.gov.au/copyright"
"ABS data licensed under Creative Commons, see abs.gov.au/ccby"
