,LGA_NAME_2016,LGA_CODE_2016,NonProf_Flag,Year,Pct_FTE_LGA,LGA_Count_Suppressed,LGA_Exports_sup,LGA_Turnover_sup,LGA_Wages_sup,LGA_PAYG_tax_withheld_sup,LGA_FTE_sup,LGA_Num_employees_sup
1,Aurukun (S),30250,For_profit,2018_2019,30.93475034,33.4,0,s,s,s,6.389648071,20.6552437
2,Aurukun (S),30250,Non_Profit,2018_2019,33.18419947,5.2,0,s,s,s,24.70552686,74.4496696
3,Balonne (S),30300,For_profit,2018_2019,43.6905474,2425.1,s,467759116.4,49547626.7,10133789.8,878.8708678,2011.581269
4,Balonne (S),30300,Non_Profit,2018_2019,45.12073345,74.4,0,s,s,s,23.04498578,51.0740496
5,Balonne (S),30300,Unknown,2018_2019,55.67649225,4.3,0,s,s,s,5.390371934,9.681594
6,Banana (S),30370,For_profit,2018_2019,58.21525293,6297.4,s,1447398434,s,s,2638.980251,4533.142292
7,Banana (S),30370,Non_Profit,2018_2019,31.64352081,141.6,s,21769831.33,s,s,104.9988588,331.8178766
8,Barcaldine (R),30410,For_profit,2018_2019,56.6826376,1751.1,s,323815223.5,36286278.65,s,648.9140366,1144.819762
9,Barcaldine (R),30410,Non_Profit,2018_2019,s,s,s,s,s,s,s,s
10,Barcaldine (R),30410,Unknown,2018_2019,s,s,s,s,s,s,s,s
11,Barcoo (S),30450,For_profit,2018_2019,70.69326889,163.7,s,s,s,s,86.83748456,122.8369913
12,Barcoo (S),30450,Non_Profit,2018_2019,s,s,s,s,s,s,s,s
13,Barcoo (S),30450,Unknown,2018_2019,s,s,s,s,s,s,s,s
14,Blackall-Tambo (R),30760,For_profit,2018_2019,52.79044934,1180,s,191844027.6,18682852.34,3684943.055,310.4078421,588
15,Blackall-Tambo (R),30760,Non_Profit,2018_2019,s,s,s,s,s,s,s,s
16,Blackall-Tambo (R),30760,Unknown,2018_2019,s,s,s,s,s,s,s,s
17,Boulia (S),30900,For_profit,2018_2019,68.7549097,172.1,s,s,s,s,174.5569941,253.8829516
18,Boulia (S),30900,Non_Profit,2018_2019,49.53379976,9.6,s,s,s,s,3.027659297,6.1123098
19,Brisbane (C),31000,For_profit,2018_2019,57.57781694,500834.9,19926962918,2.25E+11,44580190989,9536973341,478013.448,830204.1886
20,Brisbane (C),31000,Non_Profit,2018_2019,56.76672106,6310,s,s,s,s,81824.68352,144141.9938
21,Brisbane (C),31000,Unknown,2018_2019,73.994569,20.7,s,s,s,s,36.9972845,50
22,Bulloo (S),31750,For_profit,2018_2019,61.78652141,164.7,s,s,s,s,158.8439801,257.0851643
23,Bulloo (S),31750,Non_Profit,2018_2019,25.18446615,3.9,s,s,s,s,0.397596359,1.5787365
24,Bundaberg (R),31820,For_profit,2018_2019,52.10029099,27690.9,144691706,5336771307,928642939.9,194635641.3,14881.61238,28563.39589
25,Bundaberg (R),31820,Non_Profit,2018_2019,52.89834944,464.6,s,s,s,s,1973.497858,3730.736174
26,Bundaberg (R),31820,Unknown,2018_2019,42.97496003,19.6,s,s,s,s,20.48071543,47.6573228
27,Burdekin (S),31900,For_profit,2018_2019,51.74398325,7086.5,s,1312061720,205701356.3,42412909.49,3376.609966,6525.60888
28,Burdekin (S),31900,Non_Profit,2018_2019,52.71178359,110.3,s,50300543.23,s,s,449.8997692,853.5089094
29,Burdekin (S),31900,Unknown,2018_2019,41.22254285,17,0,12768520.95,s,s,12.79153725,31.030442
30,Burke (S),31950,For_profit,2018_2019,58.09627383,35.8,s,s,s,s,42.8416592,73.7425249
31,Burke (S),31950,Non_Profit,2018_2019,36.46524,3.5,s,s,s,s,3.503276868,9.607168
32,Cairns (R),32080,For_profit,2018_2019,54.67569058,59659.9,s,11467973899,2095242758,462586899.5,33214.25979,60747.76456
33,Cairns (R),32080,Non_Profit,2018_2019,54.91186854,830.3,s,s,s,s,4796.118437,8734.210954
34,Cairns (R),32080,Unknown,2018_2019,71.22321479,9.9,0,s,s,s,4.410861669,6.1930112
35,Carpentaria (S),32250,For_profit,2018_2019,56.75259392,688.9,s,s,s,s,480.8779013,847.3232113
36,Carpentaria (S),32250,Non_Profit,2018_2019,40.29509892,33.6,s,s,s,s,64.35903543,159.719264
37,Cassowary Coast (R),32260,For_profit,2018_2019,52.60598103,12227.7,s,2136321322,320094521.6,61886282.39,5265.596059,10009.50074
38,Cassowary Coast (R),32260,Non_Profit,2018_2019,53.51841615,223.4,s,s,s,s,809.6024766,1512.754926
39,Cassowary Coast (R),32260,Unknown,2018_2019,67.1948179,17,0,s,s,s,20.25802917,30.1482016
40,Central Highlands (R) (Qld),32270,For_profit,2018_2019,62.59727479,10605.9,s,4803049240,645590532.7,174353261.1,7726.772317,12343.62413
41,Central Highlands (R) (Qld),32270,Non_Profit,2018_2019,40.08531093,186.7,0,s,s,s,193.6568905,483.1118583
42,Central Highlands (R) (Qld),32270,Unknown,2018_2019,68.80146946,11.4,0,s,s,s,8.99131522,13.068493
43,Charters Towers (R),32310,For_profit,2018_2019,52.62439724,3846.4,s,605667232.3,84456945.3,17330659.52,1443.98982,2743.955077
44,Charters Towers (R),32310,Non_Profit,2018_2019,s,s,s,s,s,s,s,s
45,Charters Towers (R),32310,Unknown,2018_2019,s,s,s,s,s,s,s,s
46,Cherbourg (S),32330,For_profit,2018_2019,56.37572766,384.5,s,s,s,s,108.0140203,191.596676
47,Cherbourg (S),32330,Non_Profit,2018_2019,42.02580898,18.6,0,s,s,s,22.50149428,53.5420848
48,Cloncurry (S),32450,For_profit,2018_2019,57.66785762,1110.7,s,s,s,s,931.2506406,1614.852153
49,Cloncurry (S),32450,Non_Profit,2018_2019,s,s,s,s,s,s,s,s
50,Cloncurry (S),32450,Unknown,2018_2019,s,s,s,s,s,s,s,s
51,Cook (S),32500,For_profit,2018_2019,52.20528585,928.1,s,s,s,s,333.6687073,639.1473619
52,Cook (S),32500,Non_Profit,2018_2019,47.09381795,51.9,s,s,s,s,155.2935687,329.7536183
53,Croydon (S),32600,For_profit,2018_2019,54.95045664,111.5,s,s,s,s,50.12573819,91.2198756
54,Croydon (S),32600,Non_Profit,2018_2019,50.76954644,3.2,s,s,s,s,7.857311285,15.476426
55,Diamantina (S),32750,For_profit,2018_2019,56.79351151,129.1,0,s,s,s,88.67914312,156.1430888
56,Diamantina (S),32750,Non_Profit,2018_2019,42.17655263,8.8,0,s,s,s,0.285897642,0.6778592
57,Doomadgee (S),32770,For_profit,2018_2019,55.93183121,135.5,0,s,s,s,159.3602347,284.9186791
58,Doomadgee (S),32770,Non_Profit,2018_2019,33.99332048,14.7,0,s,s,s,12.21073371,35.9209796
59,Douglas (S),32810,For_profit,2018_2019,47.61624476,5936.3,s,s,s,s,2013.766901,4229.15942
60,Douglas (S),32810,Non_Profit,2018_2019,61.07125827,82.8,s,s,s,s,377.0544542,617.400828
61,Etheridge (S),33100,For_profit,2018_2019,54.95045664,307.8,s,s,s,s,138.4173616,251.8948341
62,Etheridge (S),33100,Non_Profit,2018_2019,50.76954644,8.8,s,s,s,s,21.69720261,42.7366485
63,Flinders (S) (Qld),33200,For_profit,2018_2019,60.33300882,801.7,s,178481119.3,s,s,327.8982796,543.4807346
64,Flinders (S) (Qld),33200,Non_Profit,2018_2019,s,s,s,s,s,s,s,s
65,Flinders (S) (Qld),33200,Unknown,2018_2019,s,s,s,s,s,s,s,s
66,Fraser Coast (R),33220,For_profit,2018_2019,58.72787696,28019.2,s,3697750710,719791614.3,153358929.1,11461.51251,19516.30657
67,Fraser Coast (R),33220,Non_Profit,2018_2019,53.03884137,459.6,s,s,s,s,1566.230894,2952.988515
68,Fraser Coast (R),33220,Unknown,2018_2019,95.98255023,3.1,0,s,s,s,0.983471379,1.0246356
69,Gladstone (R),33360,For_profit,2018_2019,63.15222411,17183,s,4918156790,890536908.6,226274057.5,10696.72372,16938
70,Gladstone (R),33360,Non_Profit,2018_2019,50.51882627,281,s,84311548.11,36095014.83,7562650.468,576.924996,1142
71,Gold Coast (C),33430,For_profit,2018_2019,53.76493505,296755.6,606190620.3,48802466415,8316459069,1852538725,126342.4173,234990.3654
72,Gold Coast (C),33430,Non_Profit,2018_2019,52.75707392,1709.8,s,s,s,s,9791.394242,18559.39595
73,Gold Coast (C),33430,Unknown,2018_2019,75.42647856,11.1,s,s,s,s,58.76118111,77.9052426
74,Goondiwindi (R),33610,For_profit,2018_2019,59.33446868,5516.7,s,2869454873,191198827.2,41527175.54,2943.844731,4961.441126
75,Goondiwindi (R),33610,Non_Profit,2018_2019,54.77630451,130.9,s,s,s,s,189.3450604,345.6696505
76,Goondiwindi (R),33610,Unknown,2018_2019,79.12752058,13.6,0,s,s,s,12.05705595,15.2375
77,Gympie (R),33620,For_profit,2018_2019,54.38182832,17952.2,s,2395716350,401353520.1,82268504.52,6705.684341,12330.74457
78,Gympie (R),33620,Non_Profit,2018_2019,45.20996509,285.4,s,s,s,s,766.9705583,1696.463505
79,Gympie (R),33620,Unknown,2018_2019,15.95016114,3.9,0,s,s,s,1.866110396,11.6996335
80,Hinchinbrook (S),33800,For_profit,2018_2019,51.78199495,4481.1,s,601906155,82158155.3,16397833.22,1530.661487,2955.972416
81,Hinchinbrook (S),33800,Non_Profit,2018_2019,66.53618147,79.8,s,s,s,s,349.5637567,525.3739379
82,Hinchinbrook (S),33800,Unknown,2018_2019,26.61713874,7,0,s,s,s,2.123638673,7.9784634
83,Hope Vale (S),33830,For_profit,2018_2019,50.46336027,228.2,s,s,s,s,72.83068962,144.3239
84,Hope Vale (S),33830,Non_Profit,2018_2019,49.24400078,13.2,0,s,s,s,38.58132533,78.34726
85,Ipswich (C),33960,For_profit,2018_2019,62.36629142,42056.3,s,13554364121,2109463187,434863891.7,27237.30464,43673.11895
86,Ipswich (C),33960,Non_Profit,2018_2019,49.18927502,655.1,s,327805446.4,148158014.5,30466966.42,2399.139861,4877.363734
87,Isaac (R),33980,For_profit,2018_2019,61.29576078,6761.7,s,s,266736753.3,69314066.58,3409.200638,5561.88649
88,Isaac (R),33980,Non_Profit,2018_2019,40.07649463,152,0,s,s,s,259.717931,648.0555084
89,Isaac (R),33980,Unknown,2018_2019,69.88870915,3.9,0,s,s,s,3.080923534,4.408328
90,Kowanyama (S),34420,For_profit,2018_2019,30.93475034,24.8,0,s,s,s,4.742003378,15.3290501
91,Kowanyama (S),34420,Non_Profit,2018_2019,33.18419947,3.9,0,s,s,s,18.33492088,55.2519608
92,Livingstone (S),34530,For_profit,2018_2019,52.27830072,11302.8,s,s,342215502.2,s,4796.21262,9174.385078
93,Livingstone (S),34530,Non_Profit,2018_2019,s,s,s,s,s,s,s,s
94,Livingstone (S),34530,Unknown,2018_2019,s,s,s,s,s,s,s,s
95,Lockhart River (S),34570,For_profit,2018_2019,s,s,s,s,s,s,s,s
96,Lockhart River (S),34570,Non_Profit,2018_2019,s,s,s,s,s,s,s,s
97,Lockyer Valley (R),34580,For_profit,2018_2019,52.90518907,11980.3,s,2548195268,421473004.3,86517264.89,6351.566256,12005.56385
98,Lockyer Valley (R),34580,Non_Profit,2018_2019,47.47727165,195.2,s,s,s,s,312.9742885,659.2086647
99,Lockyer Valley (R),34580,Unknown,2018_2019,34.66119,5.6,0,s,s,s,2.4262833,7
100,Logan (C),34590,For_profit,2018_2019,58.56652533,101541.6,236809907.6,23779375459,4095942892,954899447.7,62869.81919,107347.7022
101,Logan (C),34590,Non_Profit,2018_2019,54.70616371,1005.2,s,s,s,s,3772.767457,6896.421174
102,Logan (C),34590,Unknown,2018_2019,48.67926134,5.6,s,s,s,s,7.611893828,15.636831
103,Longreach (R),34710,For_profit,2018_2019,52.9767637,1970.2,s,337329696.1,45654611.51,9889147.973,795.892832,1502.343247
104,Longreach (R),34710,Non_Profit,2018_2019,47.83660223,75,0,s,s,s,98.85004708,206.641029
105,Longreach (R),34710,Unknown,2018_2019,99.9828,3,0,s,s,s,2.951506953,2.9520147
106,Mackay (R),34770,For_profit,2018_2019,64.31736883,40563.2,s,8598972236,2059053655,540158968.8,28391.42223,44142.69854
107,Mackay (R),34770,Non_Profit,2018_2019,50.99142531,535.1,s,322931732.7,s,s,2257.656162,4427.521191
108,Mackay (R),34770,Unknown,2018_2019,59.00791438,25.5,0,12630916.57,s,s,44.6067841,75.5945784
109,Mapoon (S),34830,For_profit,2018_2019,s,s,s,s,s,s,s,s
110,Mapoon (S),34830,Non_Profit,2018_2019,s,s,s,s,s,s,s,s
111,Maranoa (R),34860,For_profit,2018_2019,54.94989985,7164.8,611974.6912,1315884278,152488676.7,32977855.36,2343.961844,4265.634424
112,Maranoa (R),34860,Non_Profit,2018_2019,32.75032798,151.3,0,s,s,s,208.5336401,636.7375626
113,Maranoa (R),34860,Unknown,2018_2019,15.62029203,7,0,s,s,s,2.043275718,13.080906
114,Mareeba (S),34880,For_profit,2018_2019,46.23306122,7912.8,s,1144784692,199670010.2,38844496.82,3483.375069,7534.381192
115,Mareeba (S),34880,Non_Profit,2018_2019,45.50607758,177.5,s,s,s,s,502.9306625,1105.194491
116,Mareeba (S),34880,Unknown,2018_2019,52.29956023,8.7,0,s,s,s,21.9636865,41.9959296
117,McKinlay (S),34800,For_profit,2018_2019,55.00963861,500.4,s,109024157.3,s,s,206.6273898,375.6203368
118,McKinlay (S),34800,Non_Profit,2018_2019,s,s,s,s,s,s,s,s
119,McKinlay (S),34800,Unknown,2018_2019,s,s,s,s,s,s,s,s
120,Moreton Bay (R),35010,For_profit,2018_2019,55.72832907,125093.7,362501355.3,18692322375,3473665497,755772767.2,52952.24521,95018.541
121,Moreton Bay (R),35010,Non_Profit,2018_2019,48.83498129,1206.2,149252.5443,638648572,271544656,54879747.98,4565.07662,9347.964306
122,Mornington (S),35250,For_profit,2018_2019,31.36537846,32.8,0,s,s,s,6.517353179,20.7788125
123,Mornington (S),35250,Non_Profit,2018_2019,33.19407517,4.7,0,s,s,s,22.08562315,66.534835
124,Mount Isa (C),35300,For_profit,2018_2019,72.3075517,4790.2,s,s,679335139.9,201738708.9,6194.276663,8566.56949
125,Mount Isa (C),35300,Non_Profit,2018_2019,49.53379976,177.6,s,s,43885571.37,9753732.683,666.4846469,1345.514881
126,Murweh (S),35600,For_profit,2018_2019,51.06124026,2050,s,s,s,s,585.1618133,1146
127,Murweh (S),35600,Non_Profit,2018_2019,59.41858211,69,0,s,s,s,210.9359665,355
128,Napranum (S),35670,For_profit,2018_2019,73.87959099,160.3,0,s,s,s,354.0656359,479.2468815
129,Napranum (S),35670,Non_Profit,2018_2019,35.32986182,7.9,0,s,s,s,17.97258441,50.870803
130,Noosa (S),35740,For_profit,2018_2019,51.46647257,30891.6,s,3580664488,640659597.7,133620166.2,10236.80339,19890.23705
131,Noosa (S),35740,Non_Profit,2018_2019,s,s,s,s,s,s,s,s
132,Noosa (S),35740,Unknown,2018_2019,s,s,s,s,s,s,s,s
133,North Burnett (R),35760,For_profit,2018_2019,48.77267446,5097,s,866561273.8,121651523.3,21750795.03,2304.609981,4725.207315
134,North Burnett (R),35760,Non_Profit,2018_2019,50.44572478,154.1,0,s,s,s,130.1940863,258.0874531
135,North Burnett (R),35760,Unknown,2018_2019,43.68596588,3.4,0,s,s,s,1.449403453,3.3177782
136,Northern Peninsula Area (R),35780,For_profit,2018_2019,63.24610952,248.9,0,s,s,s,281.0274352,444.3394816
137,Northern Peninsula Area (R),35780,Non_Profit,2018_2019,46.69303733,27.8,0,s,s,s,164.8690036,353.0911952
138,Palm Island (S),35790,For_profit,2018_2019,52.21549821,805,s,88810568.16,s,s,249.5297601,477.8844762
139,Palm Island (S),35790,Non_Profit,2018_2019,s,s,s,s,s,s,s,s
140,Palm Island (S),35790,Unknown,2018_2019,s,s,s,s,s,s,s,s
141,Paroo (S),35800,For_profit,2018_2019,41.943427,891.1,s,77696219.53,7200341.821,1384291.781,129.1352658,307.879625
142,Paroo (S),35800,Non_Profit,2018_2019,70.21913702,43.7,0,s,s,s,110.3499311,157.1507936
143,Paroo (S),35800,Unknown,2018_2019,51.33277,4,0,s,s,s,2.0533108,4
144,Pormpuraaw (S),36070,For_profit,2018_2019,30.93475034,19.8,0,s,s,s,3.782548516,12.2275062
145,Pormpuraaw (S),36070,Non_Profit,2018_2019,33.18419947,3.1,0,s,s,s,14.62519577,44.0727696
146,Quilpie (S),36150,For_profit,2018_2019,59.46527462,556.5,s,s,s,s,183.2565722,308.1740955
147,Quilpie (S),36150,Non_Profit,2018_2019,25.18446615,19.1,0,s,s,s,7.913277471,31.4212635
148,Redland (C),36250,For_profit,2018_2019,55.99626082,54070,s,8055897338,1565470988,351095301.1,23551.46734,42059
149,Redland (C),36250,Non_Profit,2018_2019,51.06697894,464,s,s,s,s,1748.533359,3424
150,Redland (C),36250,Unknown,2018_2019,99.22555,3,0,s,s,s,1.984511,2
151,Richmond (S),36300,For_profit,2018_2019,54.93204782,606,s,s,s,s,223.0241141,406
152,Richmond (S),36300,Non_Profit,2018_2019,41.16575801,15,0,s,s,s,9.056466762,22
153,Rockhampton (R),36370,For_profit,2018_2019,54.47428915,21854.1,s,6494028900,875265528,197918659.7,13000.21719,23864.86799
154,Rockhampton (R),36370,Non_Profit,2018_2019,57.59940474,491.4,s,s,s,s,4320.993492,7501.802339
155,Rockhampton (R),36370,Unknown,2018_2019,50.913575,7.3,0,s,s,s,2.030834366,3.9887876
156,Scenic Rim (R),36510,For_profit,2018_2019,54.28265368,16258.6,s,s,315669865.3,s,5006.920345,9223.794353
157,Scenic Rim (R),36510,Non_Profit,2018_2019,49.78994454,236.6,s,s,s,s,391.2015669,785.7039618
158,Scenic Rim (R),36510,Unknown,2018_2019,39.44541957,3.5,0,s,s,s,2.547356164,6.4579264
159,Somerset (R),36580,For_profit,2018_2019,64.42273289,7850.4,s,s,s,s,3555.004233,5518.244995
160,Somerset (R),36580,Non_Profit,2018_2019,28.08123065,132,0,s,s,s,39.76575347,141.6097249
161,South Burnett (R),36630,For_profit,2018_2019,56.4959336,10700.1,s,1764117610,252125856.1,53631556.36,4295.328738,7602.898943
162,South Burnett (R),36630,Non_Profit,2018_2019,45.04932549,258.2,s,s,s,s,376.3113595,835.3318398
163,South Burnett (R),36630,Unknown,2018_2019,58.8790675,6.8,0,s,s,s,0.007874015,0.0133732
164,Southern Downs (R),36660,For_profit,2018_2019,53.34479841,13424.9,s,2004328509,355835681.7,68938488.45,5750.480393,10779.83339
165,Southern Downs (R),36660,Non_Profit,2018_2019,45.88571019,264.5,s,s,s,s,528.5236104,1151.826153
166,Southern Downs (R),36660,Unknown,2018_2019,51.209875,5,0,s,s,s,2.048395,4
167,Sunshine Coast (R),36720,For_profit,2018_2019,53.28488696,139770.9,s,20962455146,3757430268,816519989.9,57766.70829,108411.0553
168,Sunshine Coast (R),36720,Non_Profit,2018_2019,51.92957293,1206.2,s,988129035.6,365957685.7,73728965.49,6181.017755,11902.69322
169,Sunshine Coast (R),36720,Unknown,2018_2019,56.30780168,8.9,0,s,s,s,29.36512664,52.1510799
170,Tablelands (R),36820,For_profit,2018_2019,47.37629441,9956.9,s,1512990919,240417080.1,46409500.2,4122.659285,8701.945428
171,Tablelands (R),36820,Non_Profit,2018_2019,50.9154551,212.4,s,s,s,s,658.9779494,1294.259176
172,Tablelands (R),36820,Unknown,2018_2019,65.23753482,6,0,s,s,s,28.7101219,44.0085941
173,Toowoomba (R),36910,For_profit,2018_2019,56.3651242,57249.6,s,14624975610,2386621035,545133527.9,35256.27215,62549.79945
174,Toowoomba (R),36910,Non_Profit,2018_2019,53.39102801,898.3,s,595821440.2,329721229,74582624.78,4902.989716,9183.171592
175,Toowoomba (R),36910,Unknown,2018_2019,66.66068327,19.7,0,12307502.27,1075936.206,218500.2355,13.34123717,20.013652
176,Torres (S),36950,For_profit,2018_2019,65.81029347,667.5,s,s,s,s,235.4140888,357.7162119
177,Torres (S),36950,Non_Profit,2018_2019,53.14597652,44.2,s,s,s,s,60.09704975,113.0792088
178,Torres Strait Island (R),36960,For_profit,2018_2019,65.83680411,832.5,s,85107708.45,s,s,291.6203754,442.9443065
179,Torres Strait Island (R),36960,Non_Profit,2018_2019,53.31635204,55,s,8955562.179,s,s,73.48571262,137.829596
180,Townsville (C),37010,For_profit,2018_2019,52.44464159,51520.1,s,10203522931,2089282332,472585198.5,30683.51871,58506.48947
181,Townsville (C),37010,Non_Profit,2018_2019,56.23918988,807.3,s,s,s,s,7152.497001,12717.99437
182,Townsville (C),37010,Unknown,2018_2019,76.37054,3.5,0,s,s,s,2.089079082,2.7354515
183,Weipa (T),37300,For_profit,2018_2019,73.87959099,660.2,0,s,s,s,1458.340568,1973.942395
184,Weipa (T),37300,Non_Profit,2018_2019,35.32986182,32.4,0,s,s,s,74.02624344,209.5288224
185,Western Downs (R),37310,For_profit,2018_2019,57.75088519,15088.3,s,3925065303,400604050.6,87608008.19,6234.718313,10795.88355
186,Western Downs (R),37310,Non_Profit,2018_2019,40.23097787,283.2,s,51065093.61,s,s,260.930549,648.581175
187,Western Downs (R),37310,Unknown,2018_2019,56.64678652,25.6,0,5276886.618,s,s,4.516434014,7.9729748
188,Whitsunday (R),37340,For_profit,2018_2019,49.07433808,14994.7,s,2408660012,478130398.1,98108858.62,7870.061393,16037.01996
189,Whitsunday (R),37340,Non_Profit,2018_2019,50.65718727,212.5,0,53142928.9,20939590.76,3572376.717,390.0882084,770.0550098
190,Winton (S),37400,For_profit,2018_2019,52.46742837,749.4,0,s,s,s,291.5179523,555.6170016
191,Winton (S),37400,Non_Profit,2018_2019,42.17655263,34.4,0,s,s,s,15.74119236,37.3221408
192,Woorabinda (S),37550,For_profit,2018_2019,59.65536322,33,0,s,s,s,79.34163309,133
193,Woorabinda (S),37550,Non_Profit,2018_2019,55.39668919,9,0,s,s,s,17.72694054,32
194,Wujal Wujal (S),37570,For_profit,2018_2019,50.46336027,70,s,s,s,s,22.34848128,44.28655
195,Wujal Wujal (S),37570,Non_Profit,2018_2019,49.24400078,4,0,s,s,s,11.83888319,24.04127
196,Yarrabah (S),37600,For_profit,2018_2019,54.95045664,1001.4,s,s,s,s,450.2515314,819.3772335
197,Yarrabah (S),37600,Non_Profit,2018_2019,50.76954644,28.5,s,s,s,s,70.57784218,139.0160975
