Place,1_149_Male,1_149_Female,150_299_Male,150_299_Female,300_399_Male,300_399_Female,400_499_Male,400_499_Female,500_649_Male,500_649_Female,650_799_Male,650_799_Female,800_999_Male,800_999_Female,1000_1249_Male,1000_1249_Female,1250_1499_Male,1250_1499_Female,1500_1749_Male,1500_1749_Female,1750_1999_Male,1750_1999_Female,2000_2999_Male,2000_2999_Female,3000_Plus_Male,3000_Plus_Female,Total_Male,Total_Female
Australia,308775,492602,560165,783960,686216,933311,598523,955580,555893,869438,633309,793211,797881,756945,876605,711907,621260,468474,546477,376331,402420,236543,670312,291453,448427,148101,7706278,7817857
Queensland,60202,94902,113204,154100,140328,188427,123693,197060,113457,188161,130948,172855,164932,158275,178828,143235,125536,90594,110198,74353,77559,41411,123751,47820,75268,22452,1537903,1573653
