[
  {
    "en": "Heavy Rain and Humid",
    "vi": "Mưa to và ẩm",
    "index": 1
  },
  {
    "en": "Rain and Humid",
    "vi": "Mưa và ẩm",
    "index": 2
  },
  {
    "en": "Possible Drizzle and Humid",
    "vi": "Có thể có mưa phùn và ẩm",
    "index": 3
  },
  {
    "en": "Possible Drizzle",
    "vi": "Có thể có mưa phùn",
    "index": 4
  },
  {
    "en": "Rain and Dangerously Windy",
    "vi": "Gió to gây nguy hiểm kèm mưa",
    "index": 5
  },
  {
    "en": "Heavy Rain and Dangerously Windy",
    "vi": "Mưa lớn và gió to gây nguy hiểm",
    "index": 6
  },
  {
    "en": "Possible Light Rain and Humid",
    "vi": "Có thể có mưa nhẹ và ẩm",
    "index": 7
  },
  {
    "en": "Rain and Windy",
    "vi": "Mưa và gió",
    "index": 8
  },
  {
    "en": "Breezy",
    "vi": "Gió nhẹ",
    "index": 9
  },
  {
    "en": "Overcast",
    "vi": "U ám",
    "index": 10
  },
  {
    "en": "Possible Light Rain",
    "vi": "Có thể có mưa nhỏ",
    "index": 11
  },
  {
    "en": "Heavy Rain and Windy",
    "vi": "Mưa to kèm gió",
    "index": 12
  },
  {
    "en": "Humid and Foggy",
    "vi": "Sương mù và ẩm",
    "index": 13
  },
  {
    "en": "Light Rain and Breezy",
    "vi": "Gió nhẹ và có thể có mưa nhỏ",
    "index": 14
  },
  {
    "en": "Humid and Mostly Cloudy",
    "vi": "Nhiều mây và ẩm",
    "index": 15
  },
  {
    "en": "Light Rain and Humid",
    "vi": "Mưa nhẹ và ẩm",
    "index": 16
  },
  {
    "en": "Light Rain",
    "vi": "Mưa nhỏ",
    "index": 17
  },
  {
    "en": "Drizzle and Humid",
    "vi": "Mưa phùn và ẩm",
    "index": 18
  },
  {
    "en": "Heavy Rain and Breezy",
    "vi": "Mưa lớn kèm gió nhẹ",
    "index": 19
  },
  {
    "en": "Partly Cloudy",
    "vi": "Có mây rải rác",
    "index": 20
  },
  {
    "en": "Heavy Rain",
    "vi": "Mưa nặng hạt",
    "index": 21
  },
  {
    "en": "Breezy and Overcast",
    "vi": "U ám và có gió nhẹ",
    "index": 22
  },
  {
    "en": "Breezy and Partly Cloudy",
    "vi": "Có mây rải rác và gió nhẹ",
    "index": 23
  },
  {
    "en": "Light Rain and Dangerously Windy",
    "vi": "Mưa nhẹ và gió to ",
    "index": 24
  },
  {
    "en": "Mostly Cloudy",
    "vi": "Nhiều mây",
    "index": 25
  },
  {
    "en": "Drizzle",
    "vi": "Mưa phùn",
    "index": 26
  },
  {
    "en": "Foggy",
    "vi": "Sương mù",
    "index": 27
  },
  {
    "en": "Breezy and Mostly Cloudy",
    "vi": "Nhiều mây và gió nhẹ",
    "index": 28
  },
  {
    "en": "Windy and Humid",
    "vi": "Gió và ẩm",
    "index": 29
  },
  {
    "en": "Light Rain and Windy",
    "vi": "Gió và mưa nhỏ ",
    "index": 30
  },
  {
    "en": "Possible Light Rain and Breezy",
    "vi": "Có thể có mưa nhỏ và gió nhẹ",
    "index": 31
  },
  {
    "en": "Clear",
    "vi": "Trời quang",
    "index": 32
  },
  {
    "en": "Rain and Breezy",
    "vi": "Mưa và gió nhẹ",
    "index": 33
  },
  {
    "en": "Humid and Partly Cloudy",
    "vi": "Có mây một vài nơi và ẩm",
    "index": 34
  },
  {
    "en": "Humid",
    "vi": "Ẩm",
    "index": 35
  },
  {
    "en": "Windy and Overcast",
    "vi": "U ám và có gió",
    "index": 36
  },
  {
    "en": "Breezy and Humid",
    "vi": "Ẩm và có gió nhẹ",
    "index": 37
  },
  {
    "en": "Possible Drizzle and Windy",
    "vi": "Có thể có mưa phùn kèm gió",
    "index": 38
  },
  {
    "en": "Windy and Partly Cloudy",
    "vi": "Gió và có mây một vài nơi",
    "index": 39
  },
  {
    "en": "Humid and Overcast",
    "vi": "U ám và ẩm",
    "index": 40
  },
  {
    "en": "Possible Light Rain and Windy",
    "vi": "Có thể có mưa nhẹ kèm gió",
    "index": 41
  },
  {
    "en": "Windy and Mostly Cloudy",
    "vi": "Gió và nhiều mây",
    "index": 42
  },
  {
    "en": "Rain",
    "vi": "Mưa",
    "index": 43
  },
  {
    "en": "Windy",
    "vi": "Trời có gió",
    "index": 44
  },
  {
    "en": "Sunny",
    "vi": "Trời nắng",
    "index": 45
  },
  {
    "en": "Partly sunny",
    "vi": "Có nắng vài nơi",
    "index": 46
  },
  {
    "en": "Sun and rain",
    "vi": "Có nắng và mưa",
    "index": 47
  },
  {
    "en": "Storm",
    "vi": "Bão",
    "index": 48
  },
  {
    "en": "Stormy",
    "vi": "Trời dông, bão",
    "index": 49
  }
]