48.77,54.09092757334305
38.13,52.44443549448925
30.5,51.1251094758851
31.43,50.089806615927905
33.43,49.29439276838043
36.24,48.69729811682356
36.95,48.26120139196153
35.84,47.953634999331896
34.82,47.74698794804432
39.07,47.61819161201902
35.48,47.548256749251806
32.18,47.52175946228597
21.63,47.52633100280799
19.28,47.55218059607151
18.72,47.59166513445693
18.82,47.63891060382912
18.42,47.68948498070618
18.3,47.740119554790844
17.78,47.7884742601474
17.21,47.832942068606435
17.24,47.872487460387795
17.29,47.906514224247076
17.1,47.934758220800674
17.36,47.957201187772796
18.0,47.974002126440865
18.79,47.985443256210175
19.2,47.991887943168095
20.95,47.99374839060635
22.42,47.991461221660465
26.12,47.98546938620125
26.89,47.97620908751964
31.21,47.964100651798525
28.29,47.949542458016325
35.49,47.932907211138634
26.7,47.91453998058856
22.3,47.89475754227446
26.76,47.8738486589241
26.86,47.852075012898844
26.27,47.829672570550564
24.18,47.806853209767745
24.03,47.7838064846078
24.03,47.76070143454576
22.55,47.73768837237373
22.36,47.71490060543373
23.88,47.69245606074462
24.38,47.67045879660818
24.83,47.64900039221633
23.54,47.62816121327079
22.85,47.60801155619543
23.79,47.588612676600505
24.58,47.570017709600116
30.0,47.55227249066942
35.99,47.53541628618405
35.71,47.5194824427887
34.68,47.50449896443126
33.24,47.49048902538617
39.81,47.47747142695052
33.4,47.465461004795394
30.68,47.45446899323311
29.85,47.44450335195258
33.9,47.43556906009912
36.73,47.42766838194637
52.06,47.42080110783388
47.54,47.41496477352781
40.3,47.41015486070362
51.34,47.40636498084858
36.23,47.40358704453237
32.0,47.4018114176947
29.43,47.40102706634258
29.45,47.401221690833786
31.47,47.40238185074091
29.52,47.40449308113921
