72.18,70.47838344937976
67.5,61.53890498423361
70.34,61.99522455183256
72.02,64.14283643588817
78.01,71.63914322192056
75.33,74.89049153942271
75.33,75.71438960718392
82.72,82.60003676926557
91.77,92.35739081621479
85.61,84.26666445100177
86.56,82.53001787612429
91.41,84.88338063265266
96.0,86.43571155850904
103.09,89.23188390400144
103.83,88.77748407299981
96.65,82.63821873554629
97.41,85.05131832878645
110.63,103.24026611576602
76.82,74.58159114744026
60.38,58.3646430812996
61.6,59.60197604025481
59.84,57.37977721448249
51.82,45.81844001750776
39.64,31.02806132017879
40.48,31.57261945173905
53.7,43.21043712420184
64.89,55.33083608568838
76.52,68.91842507119401
80.98,75.57845711512363
94.8,92.27863413189255
93.0,90.94980453509247
95.59,92.63118448999103
106.11,102.31059481929375
104.1,99.22022503073094
111.46,104.927812673775
118.96,111.49242284569485
127.23,117.38660655051831
56.01,42.91922197831336
42.48,28.81240787133678
44.21,30.874151936891153
52.26,40.72265316153095
36.24,29.23768489942626
37.08,34.06327043110765
37.46,35.499028165776544
41.14,38.268564077053476
44.6,41.415959850602846
42.27,36.65047674835559
41.11,33.70263154914494
39.27,31.839842616845427
47.13,38.7006862687399
57.17,50.15678016107284
60.38,55.37460655885843
66.11,62.67910943146623
65.68,63.92705550710512
64.07,62.295662750716474
56.73,53.44541873477016
44.18,39.80732321120414
39.77,33.489167314580165
40.35,32.353832591869136
58.21,49.29303198537338
58.23,47.30690972339829
53.33,39.06987361822221
38.56,23.686269708113237
37.39,23.08797655347305
36.04,23.712680763378437
30.45,22.70457562809303
38.72,35.08603241489041
37.32,35.07431867856796
49.57,46.80396713577868
48.15,45.34667412604713
54.34,49.662051557620686
63.19,57.16378649387971
