73.75,69.52025285435185
76.45,73.75749792278754
78.37,82.2632792542311
83.01,91.89817611271141
85.25,93.39666768403589
87.29,100.35892160640903
88.14,100.6635414073016
88.58,97.28499436610628
88.33,93.76548735355743
88.18,87.19242120789356
79.68,82.71511765074658
77.62,81.66109174673538
71.05,74.85260981395194
65.62,70.22557593670646
60.49,65.41833041022703
59.4,68.37897593055752
60.08,68.89020490953195
58.38,68.35687720232231
53.47,62.29882356447108
50.56,56.03210996788039
50.33,53.84240514406529
49.0,50.804450519849496
49.02,49.696392111666874
48.63,46.0963118403568
50.13,46.93955329403253
50.17,45.95805705711917
50.93,48.133160427398735
52.02,53.70552517643365
52.82,57.087651360996894
55.3,61.38500445177236
57.38,65.17258388551298
57.88,65.54617044003406
56.1,60.83134226221091
53.48,56.02116906280063
54.98,57.9759623077777
56.72,59.42262185625975
59.72,64.04106276938941
57.26,63.22732026244045
56.04,62.64020451177406
57.77,66.95910319685713
58.91,67.737324034559
58.32,66.15986775360713
54.68,60.63346126562516
52.38,56.38851678821889
51.96,54.519771380998634
49.93,51.24547180952604
48.95,48.758278837901784
46.7,43.52364610408183
45.77,42.002110517335645
46.65,42.13547846427502
46.38,42.62859550888921
47.25,47.71865541276767
48.83,52.36062778201754
48.87,53.709695338300705
48.74,54.64756412839851
49.83,55.27844338876844
55.46,59.25754085737695
61.18,63.69326014370093
63.27,65.85891078740124
64.1,66.9307544056847
60.81,65.36033238531644
51.53,57.69363150001419
54.0,60.93192600732471
56.68,65.59075016980402
57.62,65.79748615080484
58.74,65.72767307341446
55.27,60.36207058149732
52.83,56.21882482966528
42.43,44.5503162213163
40.38,41.51080454801398
35.64,35.6946243203211
35.39,32.84940612945393
