<svg width="40" height="40" viewBox="0 0 40 40" fill="none" xmlns="http://www.w3.org/2000/svg">
<g clip-path="url(#clip0)">
<path d="M40 22.5C40 26.2579 38.815 29.74 36.7986 32.5922C35.0122 35.1186 32.5736 37.1507 29.7272 38.4429C28.5593 38.9729 27.3229 39.3786 26.035 39.6429C24.8929 39.8772 23.7107 40 22.5 40C21.2886 40 20.1064 39.8772 18.9643 39.6429C17.6764 39.3786 16.44 38.9729 15.2722 38.4422C12.4264 37.15 9.98784 35.1178 8.20147 32.5922C7.54502 31.6629 6.97579 30.6665 6.50787 29.6157C6.20928 28.9472 5.95218 28.2565 5.73931 27.5464C5.25785 25.9486 5 24.2543 5 22.5C5 12.835 12.835 5 22.5 5C26.5836 5 30.3393 6.39788 33.3164 8.74213C33.8957 9.19781 34.445 9.68925 34.9614 10.2136C38.0771 13.3729 40 17.7121 40 22.5Z" fill="#FFE4BB"/>
<path d="M11.5406 0C5.48783 0 0.5 4.98783 0.5 11.0406C0.5 17.0933 5.48783 22 11.5406 22C17.5933 22 22.5 17.0933 22.5 11.0406C22.5 4.98783 17.5933 0 11.5406 0Z" fill="#FFBE57"/>
<path d="M11.5408 9.82287C10.869 9.82287 10.3231 9.27701 10.3231 8.60516C10.3231 7.93331 10.869 7.38745 11.5408 7.38745C12.2127 7.38745 12.7585 7.93331 12.7585 8.60516H15.194C15.194 7.0197 14.1729 5.6807 12.7585 5.17633V2.5166H11.5408H10.3231V5.17633C8.90879 5.6807 7.8877 7.0197 7.8877 8.60516C7.8877 10.6196 9.52641 12.2583 11.5408 12.2583C12.2127 12.2583 12.7585 12.8042 12.7585 13.476C12.7585 14.1479 12.2127 14.6937 11.5408 14.6937C10.869 14.6937 10.3231 14.1479 10.3231 13.476H7.8877C7.8877 15.0615 8.90879 16.4005 10.3231 16.9048V19.5646H11.5408H12.7585V16.9048C14.1729 16.4005 15.194 15.0615 15.194 13.476C15.194 11.4616 13.5553 9.82287 11.5408 9.82287Z" fill="white"/>
<path d="M34.8119 12.5638L33.3058 13.3015L32.4322 11.5899L32.3349 11.3993L32.2511 11.5961C31.0639 14.3832 28.413 19.5449 23.6712 23.9788C19.0411 28.3085 10.5406 30.7923 1.24303 30.8118L1.40196 29.1831C11.0862 29.1649 19.4033 26.2317 23.8117 21.6316C27.4608 17.8238 29.5835 13.6797 30.6141 11.2321L30.7177 10.9861L30.478 11.1035L28.9166 11.8682L28.1646 10.3949L32.5969 8.2239L34.8119 12.5638Z" fill="#3F404A" stroke="#3F404A" stroke-width="0.2"/>
<path d="M40.2031 25.4878V30.1753L38.4453 31.3472H33.0001L30.75 30.1753V25.4878H40.2031Z" fill="#FFE4BB"/>
<path d="M40.2031 25.4878V30.1753L38.4453 31.3472H35.4375V25.4878H40.2031Z" fill="#FFBE57"/>
<path d="M30.75 30.1753V34.8628L28.9922 36.0347H23.6251L21.375 34.8628V30.1753H30.75Z" fill="#FFBE57"/>
<path d="M30.75 30.1753V34.8628L28.9922 36.0347H26.0625V30.1753H30.75Z" fill="#EDA028"/>
<path d="M40.2031 30.1753V34.8628L38.4453 36.0347H33.0001L30.75 34.8628V30.1753H40.2031Z" fill="#FFBE57"/>
<path d="M40.2031 30.1753V34.8628L38.4453 36.0347H35.4375V30.1753H40.2031Z" fill="#EDA028"/>
<path d="M40.2031 34.8628V39.6284H30.75L28.4062 37.2847L30.75 34.8628H40.2031Z" fill="#FFE4BB"/>
<path d="M35.4375 34.8628H40.2031V39.6284H35.4375V34.8628Z" fill="#FFBE57"/>
<path d="M30.75 34.8628V39.6284H21.375L19.0312 37.2847L21.375 34.8628H30.75Z" fill="#FFE4BB"/>
<path d="M26.0625 34.8628H30.75V39.6284H26.0625V34.8628Z" fill="#FFBE57"/>
<path d="M12 34.8628H21.375V39.6284H12V34.8628Z" fill="#FFE4BB"/>
<path d="M16.6875 34.8628H21.375V39.6284H16.6875V34.8628Z" fill="#FFBE57"/>
</g>
<defs>
<clipPath id="clip0">
<rect width="40" height="40" fill="white"/>
</clipPath>
</defs>
</svg>
