<svg xmlns="http://www.w3.org/2000/svg" width="185" height="28" fill="none" viewBox="0 0 185 28">
    <path fill="#fff" d="M6.064 2.372c2.893 0 5.115.513 6.664 1.54 1.55 1.008 2.324 2.67 2.324 4.984 0 2.333-.784 4.023-2.352 5.068-1.568 1.027-3.808 1.54-6.72 1.54H4.608V22H.24V2.876c.952-.187 1.96-.317 3.024-.392 1.064-.075 1.997-.112 2.8-.112zm.28 3.724c-.317 0-.635.01-.952.028-.299.019-.56.037-.784.056v5.6H5.98c1.512 0 2.65-.205 3.416-.616.765-.41 1.148-1.176 1.148-2.296 0-.541-.103-.99-.308-1.344-.187-.355-.467-.635-.84-.84-.355-.224-.793-.373-1.316-.448-.523-.093-1.101-.14-1.736-.14zm20.511 4.872c-.373-.093-.811-.187-1.316-.28-.504-.112-1.045-.168-1.623-.168-.262 0-.58.028-.953.084-.354.037-.625.084-.812.14V22H17.98V8.056c.746-.261 1.623-.504 2.631-.728 1.027-.243 2.166-.364 3.416-.364.224 0 .495.019.813.056.317.019.634.056.951.112.318.037.635.093.953.168.317.056.587.13.811.224l-.7 3.444zm16.44 3.64c0 1.157-.168 2.221-.504 3.192-.336.952-.822 1.773-1.456 2.464-.635.672-1.4 1.195-2.296 1.568-.878.373-1.867.56-2.968.56-1.083 0-2.072-.187-2.968-.56-.878-.373-1.634-.896-2.268-1.568-.635-.69-1.13-1.512-1.484-2.464-.355-.97-.532-2.035-.532-3.192s.177-2.212.532-3.164c.373-.952.877-1.764 1.512-2.436.653-.672 1.418-1.195 2.296-1.568.896-.373 1.866-.56 2.912-.56 1.064 0 2.034.187 2.912.56.896.373 1.66.896 2.296 1.568.634.672 1.129 1.484 1.484 2.436.354.952.532 2.007.532 3.164zm-4.256 0c0-1.288-.262-2.296-.784-3.024-.504-.747-1.232-1.12-2.184-1.12-.952 0-1.69.373-2.212 1.12-.523.728-.784 1.736-.784 3.024s.26 2.315.784 3.08c.522.747 1.26 1.12 2.212 1.12.952 0 1.68-.373 2.184-1.12.522-.765.784-1.792.784-3.08zm6.115 12.572c-.26 0-.644-.028-1.148-.084-.522-.056-1.008-.159-1.456-.308l.56-3.388c.28.093.542.159.784.196.224.037.514.056.868.056.654 0 1.111-.196 1.372-.588.262-.392.392-.961.392-1.708V7.272h4.172v14.196c0 1.941-.476 3.379-1.428 4.312-.952.933-2.324 1.4-4.116 1.4zM51.09 3.016c0 .765-.252 1.372-.756 1.82-.485.43-1.064.644-1.736.644-.672 0-1.26-.215-1.764-.644-.485-.448-.728-1.055-.728-1.82 0-.765.243-1.363.728-1.792.504-.448 1.092-.672 1.764-.672.672 0 1.251.224 1.736.672.504.43.756 1.027.756 1.792zm2.83 11.732c0-1.307.196-2.445.588-3.416.41-.99.943-1.81 1.596-2.464.654-.653 1.4-1.148 2.24-1.484.859-.336 1.736-.504 2.632-.504 2.09 0 3.743.644 4.956 1.932 1.213 1.27 1.82 3.145 1.82 5.628 0 .243-.01.513-.028.812-.019.28-.037.532-.056.756h-9.464c.093.859.495 1.54 1.204 2.044.71.504 1.661.756 2.856.756.765 0 1.512-.065 2.24-.196.747-.15 1.353-.327 1.82-.532l.56 3.388c-.224.112-.522.224-.896.336-.373.112-.793.205-1.26.28-.448.093-.933.168-1.456.224-.523.056-1.045.084-1.568.084-1.325 0-2.483-.196-3.472-.588-.97-.392-1.782-.924-2.436-1.596-.635-.69-1.11-1.503-1.428-2.436-.299-.933-.448-1.941-.448-3.024zm9.8-1.596c-.018-.355-.084-.7-.196-1.036-.093-.336-.252-.635-.476-.896-.205-.261-.476-.476-.812-.644-.317-.168-.718-.252-1.204-.252-.466 0-.868.084-1.204.252-.336.15-.616.355-.84.616-.224.261-.401.57-.532.924-.112.336-.196.681-.252 1.036h5.516zm6.552 1.484c0-1.064.168-2.063.504-2.996.354-.952.858-1.773 1.512-2.464.653-.71 1.446-1.27 2.38-1.68.933-.41 1.997-.616 3.192-.616.784 0 1.502.075 2.156.224.653.13 1.288.327 1.904.588l-.868 3.332c-.392-.15-.822-.28-1.288-.392-.467-.112-.99-.168-1.568-.168-1.232 0-2.156.383-2.772 1.148-.598.765-.896 1.773-.896 3.024 0 1.325.28 2.352.84 3.08.578.728 1.577 1.092 2.996 1.092.504 0 1.045-.047 1.624-.14.578-.093 1.11-.243 1.596-.448l.588 3.416c-.486.205-1.092.383-1.82.532-.728.15-1.53.224-2.408.224-1.344 0-2.502-.196-3.472-.588-.97-.41-1.774-.961-2.408-1.652-.616-.69-1.074-1.503-1.372-2.436-.28-.952-.42-1.979-.42-3.08zm14.56-11.032l4.172-.672v4.34h5.012v3.472h-5.012v5.18c0 .877.15 1.577.448 2.1.317.523.942.784 1.876.784.448 0 .905-.037 1.372-.112.485-.093.924-.215 1.316-.364l.588 3.248c-.504.205-1.064.383-1.68.532-.616.15-1.372.224-2.268.224-1.139 0-2.082-.15-2.828-.448-.747-.317-1.344-.747-1.792-1.288-.448-.56-.766-1.232-.952-2.016-.168-.784-.252-1.652-.252-2.604V3.604z"/>
    <path fill="#F29B13" d="M110.685 22c-.205-.672-.439-1.363-.7-2.072l-.728-2.128h-7.56c-.243.71-.495 1.419-.756 2.128-.243.71-.467 1.4-.672 2.072h-4.536c.728-2.09 1.419-4.023 2.072-5.796.653-1.773 1.288-3.444 1.904-5.012.635-1.568 1.251-3.052 1.848-4.452.616-1.419 1.251-2.8 1.904-4.144h4.172c.635 1.344 1.26 2.725 1.876 4.144.616 1.4 1.232 2.884 1.848 4.452.635 1.568 1.279 3.239 1.932 5.012.653 1.773 1.344 3.705 2.072 5.796h-4.676zm-5.236-15.008c-.093.28-.233.663-.42 1.148-.187.485-.401 1.045-.644 1.68s-.513 1.335-.812 2.1c-.28.765-.569 1.568-.868 2.408h5.516c-.299-.84-.588-1.643-.868-2.408-.28-.765-.551-1.465-.812-2.1-.243-.635-.457-1.195-.644-1.68-.187-.485-.336-.868-.448-1.148zm21.02 3.976c-.374-.093-.812-.187-1.316-.28-.504-.112-1.046-.168-1.624-.168-.262 0-.579.028-.952.084-.355.037-.626.084-.812.14V22h-4.172V8.056c.746-.261 1.624-.504 2.632-.728 1.026-.243 2.165-.364 3.416-.364.224 0 .494.019.812.056.317.019.634.056.952.112.317.037.634.093.952.168.317.056.588.13.812.224l-.7 3.444zm2.796-7.364l4.172-.672v4.34h5.012v3.472h-5.012v5.18c0 .877.15 1.577.448 2.1.318.523.943.784 1.876.784.448 0 .906-.037 1.372-.112.486-.093.924-.215 1.316-.364l.588 3.248c-.504.205-1.064.383-1.68.532-.616.15-1.372.224-2.268.224-1.138 0-2.081-.15-2.828-.448-.746-.317-1.344-.747-1.792-1.288-.448-.56-.765-1.232-.952-2.016-.168-.784-.252-1.652-.252-2.604V3.604zM141.847 22V.944l4.172-.672v7.056c.28-.093.634-.177 1.064-.252.448-.093.877-.14 1.288-.14 1.194 0 2.184.168 2.968.504.802.317 1.437.775 1.904 1.372.485.597.821 1.307 1.008 2.128.205.821.308 1.736.308 2.744V22h-4.172v-7.812c0-1.344-.178-2.296-.532-2.856-.336-.56-.971-.84-1.904-.84-.374 0-.728.037-1.064.112-.318.056-.607.121-.868.196V22h-4.172zm22.116-2.912c.411 0 .803-.01 1.176-.028.373-.019.672-.047.896-.084v-3.164c-.168-.037-.42-.075-.756-.112-.336-.037-.644-.056-.924-.056-.392 0-.765.028-1.12.084-.336.037-.635.121-.896.252-.261.13-.467.308-.616.532-.149.224-.224.504-.224.84 0 .653.215 1.11.644 1.372.448.243 1.055.364 1.82.364zm-.336-12.208c1.232 0 2.259.14 3.08.42.821.28 1.475.681 1.96 1.204.504.523.859 1.157 1.064 1.904.205.747.308 1.577.308 2.492v8.68c-.597.13-1.428.28-2.492.448-1.064.187-2.352.28-3.864.28-.952 0-1.82-.084-2.604-.252-.765-.168-1.428-.439-1.988-.812-.56-.392-.989-.896-1.288-1.512-.299-.616-.448-1.372-.448-2.268 0-.859.168-1.587.504-2.184.355-.597.821-1.073 1.4-1.428s1.241-.607 1.988-.756c.747-.168 1.521-.252 2.324-.252.541 0 1.017.028 1.428.084.429.037.775.093 1.036.168v-.392c0-.71-.215-1.279-.644-1.708-.429-.43-1.176-.644-2.24-.644-.709 0-1.409.056-2.1.168-.691.093-1.288.233-1.792.42l-.532-3.36c.243-.075.541-.15.896-.224.373-.093.775-.168 1.204-.224.429-.075.877-.13 1.344-.168.485-.056.971-.084 1.456-.084zm14.413 12.124c.765 0 1.306-.075 1.624-.224.317-.15.476-.439.476-.868 0-.336-.206-.625-.616-.868-.411-.261-1.036-.55-1.876-.868-.654-.243-1.251-.495-1.792-.756-.523-.261-.971-.57-1.344-.924-.374-.373-.663-.812-.868-1.316-.206-.504-.308-1.11-.308-1.82 0-1.381.513-2.473 1.54-3.276 1.026-.803 2.436-1.204 4.228-1.204.896 0 1.754.084 2.576.252.821.15 1.474.317 1.96.504l-.728 3.248c-.486-.168-1.018-.317-1.596-.448-.56-.13-1.195-.196-1.904-.196-1.307 0-1.96.364-1.96 1.092 0 .168.028.317.084.448.056.13.168.261.336.392.168.112.392.243.672.392.298.13.672.28 1.12.448.914.336 1.67.672 2.268 1.008.597.317 1.064.672 1.4 1.064.354.373.597.793.728 1.26.149.467.224 1.008.224 1.624 0 1.456-.551 2.557-1.652 3.304-1.083.747-2.623 1.12-4.62 1.12-1.307 0-2.399-.112-3.276-.336-.859-.224-1.456-.41-1.792-.56l.7-3.388c.709.28 1.437.504 2.184.672.746.15 1.484.224 2.212.224z"/>
</svg>
