<svg xmlns="http://www.w3.org/2000/svg" width="698" height="360" fill="none" viewBox="0 0 698 360">
    <g filter="url(#filter0_ddd)">
        <rect width="650" height="312" x="24" y="8" fill="#fff" rx="5"/>
    </g>
    <path fill="#333" d="M262.328 44.05h1.648v10.016h5.536v1.376h-7.184V44.05zm8.684 3.328h1.6v8.064h-1.6v-8.064zm1.728-3.52v1.696h-1.872v-1.696h1.872zm9.745 3.52c-.085.672-.128 1.43-.128 2.272v9.248h-1.616v-4.8c-.245.47-.597.832-1.056 1.088-.459.245-.992.368-1.6.368-.715 0-1.344-.17-1.888-.512-.533-.341-.949-.821-1.248-1.44-.299-.63-.448-1.36-.448-2.192 0-.832.149-1.568.448-2.208.309-.64.736-1.136 1.28-1.488.544-.352 1.163-.528 1.856-.528.64 0 1.2.144 1.68.432.48.288.832.693 1.056 1.216l.16-1.456h1.504zm-4.016 6.896c.725 0 1.285-.25 1.68-.752.405-.512.608-1.227.608-2.144 0-.928-.203-1.643-.608-2.144-.395-.501-.96-.752-1.696-.752-.725 0-1.296.261-1.712.784-.405.512-.608 1.227-.608 2.144 0 .907.203 1.61.608 2.112.416.501.992.752 1.728.752zm13.27-6.896v8.064h-1.568v-1.344c-.256.47-.608.832-1.056 1.088-.448.245-.955.368-1.52.368-1.941 0-2.912-1.077-2.912-3.232v-4.944h1.6v4.928c0 .661.133 1.152.4 1.472.277.31.693.464 1.248.464.661 0 1.189-.213 1.584-.64.405-.427.608-.992.608-1.696v-4.528h1.616zm2.367 0h1.6v8.064h-1.6v-8.064zm1.728-3.52v1.696h-1.872v-1.696h1.872zm9.617-.192v11.776h-1.6v-1.376c-.235.48-.587.848-1.056 1.104-.459.256-.998.384-1.616.384-.694 0-1.312-.176-1.856-.528-.544-.352-.971-.843-1.28-1.472-.299-.64-.448-1.376-.448-2.208 0-.832.149-1.563.448-2.192.298-.63.714-1.115 1.248-1.456.544-.341 1.173-.512 1.888-.512.608 0 1.141.128 1.6.384.469.256.821.619 1.056 1.088v-4.992h1.616zm-3.904 10.608c.736 0 1.301-.25 1.696-.752.405-.512.608-1.227.608-2.144s-.203-1.627-.608-2.128c-.395-.512-.955-.768-1.68-.768-.736 0-1.312.25-1.728.752-.406.501-.608 1.205-.608 2.112 0 .917.202 1.637.608 2.16.416.512.986.768 1.712.768zm6.278-6.896h1.6v8.064h-1.6v-8.064zm1.728-3.52v1.696h-1.872v-1.696h1.872zm4.336 4.768v4.048c0 .555.118.95.352 1.184.246.224.582.336 1.008.336.278 0 .56-.043.848-.128v1.312c-.352.117-.752.176-1.2.176-.832 0-1.477-.235-1.936-.704-.458-.47-.688-1.152-.688-2.048v-4.176h-1.568v-1.248h1.568v-2.016l1.616-.56v2.576h2.224v1.248h-2.224zm11.154-1.248l-3.76 8.72c-.416.95-.938 1.643-1.568 2.08-.618.448-1.386.747-2.304.896l-.352-1.248c.758-.17 1.328-.395 1.712-.672.395-.267.71-.672.944-1.216l.288-.672-3.392-7.888h1.712l2.528 6.24 2.576-6.24h1.616zm16.572-3.328v11.392h-1.488v-7.824l-3.376 7.824h-1.136l-3.424-7.776.016 7.776h-1.488V44.05h1.328l4.144 9.408 4.096-9.408h1.328zm2.522 3.328h1.6v8.064h-1.6v-8.064zm1.728-3.52v1.696h-1.872v-1.696h1.872zm6.529 3.328c1.931 0 2.896 1.077 2.896 3.232v5.024h-1.616v-4.928c0-.704-.139-1.216-.416-1.536-.267-.32-.699-.48-1.296-.48-.683 0-1.232.213-1.648.64-.405.427-.608.997-.608 1.712v4.592h-1.6V49.65c0-.843-.043-1.6-.128-2.272h1.504l.144 1.392c.256-.512.624-.901 1.104-1.168.491-.277 1.045-.416 1.664-.416zm5.196.192h1.6v8.064h-1.6v-8.064zm1.728-3.52v1.696h-1.872v-1.696h1.872zm6.529 3.328c1.931 0 2.896 1.077 2.896 3.232v5.024h-1.616v-4.928c0-.704-.139-1.216-.416-1.536-.267-.32-.699-.48-1.296-.48-.683 0-1.232.213-1.648.64-.405.427-.608.997-.608 1.712v4.592h-1.6V49.65c0-.843-.043-1.6-.128-2.272h1.504l.144 1.392c.256-.512.624-.901 1.104-1.168.491-.277 1.045-.416 1.664-.416zm12.636.192v7.92c0 1.227-.325 2.15-.976 2.768-.64.63-1.594.944-2.864.944-1.226 0-2.298-.267-3.216-.8l.272-1.264c.502.267.982.464 1.44.592.47.128.966.192 1.488.192 1.504 0 2.256-.768 2.256-2.304v-1.744c-.245.47-.602.843-1.072 1.12-.469.267-1.013.4-1.632.4-.704 0-1.333-.165-1.888-.496-.544-.33-.97-.8-1.28-1.408-.298-.608-.448-1.307-.448-2.096 0-.79.15-1.488.448-2.096.31-.608.736-1.077 1.28-1.408.555-.341 1.184-.512 1.888-.512.619 0 1.163.133 1.632.4.47.256.827.624 1.072 1.104v-1.312h1.6zm-3.936 6.528c.726 0 1.296-.24 1.712-.72.416-.48.624-1.141.624-1.984s-.208-1.504-.624-1.984c-.405-.49-.976-.736-1.712-.736-.725 0-1.301.245-1.728.736-.416.48-.624 1.141-.624 1.984 0 .832.208 1.493.624 1.984.427.48 1.003.72 1.728.72zm14.591-6.72c.245 0 .501.037.768.112l-.032 1.472c-.288-.107-.603-.16-.944-.16-.736 0-1.291.224-1.664.672-.363.437-.544.992-.544 1.664v4.496h-1.6V49.65c0-.843-.043-1.6-.129-2.272h1.505l.144 1.456c.213-.533.544-.939.992-1.216.448-.288.949-.432 1.504-.432zm8.723 4.256h-5.76c.053 1.888.912 2.832 2.576 2.832.928 0 1.776-.304 2.544-.912l.496 1.152c-.363.32-.827.576-1.392.768-.555.181-1.115.272-1.68.272-1.291 0-2.304-.368-3.04-1.104-.736-.747-1.104-1.765-1.104-3.056 0-.821.16-1.552.48-2.192.331-.64.789-1.136 1.376-1.488.587-.352 1.253-.528 2-.528 1.088 0 1.941.352 2.56 1.056.629.704.944 1.68.944 2.928v.272zm-3.472-3.056c-.608 0-1.104.181-1.488.544-.384.363-.629.88-.736 1.552h4.272c-.064-.683-.272-1.2-.624-1.552-.352-.363-.827-.544-1.424-.544zm17.729-1.008l-3.072 8.064h-1.472l-2.16-5.84-2.144 5.84h-1.472l-3.072-8.064h1.68l2.192 6.16 2.224-6.16h1.28l2.224 6.16 2.208-6.16h1.584zm8.77 0v8.064h-1.6v-1.376c-.235.48-.587.848-1.056 1.104-.459.256-.997.384-1.616.384-.715 0-1.344-.17-1.888-.512-.533-.341-.949-.821-1.248-1.44-.299-.63-.448-1.36-.448-2.192 0-.832.149-1.568.448-2.208.309-.64.736-1.136 1.28-1.488.544-.352 1.163-.528 1.856-.528.619 0 1.157.133 1.616.4.459.256.811.624 1.056 1.104v-1.312h1.6zM417 54.274c.725 0 1.285-.25 1.68-.752.405-.512.608-1.227.608-2.144 0-.928-.203-1.643-.608-2.144-.395-.501-.96-.752-1.696-.752-.725 0-1.296.261-1.712.784-.405.512-.608 1.227-.608 2.144 0 .907.203 1.61.608 2.112.416.501.992.752 1.728.752zm10.278-7.088c.245 0 .501.037.768.112l-.032 1.472c-.288-.107-.603-.16-.944-.16-.736 0-1.291.224-1.664.672-.363.437-.544.992-.544 1.664v4.496h-1.6V49.65c0-.843-.043-1.6-.128-2.272h1.504l.144 1.456c.213-.533.544-.939.992-1.216.448-.288.949-.432 1.504-.432zm9.22-3.52v11.776h-1.6v-1.376c-.235.48-.587.848-1.056 1.104-.459.256-.998.384-1.616.384-.694 0-1.312-.176-1.856-.528-.544-.352-.971-.843-1.28-1.472-.299-.64-.448-1.376-.448-2.208 0-.832.149-1.563.448-2.192.298-.63.714-1.115 1.248-1.456.544-.341 1.173-.512 1.888-.512.608 0 1.141.128 1.6.384.469.256.821.619 1.056 1.088v-4.992h1.616zm-3.904 10.608c.736 0 1.301-.25 1.696-.752.405-.512.608-1.227.608-2.144s-.203-1.627-.608-2.128c-.395-.512-.955-.768-1.68-.768-.736 0-1.312.25-1.728.752-.406.501-.608 1.205-.608 2.112 0 .917.202 1.637.608 2.16.416.512.986.768 1.712.768zm9.094 1.28c-1.408 0-2.518-.341-3.328-1.024l.48-1.168c.842.64 1.808.96 2.896.96.554 0 .976-.09 1.264-.272.288-.192.432-.459.432-.8 0-.288-.102-.512-.304-.672-.192-.17-.523-.315-.992-.432l-1.344-.32c-.704-.15-1.243-.41-1.616-.784-.363-.384-.544-.859-.544-1.424 0-.725.288-1.312.864-1.76.586-.448 1.36-.672 2.32-.672.576 0 1.12.09 1.632.272.522.181.965.437 1.328.768l-.496 1.136c-.779-.619-1.6-.928-2.464-.928-.523 0-.928.101-1.216.304-.288.192-.432.464-.432.816 0 .277.09.501.272.672.181.17.469.304.864.4l1.376.336c.768.17 1.333.443 1.696.816.373.363.56.837.56 1.424 0 .725-.294 1.301-.88 1.728-.576.416-1.366.624-2.368.624z"/>
    <path stroke="#EEE" d="M110 84.442h542M110 104h542M110 125h542M110 145h542M110 165h542M110 185h542M110 205h542M110 226h542M110 246h542"/>
    <path fill="#696969" d="M127.31 257.727V265h-.881v-6.349h-.043l-1.775 1.179v-.895l1.818-1.208h.881zM95.125 247.099c-.535 0-.99-.145-1.367-.436-.377-.294-.664-.719-.863-1.275-.199-.559-.298-1.234-.298-2.024 0-.786.099-1.458.298-2.014.201-.559.49-.985.866-1.278.38-.296.834-.444 1.364-.444.53 0 .984.148 1.36.444.379.293.668.719.867 1.278.2.556.301 1.228.301 2.014 0 .79-.099 1.465-.298 2.024-.199.556-.486.981-.863 1.275-.376.291-.832.436-1.367.436zm0-.781c.53 0 .942-.256 1.236-.767.293-.511.44-1.24.44-2.187 0-.63-.067-1.166-.202-1.609-.133-.443-.325-.78-.576-1.012-.248-.232-.548-.348-.898-.348-.526 0-.936.259-1.232.778-.296.516-.444 1.246-.444 2.191 0 .629.066 1.164.199 1.605.132.44.323.775.572 1.005.25.229.552.344.905.344zM54.666 205.95v-.724l3.196-5.057h.526v1.122h-.355l-2.415 3.821v.057h4.304v.781h-5.256zm3.424 1.492v-7.273h.838v7.273h-.838zm5.535.099c-.535 0-.99-.145-1.367-.436-.377-.294-.664-.719-.863-1.275-.199-.559-.298-1.234-.298-2.024 0-.786.099-1.458.298-2.014.201-.559.49-.985.866-1.278.38-.296.834-.444 1.364-.444.53 0 .984.148 1.36.444.379.293.668.719.867 1.278.2.556.301 1.228.301 2.014 0 .79-.099 1.465-.298 2.024-.199.556-.486.981-.863 1.275-.376.291-.832.436-1.367.436zm0-.781c.53 0 .942-.256 1.236-.767.293-.511.44-1.24.44-2.187 0-.63-.067-1.166-.202-1.609-.133-.443-.325-.78-.576-1.012-.248-.232-.548-.348-.898-.348-.526 0-.936.259-1.232.777-.296.517-.444 1.247-.444 2.192 0 .629.066 1.164.199 1.605.132.44.323.775.571 1.005.251.229.553.344.906.344zm6.25.781c-.535 0-.99-.145-1.367-.436-.377-.294-.664-.719-.863-1.275-.199-.559-.298-1.234-.298-2.024 0-.786.099-1.458.298-2.014.201-.559.49-.985.866-1.278.38-.296.834-.444 1.364-.444.53 0 .984.148 1.36.444.379.293.668.719.867 1.278.2.556.301 1.228.301 2.014 0 .79-.099 1.465-.298 2.024-.199.556-.486.981-.863 1.275-.376.291-.832.436-1.367.436zm0-.781c.53 0 .942-.256 1.236-.767.293-.511.44-1.24.44-2.187 0-.63-.067-1.166-.202-1.609-.133-.443-.325-.78-.576-1.012-.248-.232-.548-.348-.898-.348-.526 0-.936.259-1.232.777-.296.517-.444 1.247-.444 2.192 0 .629.066 1.164.199 1.605.132.44.323.775.572 1.005.25.229.552.344.905.344zm6.25.781c-.535 0-.99-.145-1.367-.436-.377-.294-.664-.719-.863-1.275-.199-.559-.298-1.234-.298-2.024 0-.786.099-1.458.298-2.014.201-.559.49-.985.866-1.278.38-.296.834-.444 1.364-.444.53 0 .984.148 1.36.444.379.293.668.719.867 1.278.2.556.301 1.228.301 2.014 0 .79-.099 1.465-.298 2.024-.199.556-.486.981-.863 1.275-.376.291-.832.436-1.367.436zm0-.781c.53 0 .942-.256 1.236-.767.293-.511.44-1.24.44-2.187 0-.63-.067-1.166-.202-1.609-.133-.443-.325-.78-.576-1.012-.248-.232-.548-.348-.898-.348-.526 0-.936.259-1.232.777-.296.517-.444 1.247-.444 2.192 0 .629.066 1.164.199 1.605.132.44.323.775.572 1.005.25.229.552.344.905.344zm6.25.781c-.535 0-.99-.145-1.367-.436-.377-.294-.664-.719-.863-1.275-.199-.559-.298-1.234-.298-2.024 0-.786.099-1.458.298-2.014.201-.559.49-.985.866-1.278.38-.296.834-.444 1.364-.444.53 0 .984.148 1.36.444.379.293.668.719.867 1.278.2.556.301 1.228.301 2.014 0 .79-.099 1.465-.298 2.024-.199.556-.486.981-.863 1.275-.376.291-.832.436-1.367.436zm0-.781c.53 0 .942-.256 1.236-.767.293-.511.44-1.24.44-2.187 0-.63-.067-1.166-.202-1.609-.133-.443-.325-.78-.576-1.012-.248-.232-.548-.348-.898-.348-.526 0-.936.259-1.232.777-.296.517-.444 1.247-.444 2.192 0 .629.066 1.164.199 1.605.132.44.323.775.572 1.005.25.229.552.344.905.344zm6.25.781c-.535 0-.99-.145-1.367-.436-.377-.294-.664-.719-.863-1.275-.199-.559-.298-1.234-.298-2.024 0-.786.099-1.458.298-2.014.201-.559.49-.985.866-1.278.38-.296.834-.444 1.364-.444.53 0 .984.148 1.36.444.379.293.668.719.867 1.278.2.556.301 1.228.301 2.014 0 .79-.099 1.465-.298 2.024-.199.556-.486.981-.863 1.275-.376.291-.832.436-1.367.436zm0-.781c.53 0 .942-.256 1.236-.767.293-.511.44-1.24.44-2.187 0-.63-.067-1.166-.202-1.609-.133-.443-.325-.78-.576-1.012-.248-.232-.548-.348-.898-.348-.526 0-.936.259-1.232.777-.296.517-.444 1.247-.444 2.192 0 .629.066 1.164.199 1.605.132.44.323.775.572 1.005.25.229.552.344.905.344zm6.25.781c-.535 0-.99-.145-1.367-.436-.377-.294-.664-.719-.863-1.275-.199-.559-.298-1.234-.298-2.024 0-.786.099-1.458.298-2.014.201-.559.49-.985.866-1.278.38-.296.834-.444 1.364-.444.53 0 .984.148 1.36.444.379.293.668.719.867 1.278.2.556.301 1.228.301 2.014 0 .79-.099 1.465-.298 2.024-.199.556-.486.981-.863 1.275-.376.291-.832.436-1.367.436zm0-.781c.53 0 .942-.256 1.236-.767.293-.511.44-1.24.44-2.187 0-.63-.067-1.166-.202-1.609-.133-.443-.325-.78-.576-1.012-.248-.232-.548-.348-.898-.348-.526 0-.936.259-1.232.777-.296.517-.444 1.247-.444 2.192 0 .629.066 1.164.199 1.605.132.44.323.775.572 1.005.25.229.552.344.905.344zM55.198 227v-.639l2.4-2.628c.282-.308.514-.575.697-.803.182-.229.317-.445.405-.646.09-.204.134-.417.134-.639 0-.256-.061-.477-.184-.664-.12-.187-.287-.332-.497-.433-.211-.102-.448-.153-.71-.153-.28 0-.524.058-.732.174-.206.114-.366.273-.48.479-.11.206-.166.448-.166.725h-.838c0-.426.098-.8.294-1.122.197-.322.464-.573.803-.753.34-.18.723-.27 1.147-.27.426 0 .804.09 1.133.27.329.18.587.422.774.728.187.305.28.645.28 1.019 0 .267-.048.529-.145.785-.095.253-.26.536-.497.848-.235.311-.56.689-.977 1.137l-1.633 1.747v.057h3.38V227h-4.588zm8.427.099c-.535 0-.99-.145-1.367-.436-.377-.294-.664-.719-.863-1.275-.199-.559-.298-1.234-.298-2.024 0-.786.099-1.458.298-2.014.201-.559.49-.985.866-1.278.38-.296.834-.444 1.364-.444.53 0 .984.148 1.36.444.379.293.668.719.867 1.278.2.556.301 1.228.301 2.014 0 .79-.099 1.465-.298 2.024-.199.556-.486.981-.863 1.275-.376.291-.832.436-1.367.436zm0-.781c.53 0 .942-.256 1.236-.767.293-.511.44-1.24.44-2.187 0-.63-.067-1.166-.202-1.609-.133-.443-.325-.78-.576-1.012-.248-.232-.548-.348-.898-.348-.526 0-.936.259-1.232.778-.296.516-.444 1.246-.444 2.191 0 .629.066 1.164.199 1.605.132.44.323.775.571 1.005.251.229.553.344.906.344zm6.25.781c-.535 0-.99-.145-1.367-.436-.377-.294-.664-.719-.863-1.275-.199-.559-.298-1.234-.298-2.024 0-.786.099-1.458.298-2.014.201-.559.49-.985.866-1.278.38-.296.834-.444 1.364-.444.53 0 .984.148 1.36.444.379.293.668.719.867 1.278.2.556.301 1.228.301 2.014 0 .79-.099 1.465-.298 2.024-.199.556-.486.981-.863 1.275-.376.291-.832.436-1.367.436zm0-.781c.53 0 .942-.256 1.236-.767.293-.511.44-1.24.44-2.187 0-.63-.067-1.166-.202-1.609-.133-.443-.325-.78-.576-1.012-.248-.232-.548-.348-.898-.348-.526 0-.936.259-1.232.778-.296.516-.444 1.246-.444 2.191 0 .629.066 1.164.199 1.605.132.44.323.775.572 1.005.25.229.552.344.905.344zm6.25.781c-.535 0-.99-.145-1.367-.436-.377-.294-.664-.719-.863-1.275-.199-.559-.298-1.234-.298-2.024 0-.786.099-1.458.298-2.014.201-.559.49-.985.866-1.278.38-.296.834-.444 1.364-.444.53 0 .984.148 1.36.444.379.293.668.719.867 1.278.2.556.301 1.228.301 2.014 0 .79-.099 1.465-.298 2.024-.199.556-.486.981-.863 1.275-.376.291-.832.436-1.367.436zm0-.781c.53 0 .942-.256 1.236-.767.293-.511.44-1.24.44-2.187 0-.63-.067-1.166-.202-1.609-.133-.443-.325-.78-.576-1.012-.248-.232-.548-.348-.898-.348-.526 0-.936.259-1.232.778-.296.516-.444 1.246-.444 2.191 0 .629.066 1.164.199 1.605.132.44.323.775.572 1.005.25.229.552.344.905.344zm6.25.781c-.535 0-.99-.145-1.367-.436-.377-.294-.664-.719-.863-1.275-.199-.559-.298-1.234-.298-2.024 0-.786.099-1.458.298-2.014.201-.559.49-.985.866-1.278.38-.296.834-.444 1.364-.444.53 0 .984.148 1.36.444.379.293.668.719.867 1.278.2.556.301 1.228.301 2.014 0 .79-.099 1.465-.298 2.024-.199.556-.486.981-.863 1.275-.376.291-.832.436-1.367.436zm0-.781c.53 0 .942-.256 1.236-.767.293-.511.44-1.24.44-2.187 0-.63-.067-1.166-.202-1.609-.133-.443-.325-.78-.576-1.012-.248-.232-.548-.348-.898-.348-.526 0-.936.259-1.232.778-.296.516-.444 1.246-.444 2.191 0 .629.066 1.164.199 1.605.132.44.323.775.572 1.005.25.229.552.344.905.344zm6.25.781c-.535 0-.99-.145-1.367-.436-.377-.294-.664-.719-.863-1.275-.199-.559-.298-1.234-.298-2.024 0-.786.099-1.458.298-2.014.201-.559.49-.985.866-1.278.38-.296.834-.444 1.364-.444.53 0 .984.148 1.36.444.379.293.668.719.867 1.278.2.556.301 1.228.301 2.014 0 .79-.099 1.465-.298 2.024-.199.556-.486.981-.863 1.275-.376.291-.832.436-1.367.436zm0-.781c.53 0 .942-.256 1.236-.767.293-.511.44-1.24.44-2.187 0-.63-.067-1.166-.202-1.609-.133-.443-.325-.78-.576-1.012-.248-.232-.548-.348-.898-.348-.526 0-.936.259-1.232.778-.296.516-.444 1.246-.444 2.191 0 .629.066 1.164.199 1.605.132.44.323.775.572 1.005.25.229.552.344.905.344zm6.25.781c-.535 0-.99-.145-1.367-.436-.377-.294-.664-.719-.863-1.275-.199-.559-.298-1.234-.298-2.024 0-.786.099-1.458.298-2.014.201-.559.49-.985.866-1.278.38-.296.834-.444 1.364-.444.53 0 .984.148 1.36.444.379.293.668.719.867 1.278.2.556.301 1.228.301 2.014 0 .79-.099 1.465-.298 2.024-.199.556-.486.981-.863 1.275-.376.291-.832.436-1.367.436zm0-.781c.53 0 .942-.256 1.236-.767.293-.511.44-1.24.44-2.187 0-.63-.067-1.166-.202-1.609-.133-.443-.325-.78-.576-1.012-.248-.232-.548-.348-.898-.348-.526 0-.936.259-1.232.778-.296.516-.444 1.246-.444 2.191 0 .629.066 1.164.199 1.605.132.44.323.775.572 1.005.25.229.552.344.905.344zM57.427 187.541c-.298-.004-.596-.061-.895-.17-.298-.109-.57-.293-.816-.551-.247-.26-.444-.612-.593-1.054-.15-.445-.224-1.004-.224-1.676 0-.647.06-1.22.181-1.719.12-.502.296-.925.526-1.268.23-.343.506-.604.83-.781.327-.178.696-.266 1.105-.266.407 0 .77.081 1.087.245.32.163.58.39.78.681.202.289.332.624.392 1.005h-.867c-.08-.333-.237-.608-.469-.824-.232-.217-.54-.326-.923-.326-.563 0-1.007.246-1.332.738-.322.49-.484 1.182-.486 2.074h.057c.132-.201.29-.373.472-.515.185-.144.388-.255.61-.333.223-.079.459-.118.707-.118.417 0 .798.105 1.144.313.346.206.623.491.83.856.21.362.313.777.313 1.246 0 .45-.1.862-.302 1.236-.2.372-.484.668-.848.888-.362.218-.789.324-1.279.319zm0-.781c.299 0 .566-.074.803-.224.239-.149.427-.349.565-.6.14-.251.21-.53.21-.838 0-.301-.068-.574-.203-.82-.133-.249-.316-.446-.55-.593-.233-.147-.498-.22-.796-.22-.225 0-.435.045-.629.135-.194.087-.364.208-.511.362-.145.154-.258.33-.341.529-.083.196-.124.404-.124.621 0 .289.067.559.202.81.137.251.324.453.561.607.24.154.51.231.813.231zm6.198.781c-.535 0-.99-.145-1.367-.436-.377-.294-.664-.719-.863-1.275-.199-.559-.298-1.234-.298-2.024 0-.786.099-1.458.298-2.014.201-.559.49-.985.866-1.278.38-.296.834-.444 1.364-.444.53 0 .984.148 1.36.444.379.293.668.719.867 1.278.2.556.301 1.228.301 2.014 0 .79-.099 1.465-.298 2.024-.199.556-.486.981-.863 1.275-.376.291-.832.436-1.367.436zm0-.781c.53 0 .942-.256 1.236-.767.293-.511.44-1.24.44-2.187 0-.63-.067-1.166-.202-1.609-.133-.443-.325-.78-.576-1.012-.248-.232-.548-.348-.898-.348-.526 0-.936.259-1.232.777-.296.517-.444 1.247-.444 2.192 0 .629.066 1.164.199 1.605.132.44.323.775.571 1.005.251.229.553.344.906.344zm6.25.781c-.535 0-.99-.145-1.367-.436-.377-.294-.664-.719-.863-1.275-.199-.559-.298-1.234-.298-2.024 0-.786.099-1.458.298-2.014.201-.559.49-.985.866-1.278.38-.296.834-.444 1.364-.444.53 0 .984.148 1.36.444.379.293.668.719.867 1.278.2.556.301 1.228.301 2.014 0 .79-.099 1.465-.298 2.024-.199.556-.486.981-.863 1.275-.376.291-.832.436-1.367.436zm0-.781c.53 0 .942-.256 1.236-.767.293-.511.44-1.24.44-2.187 0-.63-.067-1.166-.202-1.609-.133-.443-.325-.78-.576-1.012-.248-.232-.548-.348-.898-.348-.526 0-.936.259-1.232.777-.296.517-.444 1.247-.444 2.192 0 .629.066 1.164.199 1.605.132.44.323.775.572 1.005.25.229.552.344.905.344zm6.25.781c-.535 0-.99-.145-1.367-.436-.377-.294-.664-.719-.863-1.275-.199-.559-.298-1.234-.298-2.024 0-.786.099-1.458.298-2.014.201-.559.49-.985.866-1.278.38-.296.834-.444 1.364-.444.53 0 .984.148 1.36.444.379.293.668.719.867 1.278.2.556.301 1.228.301 2.014 0 .79-.099 1.465-.298 2.024-.199.556-.486.981-.863 1.275-.376.291-.832.436-1.367.436zm0-.781c.53 0 .942-.256 1.236-.767.293-.511.44-1.24.44-2.187 0-.63-.067-1.166-.202-1.609-.133-.443-.325-.78-.576-1.012-.248-.232-.548-.348-.898-.348-.526 0-.936.259-1.232.777-.296.517-.444 1.247-.444 2.192 0 .629.066 1.164.199 1.605.132.44.323.775.572 1.005.25.229.552.344.905.344zm6.25.781c-.535 0-.99-.145-1.367-.436-.377-.294-.664-.719-.863-1.275-.199-.559-.298-1.234-.298-2.024 0-.786.099-1.458.298-2.014.201-.559.49-.985.866-1.278.38-.296.834-.444 1.364-.444.53 0 .984.148 1.36.444.379.293.668.719.867 1.278.2.556.301 1.228.301 2.014 0 .79-.099 1.465-.298 2.024-.199.556-.486.981-.863 1.275-.376.291-.832.436-1.367.436zm0-.781c.53 0 .942-.256 1.236-.767.293-.511.44-1.24.44-2.187 0-.63-.067-1.166-.202-1.609-.133-.443-.325-.78-.576-1.012-.248-.232-.548-.348-.898-.348-.526 0-.936.259-1.232.777-.296.517-.444 1.247-.444 2.192 0 .629.066 1.164.199 1.605.132.44.323.775.572 1.005.25.229.552.344.905.344zm6.25.781c-.535 0-.99-.145-1.367-.436-.377-.294-.664-.719-.863-1.275-.199-.559-.298-1.234-.298-2.024 0-.786.099-1.458.298-2.014.201-.559.49-.985.866-1.278.38-.296.834-.444 1.364-.444.53 0 .984.148 1.36.444.379.293.668.719.867 1.278.2.556.301 1.228.301 2.014 0 .79-.099 1.465-.298 2.024-.199.556-.486.981-.863 1.275-.376.291-.832.436-1.367.436zm0-.781c.53 0 .942-.256 1.236-.767.293-.511.44-1.24.44-2.187 0-.63-.067-1.166-.202-1.609-.133-.443-.325-.78-.576-1.012-.248-.232-.548-.348-.898-.348-.526 0-.936.259-1.232.777-.296.517-.444 1.247-.444 2.192 0 .629.066 1.164.199 1.605.132.44.323.775.572 1.005.25.229.552.344.905.344zm6.25.781c-.535 0-.99-.145-1.367-.436-.377-.294-.664-.719-.863-1.275-.199-.559-.298-1.234-.298-2.024 0-.786.099-1.458.298-2.014.201-.559.49-.985.866-1.278.38-.296.834-.444 1.364-.444.53 0 .984.148 1.36.444.379.293.668.719.867 1.278.2.556.301 1.228.301 2.014 0 .79-.099 1.465-.298 2.024-.199.556-.486.981-.863 1.275-.376.291-.832.436-1.367.436zm0-.781c.53 0 .942-.256 1.236-.767.293-.511.44-1.24.44-2.187 0-.63-.067-1.166-.202-1.609-.133-.443-.325-.78-.576-1.012-.248-.232-.548-.348-.898-.348-.526 0-.936.259-1.232.777-.296.517-.444 1.247-.444 2.192 0 .629.066 1.164.199 1.605.132.44.323.775.572 1.005.25.229.552.344.905.344zM57.42 167.541c-.487 0-.918-.086-1.292-.259-.372-.175-.662-.415-.87-.721-.209-.308-.312-.658-.31-1.051-.002-.308.059-.592.182-.852.123-.263.291-.482.504-.657.215-.178.456-.29.72-.338v-.042c-.347-.09-.624-.285-.83-.586-.206-.303-.308-.648-.305-1.033-.003-.37.09-.7.28-.991.19-.291.45-.521.781-.689.334-.168.714-.252 1.14-.252.422 0 .798.084 1.13.252.331.168.591.398.78.689.193.291.29.621.292.991-.002.385-.108.73-.316 1.033-.206.301-.48.496-.82.586v.042c.262.048.5.16.71.338.21.175.379.394.504.657.126.26.19.544.192.852-.003.393-.109.743-.32 1.051-.208.306-.498.546-.87.721-.37.173-.796.259-1.282.259zm0-.781c.33 0 .613-.053.852-.16.24-.106.424-.257.555-.451.13-.194.196-.421.198-.682-.002-.274-.073-.517-.213-.728-.14-.21-.33-.376-.571-.497-.24-.12-.513-.181-.82-.181-.31 0-.588.061-.832.181-.241.121-.432.287-.571.497-.138.211-.205.454-.203.728-.002.261.06.488.188.682.13.194.316.345.558.451.241.107.528.16.86.16zm0-3.452c.26 0 .491-.052.693-.156.203-.104.363-.25.48-.437.115-.187.174-.406.177-.657-.003-.246-.06-.46-.174-.642-.114-.185-.271-.327-.473-.427-.2-.101-.435-.152-.703-.152-.272 0-.51.051-.714.152-.203.1-.36.242-.472.427-.111.182-.166.396-.163.642-.002.251.053.47.167.657.116.187.276.333.48.437.203.104.437.156.702.156zm6.205 4.233c-.535 0-.99-.145-1.367-.436-.377-.294-.664-.719-.863-1.275-.199-.559-.298-1.234-.298-2.024 0-.786.099-1.458.298-2.014.201-.559.49-.985.866-1.278.38-.296.834-.444 1.364-.444.53 0 .984.148 1.36.444.379.293.668.719.867 1.278.2.556.301 1.228.301 2.014 0 .79-.099 1.465-.298 2.024-.199.556-.486.981-.863 1.275-.376.291-.832.436-1.367.436zm0-.781c.53 0 .942-.256 1.236-.767.293-.511.44-1.24.44-2.187 0-.63-.067-1.166-.202-1.609-.133-.443-.325-.78-.576-1.012-.248-.232-.548-.348-.898-.348-.526 0-.936.259-1.232.777-.296.517-.444 1.247-.444 2.192 0 .629.066 1.164.199 1.605.132.44.323.775.571 1.005.251.229.553.344.906.344zm6.25.781c-.535 0-.99-.145-1.367-.436-.377-.294-.664-.719-.863-1.275-.199-.559-.298-1.234-.298-2.024 0-.786.099-1.458.298-2.014.201-.559.49-.985.866-1.278.38-.296.834-.444 1.364-.444.53 0 .984.148 1.36.444.379.293.668.719.867 1.278.2.556.301 1.228.301 2.014 0 .79-.099 1.465-.298 2.024-.199.556-.486.981-.863 1.275-.376.291-.832.436-1.367.436zm0-.781c.53 0 .942-.256 1.236-.767.293-.511.44-1.24.44-2.187 0-.63-.067-1.166-.202-1.609-.133-.443-.325-.78-.576-1.012-.248-.232-.548-.348-.898-.348-.526 0-.936.259-1.232.777-.296.517-.444 1.247-.444 2.192 0 .629.066 1.164.199 1.605.132.44.323.775.572 1.005.25.229.552.344.905.344zm6.25.781c-.535 0-.99-.145-1.367-.436-.377-.294-.664-.719-.863-1.275-.199-.559-.298-1.234-.298-2.024 0-.786.099-1.458.298-2.014.201-.559.49-.985.866-1.278.38-.296.834-.444 1.364-.444.53 0 .984.148 1.36.444.379.293.668.719.867 1.278.2.556.301 1.228.301 2.014 0 .79-.099 1.465-.298 2.024-.199.556-.486.981-.863 1.275-.376.291-.832.436-1.367.436zm0-.781c.53 0 .942-.256 1.236-.767.293-.511.44-1.24.44-2.187 0-.63-.067-1.166-.202-1.609-.133-.443-.325-.78-.576-1.012-.248-.232-.548-.348-.898-.348-.526 0-.936.259-1.232.777-.296.517-.444 1.247-.444 2.192 0 .629.066 1.164.199 1.605.132.44.323.775.572 1.005.25.229.552.344.905.344zm6.25.781c-.535 0-.99-.145-1.367-.436-.377-.294-.664-.719-.863-1.275-.199-.559-.298-1.234-.298-2.024 0-.786.099-1.458.298-2.014.201-.559.49-.985.866-1.278.38-.296.834-.444 1.364-.444.53 0 .984.148 1.36.444.379.293.668.719.867 1.278.2.556.301 1.228.301 2.014 0 .79-.099 1.465-.298 2.024-.199.556-.486.981-.863 1.275-.376.291-.832.436-1.367.436zm0-.781c.53 0 .942-.256 1.236-.767.293-.511.44-1.24.44-2.187 0-.63-.067-1.166-.202-1.609-.133-.443-.325-.78-.576-1.012-.248-.232-.548-.348-.898-.348-.526 0-.936.259-1.232.777-.296.517-.444 1.247-.444 2.192 0 .629.066 1.164.199 1.605.132.44.323.775.572 1.005.25.229.552.344.905.344zm6.25.781c-.535 0-.99-.145-1.367-.436-.377-.294-.664-.719-.863-1.275-.199-.559-.298-1.234-.298-2.024 0-.786.099-1.458.298-2.014.201-.559.49-.985.866-1.278.38-.296.834-.444 1.364-.444.53 0 .984.148 1.36.444.379.293.668.719.867 1.278.2.556.301 1.228.301 2.014 0 .79-.099 1.465-.298 2.024-.199.556-.486.981-.863 1.275-.376.291-.832.436-1.367.436zm0-.781c.53 0 .942-.256 1.236-.767.293-.511.44-1.24.44-2.187 0-.63-.067-1.166-.202-1.609-.133-.443-.325-.78-.576-1.012-.248-.232-.548-.348-.898-.348-.526 0-.936.259-1.232.777-.296.517-.444 1.247-.444 2.192 0 .629.066 1.164.199 1.605.132.44.323.775.572 1.005.25.229.552.344.905.344zm6.25.781c-.535 0-.99-.145-1.367-.436-.377-.294-.664-.719-.863-1.275-.199-.559-.298-1.234-.298-2.024 0-.786.099-1.458.298-2.014.201-.559.49-.985.866-1.278.38-.296.834-.444 1.364-.444.53 0 .984.148 1.36.444.379.293.668.719.867 1.278.2.556.301 1.228.301 2.014 0 .79-.099 1.465-.298 2.024-.199.556-.486.981-.863 1.275-.376.291-.832.436-1.367.436zm0-.781c.53 0 .942-.256 1.236-.767.293-.511.44-1.24.44-2.187 0-.63-.067-1.166-.202-1.609-.133-.443-.325-.78-.576-1.012-.248-.232-.548-.348-.898-.348-.526 0-.936.259-1.232.777-.296.517-.444 1.247-.444 2.192 0 .629.066 1.164.199 1.605.132.44.323.775.572 1.005.25.229.552.344.905.344zM52.911 140.169v7.273h-.88v-6.35h-.043l-1.776 1.179v-.894l1.819-1.208h.88zm4.464 7.372c-.535 0-.99-.145-1.367-.436-.377-.294-.664-.719-.863-1.275-.199-.559-.298-1.234-.298-2.024 0-.786.099-1.458.298-2.014.201-.559.49-.985.866-1.278.38-.296.834-.444 1.364-.444.53 0 .984.148 1.36.444.379.293.668.719.867 1.278.2.556.301 1.228.301 2.014 0 .79-.099 1.465-.298 2.024-.199.556-.486.981-.863 1.275-.376.291-.832.436-1.367.436zm0-.781c.53 0 .942-.256 1.236-.767.293-.511.44-1.24.44-2.187 0-.63-.067-1.166-.202-1.609-.133-.443-.325-.78-.576-1.012-.248-.232-.548-.348-.898-.348-.526 0-.936.259-1.232.777-.296.517-.444 1.247-.444 2.192 0 .629.066 1.164.199 1.605.132.44.323.775.571 1.005.251.229.553.344.906.344zm6.25.781c-.535 0-.99-.145-1.367-.436-.377-.294-.664-.719-.863-1.275-.199-.559-.298-1.234-.298-2.024 0-.786.099-1.458.298-2.014.201-.559.49-.985.866-1.278.38-.296.834-.444 1.364-.444.53 0 .984.148 1.36.444.379.293.668.719.867 1.278.2.556.301 1.228.301 2.014 0 .79-.099 1.465-.298 2.024-.199.556-.486.981-.863 1.275-.376.291-.832.436-1.367.436zm0-.781c.53 0 .942-.256 1.236-.767.293-.511.44-1.24.44-2.187 0-.63-.067-1.166-.202-1.609-.133-.443-.325-.78-.576-1.012-.248-.232-.548-.348-.898-.348-.526 0-.936.259-1.232.777-.296.517-.444 1.247-.444 2.192 0 .629.066 1.164.199 1.605.132.44.323.775.571 1.005.251.229.553.344.906.344zm6.25.781c-.535 0-.99-.145-1.367-.436-.377-.294-.664-.719-.863-1.275-.199-.559-.298-1.234-.298-2.024 0-.786.099-1.458.298-2.014.201-.559.49-.985.866-1.278.38-.296.834-.444 1.364-.444.53 0 .984.148 1.36.444.379.293.668.719.867 1.278.2.556.301 1.228.301 2.014 0 .79-.099 1.465-.298 2.024-.199.556-.486.981-.863 1.275-.376.291-.832.436-1.367.436zm0-.781c.53 0 .942-.256 1.236-.767.293-.511.44-1.24.44-2.187 0-.63-.067-1.166-.202-1.609-.133-.443-.325-.78-.576-1.012-.248-.232-.548-.348-.898-.348-.526 0-.936.259-1.232.777-.296.517-.444 1.247-.444 2.192 0 .629.066 1.164.199 1.605.132.44.323.775.572 1.005.25.229.552.344.905.344zm6.25.781c-.535 0-.99-.145-1.367-.436-.377-.294-.664-.719-.863-1.275-.199-.559-.298-1.234-.298-2.024 0-.786.099-1.458.298-2.014.201-.559.49-.985.866-1.278.38-.296.834-.444 1.364-.444.53 0 .984.148 1.36.444.379.293.668.719.867 1.278.2.556.301 1.228.301 2.014 0 .79-.099 1.465-.298 2.024-.199.556-.486.981-.863 1.275-.376.291-.832.436-1.367.436zm0-.781c.53 0 .942-.256 1.236-.767.293-.511.44-1.24.44-2.187 0-.63-.067-1.166-.202-1.609-.133-.443-.325-.78-.576-1.012-.248-.232-.548-.348-.898-.348-.526 0-.936.259-1.232.777-.296.517-.444 1.247-.444 2.192 0 .629.066 1.164.199 1.605.132.44.323.775.572 1.005.25.229.552.344.905.344zm6.25.781c-.535 0-.99-.145-1.367-.436-.377-.294-.664-.719-.863-1.275-.199-.559-.298-1.234-.298-2.024 0-.786.099-1.458.298-2.014.201-.559.49-.985.866-1.278.38-.296.834-.444 1.364-.444.53 0 .984.148 1.36.444.379.293.668.719.867 1.278.2.556.301 1.228.301 2.014 0 .79-.099 1.465-.298 2.024-.199.556-.486.981-.863 1.275-.376.291-.832.436-1.367.436zm0-.781c.53 0 .942-.256 1.236-.767.293-.511.44-1.24.44-2.187 0-.63-.067-1.166-.202-1.609-.133-.443-.325-.78-.576-1.012-.248-.232-.548-.348-.898-.348-.526 0-.936.259-1.232.777-.296.517-.444 1.247-.444 2.192 0 .629.066 1.164.199 1.605.132.44.323.775.572 1.005.25.229.552.344.905.344zm6.25.781c-.535 0-.99-.145-1.367-.436-.377-.294-.664-.719-.863-1.275-.199-.559-.298-1.234-.298-2.024 0-.786.099-1.458.298-2.014.201-.559.49-.985.866-1.278.38-.296.834-.444 1.364-.444.53 0 .984.148 1.36.444.379.293.668.719.867 1.278.2.556.301 1.228.301 2.014 0 .79-.099 1.465-.298 2.024-.199.556-.486.981-.863 1.275-.376.291-.832.436-1.367.436zm0-.781c.53 0 .942-.256 1.236-.767.293-.511.44-1.24.44-2.187 0-.63-.067-1.166-.202-1.609-.133-.443-.325-.78-.576-1.012-.248-.232-.548-.348-.898-.348-.526 0-.936.259-1.232.777-.296.517-.444 1.247-.444 2.192 0 .629.066 1.164.199 1.605.132.44.323.775.572 1.005.25.229.552.344.905.344zm6.25.781c-.535 0-.99-.145-1.367-.436-.377-.294-.664-.719-.863-1.275-.199-.559-.298-1.234-.298-2.024 0-.786.099-1.458.298-2.014.201-.559.49-.985.866-1.278.38-.296.834-.444 1.364-.444.53 0 .984.148 1.36.444.379.293.668.719.867 1.278.2.556.301 1.228.301 2.014 0 .79-.099 1.465-.298 2.024-.199.556-.486.981-.863 1.275-.376.291-.832.436-1.367.436zm0-.781c.53 0 .942-.256 1.236-.767.293-.511.44-1.24.44-2.187 0-.63-.067-1.166-.202-1.609-.133-.443-.325-.78-.576-1.012-.248-.232-.548-.348-.898-.348-.526 0-.936.259-1.232.777-.296.517-.444 1.247-.444 2.192 0 .629.066 1.164.199 1.605.132.44.323.775.572 1.005.25.229.552.344.905.344zM53.106 120.169v7.273h-.88v-6.35h-.043l-1.775 1.179v-.894l1.818-1.208h.88zm2.092 7.273v-.639l2.4-2.628c.282-.308.514-.575.697-.803.182-.229.317-.445.405-.646.09-.204.134-.417.134-.639 0-.256-.061-.477-.184-.664-.12-.187-.287-.332-.497-.434-.211-.101-.448-.152-.71-.152-.28 0-.524.058-.732.174-.206.113-.366.273-.48.479-.11.206-.166.448-.166.725h-.838c0-.427.098-.801.294-1.123.197-.322.464-.572.803-.752.34-.18.723-.27 1.147-.27.426 0 .804.09 1.133.27.329.18.587.422.774.728.187.305.28.645.28 1.019 0 .267-.048.529-.145.785-.095.253-.26.536-.497.848-.235.31-.56.689-.977 1.137l-1.633 1.747v.057h3.38v.781h-4.588zm8.427.099c-.535 0-.99-.145-1.367-.436-.377-.294-.664-.719-.863-1.275-.199-.559-.298-1.234-.298-2.024 0-.786.099-1.458.298-2.014.201-.559.49-.985.866-1.278.38-.296.834-.444 1.364-.444.53 0 .984.148 1.36.444.379.293.668.719.867 1.278.2.556.301 1.228.301 2.014 0 .79-.099 1.465-.298 2.024-.199.556-.486.981-.863 1.275-.376.291-.832.436-1.367.436zm0-.781c.53 0 .942-.256 1.236-.767.293-.511.44-1.24.44-2.187 0-.63-.067-1.166-.202-1.609-.133-.443-.325-.78-.576-1.012-.248-.232-.548-.348-.898-.348-.526 0-.936.259-1.232.777-.296.517-.444 1.247-.444 2.192 0 .629.066 1.164.199 1.605.132.44.323.775.571 1.005.251.229.553.344.906.344zm6.25.781c-.535 0-.99-.145-1.367-.436-.377-.294-.664-.719-.863-1.275-.199-.559-.298-1.234-.298-2.024 0-.786.099-1.458.298-2.014.201-.559.49-.985.866-1.278.38-.296.834-.444 1.364-.444.53 0 .984.148 1.36.444.379.293.668.719.867 1.278.2.556.301 1.228.301 2.014 0 .79-.099 1.465-.298 2.024-.199.556-.486.981-.863 1.275-.376.291-.832.436-1.367.436zm0-.781c.53 0 .942-.256 1.236-.767.293-.511.44-1.24.44-2.187 0-.63-.067-1.166-.202-1.609-.133-.443-.325-.78-.576-1.012-.248-.232-.548-.348-.898-.348-.526 0-.936.259-1.232.777-.296.517-.444 1.247-.444 2.192 0 .629.066 1.164.199 1.605.132.44.323.775.572 1.005.25.229.552.344.905.344zm6.25.781c-.535 0-.99-.145-1.367-.436-.377-.294-.664-.719-.863-1.275-.199-.559-.298-1.234-.298-2.024 0-.786.099-1.458.298-2.014.201-.559.49-.985.866-1.278.38-.296.834-.444 1.364-.444.53 0 .984.148 1.36.444.379.293.668.719.867 1.278.2.556.301 1.228.301 2.014 0 .79-.099 1.465-.298 2.024-.199.556-.486.981-.863 1.275-.376.291-.832.436-1.367.436zm0-.781c.53 0 .942-.256 1.236-.767.293-.511.44-1.24.44-2.187 0-.63-.067-1.166-.202-1.609-.133-.443-.325-.78-.576-1.012-.248-.232-.548-.348-.898-.348-.526 0-.936.259-1.232.777-.296.517-.444 1.247-.444 2.192 0 .629.066 1.164.199 1.605.132.44.323.775.572 1.005.25.229.552.344.905.344zm6.25.781c-.535 0-.99-.145-1.367-.436-.377-.294-.664-.719-.863-1.275-.199-.559-.298-1.234-.298-2.024 0-.786.099-1.458.298-2.014.201-.559.49-.985.866-1.278.38-.296.834-.444 1.364-.444.53 0 .984.148 1.36.444.379.293.668.719.867 1.278.2.556.301 1.228.301 2.014 0 .79-.099 1.465-.298 2.024-.199.556-.486.981-.863 1.275-.376.291-.832.436-1.367.436zm0-.781c.53 0 .942-.256 1.236-.767.293-.511.44-1.24.44-2.187 0-.63-.067-1.166-.202-1.609-.133-.443-.325-.78-.576-1.012-.248-.232-.548-.348-.898-.348-.526 0-.936.259-1.232.777-.296.517-.444 1.247-.444 2.192 0 .629.066 1.164.199 1.605.132.44.323.775.572 1.005.25.229.552.344.905.344zm6.25.781c-.535 0-.99-.145-1.367-.436-.377-.294-.664-.719-.863-1.275-.199-.559-.298-1.234-.298-2.024 0-.786.099-1.458.298-2.014.201-.559.49-.985.866-1.278.38-.296.834-.444 1.364-.444.53 0 .984.148 1.36.444.379.293.668.719.867 1.278.2.556.301 1.228.301 2.014 0 .79-.099 1.465-.298 2.024-.199.556-.486.981-.863 1.275-.376.291-.832.436-1.367.436zm0-.781c.53 0 .942-.256 1.236-.767.293-.511.44-1.24.44-2.187 0-.63-.067-1.166-.202-1.609-.133-.443-.325-.78-.576-1.012-.248-.232-.548-.348-.898-.348-.526 0-.936.259-1.232.777-.296.517-.444 1.247-.444 2.192 0 .629.066 1.164.199 1.605.132.44.323.775.572 1.005.25.229.552.344.905.344zm6.25.781c-.535 0-.99-.145-1.367-.436-.377-.294-.664-.719-.863-1.275-.199-.559-.298-1.234-.298-2.024 0-.786.099-1.458.298-2.014.201-.559.49-.985.866-1.278.38-.296.834-.444 1.364-.444.53 0 .984.148 1.36.444.379.293.668.719.867 1.278.2.556.301 1.228.301 2.014 0 .79-.099 1.465-.298 2.024-.199.556-.486.981-.863 1.275-.376.291-.832.436-1.367.436zm0-.781c.53 0 .942-.256 1.236-.767.293-.511.44-1.24.44-2.187 0-.63-.067-1.166-.202-1.609-.133-.443-.325-.78-.576-1.012-.248-.232-.548-.348-.898-.348-.526 0-.936.259-1.232.777-.296.517-.444 1.247-.444 2.192 0 .629.066 1.164.199 1.605.132.44.323.775.572 1.005.25.229.552.344.905.344zM52.745 100.169v7.273h-.88v-6.35h-.043l-1.776 1.179v-.894l1.819-1.208h.88zm1.921 5.781v-.724l3.196-5.057h.526v1.122h-.355l-2.415 3.821v.057h4.304v.781h-5.256zm3.424 1.492v-7.273h.838v7.273h-.838zm5.535.099c-.535 0-.99-.145-1.367-.436-.377-.294-.664-.719-.863-1.275-.199-.559-.298-1.234-.298-2.024 0-.786.099-1.458.298-2.014.201-.559.49-.985.866-1.278.38-.296.834-.444 1.364-.444.53 0 .984.148 1.36.444.379.293.668.719.867 1.278.2.556.301 1.228.301 2.014 0 .79-.099 1.465-.298 2.024-.199.556-.486.981-.863 1.275-.376.291-.832.436-1.367.436zm0-.781c.53 0 .942-.256 1.236-.767.293-.511.44-1.24.44-2.187 0-.63-.067-1.166-.202-1.609-.133-.443-.325-.78-.576-1.012-.248-.232-.548-.348-.898-.348-.526 0-.936.259-1.232.777-.296.517-.444 1.247-.444 2.192 0 .629.066 1.164.199 1.605.132.44.323.775.571 1.005.251.229.553.344.906.344zm6.25.781c-.535 0-.99-.145-1.367-.436-.377-.294-.664-.719-.863-1.275-.199-.559-.298-1.234-.298-2.024 0-.786.099-1.458.298-2.014.201-.559.49-.985.866-1.278.38-.296.834-.444 1.364-.444.53 0 .984.148 1.36.444.379.293.668.719.867 1.278.2.556.301 1.228.301 2.014 0 .79-.099 1.465-.298 2.024-.199.556-.486.981-.863 1.275-.376.291-.832.436-1.367.436zm0-.781c.53 0 .942-.256 1.236-.767.293-.511.44-1.24.44-2.187 0-.63-.067-1.166-.202-1.609-.133-.443-.325-.78-.576-1.012-.248-.232-.548-.348-.898-.348-.526 0-.936.259-1.232.777-.296.517-.444 1.247-.444 2.192 0 .629.066 1.164.199 1.605.132.44.323.775.572 1.005.25.229.552.344.905.344zm6.25.781c-.535 0-.99-.145-1.367-.436-.377-.294-.664-.719-.863-1.275-.199-.559-.298-1.234-.298-2.024 0-.786.099-1.458.298-2.014.201-.559.49-.985.866-1.278.38-.296.834-.444 1.364-.444.53 0 .984.148 1.36.444.379.293.668.719.867 1.278.2.556.301 1.228.301 2.014 0 .79-.099 1.465-.298 2.024-.199.556-.486.981-.863 1.275-.376.291-.832.436-1.367.436zm0-.781c.53 0 .942-.256 1.236-.767.293-.511.44-1.24.44-2.187 0-.63-.067-1.166-.202-1.609-.133-.443-.325-.78-.576-1.012-.248-.232-.548-.348-.898-.348-.526 0-.936.259-1.232.777-.296.517-.444 1.247-.444 2.192 0 .629.066 1.164.199 1.605.132.44.323.775.572 1.005.25.229.552.344.905.344zm6.25.781c-.535 0-.99-.145-1.367-.436-.377-.294-.664-.719-.863-1.275-.199-.559-.298-1.234-.298-2.024 0-.786.099-1.458.298-2.014.201-.559.49-.985.866-1.278.38-.296.834-.444 1.364-.444.53 0 .984.148 1.36.444.379.293.668.719.867 1.278.2.556.301 1.228.301 2.014 0 .79-.099 1.465-.298 2.024-.199.556-.486.981-.863 1.275-.376.291-.832.436-1.367.436zm0-.781c.53 0 .942-.256 1.236-.767.293-.511.44-1.24.44-2.187 0-.63-.067-1.166-.202-1.609-.133-.443-.325-.78-.576-1.012-.248-.232-.548-.348-.898-.348-.526 0-.936.259-1.232.777-.296.517-.444 1.247-.444 2.192 0 .629.066 1.164.199 1.605.132.44.323.775.572 1.005.25.229.552.344.905.344zm6.25.781c-.535 0-.99-.145-1.367-.436-.377-.294-.664-.719-.863-1.275-.199-.559-.298-1.234-.298-2.024 0-.786.099-1.458.298-2.014.201-.559.49-.985.866-1.278.38-.296.834-.444 1.364-.444.53 0 .984.148 1.36.444.379.293.668.719.867 1.278.2.556.301 1.228.301 2.014 0 .79-.099 1.465-.298 2.024-.199.556-.486.981-.863 1.275-.376.291-.832.436-1.367.436zm0-.781c.53 0 .942-.256 1.236-.767.293-.511.44-1.24.44-2.187 0-.63-.067-1.166-.202-1.609-.133-.443-.325-.78-.576-1.012-.248-.232-.548-.348-.898-.348-.526 0-.936.259-1.232.777-.296.517-.444 1.247-.444 2.192 0 .629.066 1.164.199 1.605.132.44.323.775.572 1.005.25.229.552.344.905.344zm6.25.781c-.535 0-.99-.145-1.367-.436-.377-.294-.664-.719-.863-1.275-.199-.559-.298-1.234-.298-2.024 0-.786.099-1.458.298-2.014.201-.559.49-.985.866-1.278.38-.296.834-.444 1.364-.444.53 0 .984.148 1.36.444.379.293.668.719.867 1.278.2.556.301 1.228.301 2.014 0 .79-.099 1.465-.298 2.024-.199.556-.486.981-.863 1.275-.376.291-.832.436-1.367.436zm0-.781c.53 0 .942-.256 1.236-.767.293-.511.44-1.24.44-2.187 0-.63-.067-1.166-.202-1.609-.133-.443-.325-.78-.576-1.012-.248-.232-.548-.348-.898-.348-.526 0-.936.259-1.232.777-.296.517-.444 1.247-.444 2.192 0 .629.066 1.164.199 1.605.132.44.323.775.572 1.005.25.229.552.344.905.344zM52.921 80.17v7.272h-.88v-6.35h-.043l-1.776 1.18v-.895l1.818-1.208h.881zm4.506 7.371c-.298-.004-.596-.061-.895-.17-.298-.109-.57-.292-.816-.55-.247-.261-.444-.612-.593-1.055-.15-.445-.224-1.004-.224-1.676 0-.647.06-1.22.181-1.72.12-.501.296-.924.526-1.267.23-.343.506-.604.83-.781.327-.178.696-.267 1.105-.267.407 0 .77.082 1.087.246.32.163.58.39.78.681.202.29.332.624.392 1.005h-.867c-.08-.334-.237-.608-.469-.823-.232-.218-.54-.327-.923-.327-.563 0-1.007.246-1.332.738-.322.49-.484 1.182-.486 2.074h.057c.132-.201.29-.373.472-.515.185-.144.388-.255.61-.333.223-.079.459-.118.707-.118.417 0 .798.104 1.144.313.346.206.623.491.83.856.21.362.313.777.313 1.246 0 .45-.1.862-.302 1.236-.2.372-.484.668-.848.888-.362.218-.789.324-1.279.32zm0-.78c.299 0 .566-.075.803-.225.239-.149.427-.349.565-.6.14-.25.21-.53.21-.838 0-.3-.068-.574-.203-.82-.133-.249-.316-.446-.55-.593-.233-.147-.498-.22-.796-.22-.225 0-.435.045-.629.135-.194.087-.364.208-.511.362-.145.154-.258.33-.341.529-.083.196-.124.403-.124.621 0 .29.067.56.202.81.137.251.324.453.561.607.24.154.51.231.813.231zm6.198.78c-.535 0-.99-.145-1.367-.436-.377-.294-.664-.719-.863-1.275-.199-.559-.298-1.234-.298-2.025 0-.786.099-1.457.298-2.013.201-.559.49-.985.866-1.278.38-.296.834-.444 1.364-.444.53 0 .984.148 1.36.444.379.293.668.72.867 1.278.2.556.301 1.227.301 2.013 0 .791-.099 1.466-.298 2.025-.199.556-.486.981-.863 1.275-.376.29-.832.436-1.367.436zm0-.78c.53 0 .942-.257 1.236-.768.293-.511.44-1.24.44-2.188 0-.63-.067-1.165-.202-1.608-.133-.443-.325-.78-.576-1.012-.248-.232-.548-.348-.898-.348-.526 0-.936.259-1.232.778-.296.516-.444 1.246-.444 2.19 0 .63.066 1.165.199 1.606.132.44.323.775.571 1.005.251.23.553.344.906.344zm6.25.78c-.535 0-.99-.145-1.367-.436-.377-.294-.664-.719-.863-1.275-.199-.559-.298-1.234-.298-2.025 0-.786.099-1.457.298-2.013.201-.559.49-.985.866-1.278.38-.296.834-.444 1.364-.444.53 0 .984.148 1.36.444.379.293.668.72.867 1.278.2.556.301 1.227.301 2.013 0 .791-.099 1.466-.298 2.025-.199.556-.486.981-.863 1.275-.376.29-.832.436-1.367.436zm0-.78c.53 0 .942-.257 1.236-.768.293-.511.44-1.24.44-2.188 0-.63-.067-1.165-.202-1.608-.133-.443-.325-.78-.576-1.012-.248-.232-.548-.348-.898-.348-.526 0-.936.259-1.232.778-.296.516-.444 1.246-.444 2.19 0 .63.066 1.165.199 1.606.132.44.323.775.572 1.005.25.23.552.344.905.344zm6.25.78c-.535 0-.99-.145-1.367-.436-.377-.294-.664-.719-.863-1.275-.199-.559-.298-1.234-.298-2.025 0-.786.099-1.457.298-2.013.201-.559.49-.985.866-1.278.38-.296.834-.444 1.364-.444.53 0 .984.148 1.36.444.379.293.668.72.867 1.278.2.556.301 1.227.301 2.013 0 .791-.099 1.466-.298 2.025-.199.556-.486.981-.863 1.275-.376.29-.832.436-1.367.436zm0-.78c.53 0 .942-.257 1.236-.768.293-.511.44-1.24.44-2.188 0-.63-.067-1.165-.202-1.608-.133-.443-.325-.78-.576-1.012-.248-.232-.548-.348-.898-.348-.526 0-.936.259-1.232.778-.296.516-.444 1.246-.444 2.19 0 .63.066 1.165.199 1.606.132.44.323.775.572 1.005.25.23.552.344.905.344zm6.25.78c-.535 0-.99-.145-1.367-.436-.377-.294-.664-.719-.863-1.275-.199-.559-.298-1.234-.298-2.025 0-.786.099-1.457.298-2.013.201-.559.49-.985.866-1.278.38-.296.834-.444 1.364-.444.53 0 .984.148 1.36.444.379.293.668.72.867 1.278.2.556.301 1.227.301 2.013 0 .791-.099 1.466-.298 2.025-.199.556-.486.981-.863 1.275-.376.29-.832.436-1.367.436zm0-.78c.53 0 .942-.257 1.236-.768.293-.511.44-1.24.44-2.188 0-.63-.067-1.165-.202-1.608-.133-.443-.325-.78-.576-1.012-.248-.232-.548-.348-.898-.348-.526 0-.936.259-1.232.778-.296.516-.444 1.246-.444 2.19 0 .63.066 1.165.199 1.606.132.44.323.775.572 1.005.25.23.552.344.905.344zm6.25.78c-.535 0-.99-.145-1.367-.436-.377-.294-.664-.719-.863-1.275-.199-.559-.298-1.234-.298-2.025 0-.786.099-1.457.298-2.013.201-.559.49-.985.866-1.278.38-.296.834-.444 1.364-.444.53 0 .984.148 1.36.444.379.293.668.72.867 1.278.2.556.301 1.227.301 2.013 0 .791-.099 1.466-.298 2.025-.199.556-.486.981-.863 1.275-.376.29-.832.436-1.367.436zm0-.78c.53 0 .942-.257 1.236-.768.293-.511.44-1.24.44-2.188 0-.63-.067-1.165-.202-1.608-.133-.443-.325-.78-.576-1.012-.248-.232-.548-.348-.898-.348-.526 0-.936.259-1.232.778-.296.516-.444 1.246-.444 2.19 0 .63.066 1.165.199 1.606.132.44.323.775.572 1.005.25.23.552.344.905.344zm6.25.78c-.535 0-.99-.145-1.367-.436-.377-.294-.664-.719-.863-1.275-.199-.559-.298-1.234-.298-2.025 0-.786.099-1.457.298-2.013.201-.559.49-.985.866-1.278.38-.296.834-.444 1.364-.444.53 0 .984.148 1.36.444.379.293.668.72.867 1.278.2.556.301 1.227.301 2.013 0 .791-.099 1.466-.298 2.025-.199.556-.486.981-.863 1.275-.376.29-.832.436-1.367.436zm0-.78c.53 0 .942-.257 1.236-.768.293-.511.44-1.24.44-2.188 0-.63-.067-1.165-.202-1.608-.133-.443-.325-.78-.576-1.012-.248-.232-.548-.348-.898-.348-.526 0-.936.259-1.232.778-.296.516-.444 1.246-.444 2.19 0 .63.066 1.165.199 1.606.132.44.323.775.572 1.005.25.23.552.344.905.344zM156.753 265v-.639l2.4-2.628c.282-.308.514-.575.696-.803.183-.229.318-.445.405-.646.09-.204.135-.417.135-.639 0-.256-.061-.477-.184-.664-.121-.187-.287-.332-.498-.433-.21-.102-.447-.153-.71-.153-.279 0-.523.058-.731.174-.206.114-.366.273-.48.479-.111.206-.167.448-.167.725h-.838c0-.426.098-.8.295-1.122.196-.322.464-.573.803-.753.34-.18.723-.27 1.147-.27.426 0 .803.09 1.132.27.329.18.588.422.775.728.187.305.28.645.28 1.019 0 .267-.048.529-.146.785-.094.253-.26.536-.497.848-.234.311-.56.689-.976 1.137l-1.634 1.747v.057h3.381V265h-4.588zM194.21 265.099c-.469 0-.886-.08-1.253-.241-.365-.161-.655-.385-.87-.671-.213-.289-.329-.624-.348-1.005h.895c.018.234.099.437.241.607.142.168.328.298.558.391.229.092.484.138.763.138.313 0 .59-.054.831-.163.241-.109.431-.261.568-.455.137-.194.206-.419.206-.674 0-.268-.066-.504-.199-.707-.132-.206-.326-.367-.582-.483-.256-.116-.568-.174-.938-.174h-.582v-.781h.582c.289 0 .543-.052.76-.157.221-.104.392-.251.515-.44.126-.189.188-.412.188-.668 0-.246-.054-.46-.163-.642-.109-.183-.263-.325-.462-.426-.196-.102-.428-.153-.696-.153-.251 0-.487.046-.71.138-.22.09-.4.222-.54.395-.139.17-.215.376-.227.617h-.852c.014-.381.129-.715.344-1.001.216-.289.498-.514.846-.675.35-.161.735-.241 1.154-.241.449 0 .835.091 1.157.273.322.18.57.418.742.714.173.296.26.616.26.959 0 .409-.108.759-.323 1.047-.213.289-.504.489-.87.601v.056c.459.076.817.271 1.076.586.258.313.387.7.387 1.162 0 .395-.108.75-.324 1.065-.213.312-.504.559-.873.739-.369.179-.79.269-1.261.269zM226.582 263.509v-.725l3.196-5.057h.526v1.122h-.355l-2.415 3.821v.057h4.304v.782h-5.256zm3.424 1.491v-7.273h.838V265h-.838zM264.026 265.099c-.417 0-.792-.082-1.126-.248-.334-.166-.601-.393-.803-.682-.201-.289-.311-.618-.33-.987h.852c.033.329.183.601.448.817.267.213.587.319.959.319.298 0 .563-.07.795-.209.234-.14.418-.332.55-.576.135-.246.203-.524.203-.834 0-.317-.07-.6-.21-.849-.137-.251-.326-.448-.568-.593-.241-.144-.517-.218-.827-.22-.223-.002-.451.032-.686.103-.234.069-.427.157-.578.266l-.824-.099.44-3.58h3.778v.782h-3.039l-.256 2.144h.043c.149-.118.336-.216.561-.294.225-.078.459-.118.703-.118.445 0 .841.107 1.189.32.351.211.625.5.824.867.202.367.302.786.302 1.257 0 .464-.104.878-.312 1.243-.206.362-.49.648-.853.859-.362.208-.774.312-1.235.312zM299.168 265.099c-.299-.004-.597-.061-.895-.17-.299-.109-.571-.292-.817-.55-.246-.261-.444-.612-.593-1.055-.149-.445-.224-1.004-.224-1.676 0-.647.061-1.219.181-1.719.121-.502.296-.925.526-1.268.23-.343.507-.603.831-.781.327-.178.695-.266 1.104-.266.407 0 .77.081 1.087.245.32.163.58.39.781.681.201.289.332.624.391 1.005h-.867c-.08-.333-.236-.608-.468-.823-.232-.218-.54-.327-.924-.327-.563 0-1.007.246-1.331.739-.322.49-.485 1.181-.487 2.073h.057c.132-.201.29-.372.472-.515.185-.144.388-.255.611-.333.223-.078.458-.118.707-.118.416 0 .797.105 1.143.313.346.206.623.491.831.856.208.362.313.778.313 1.246 0 .45-.101.862-.302 1.236-.201.372-.484.668-.849.888-.362.218-.788.324-1.278.319zm0-.781c.298 0 .565-.074.802-.224.239-.149.427-.349.565-.6.139-.251.209-.53.209-.838 0-.3-.067-.574-.202-.82-.133-.249-.316-.446-.551-.593-.232-.147-.497-.22-.795-.22-.225 0-.434.045-.629.135-.194.087-.364.208-.511.362-.144.154-.258.33-.341.529-.083.197-.124.404-.124.621 0 .289.067.559.202.81.138.251.325.453.561.607.24.154.511.231.814.231zM331.98 265l3.253-6.435v-.056h-3.75v-.782h4.659v.824L332.903 265h-.923zM367.082 265.099c-.487 0-.918-.086-1.292-.259-.372-.175-.662-.415-.87-.721-.209-.307-.312-.658-.309-1.051-.003-.308.058-.592.181-.852.123-.263.291-.482.504-.657.216-.178.456-.29.721-.337v-.043c-.348-.09-.625-.285-.831-.586-.206-.303-.308-.647-.305-1.033-.003-.37.091-.7.28-.991.19-.291.45-.521.781-.689.334-.168.714-.252 1.14-.252.422 0 .798.084 1.13.252.331.168.592.398.781.689.192.291.289.621.291.991-.002.386-.108.73-.316 1.033-.206.301-.479.496-.82.586v.043c.263.047.499.159.71.337.211.175.379.394.504.657.126.26.19.544.192.852-.002.393-.109.744-.32 1.051-.208.306-.498.546-.87.721-.369.173-.796.259-1.282.259zm0-.781c.329 0 .614-.053.853-.16.239-.106.423-.256.554-.451.13-.194.196-.421.199-.681-.003-.275-.074-.518-.214-.728-.139-.211-.33-.377-.571-.498-.239-.12-.513-.181-.821-.181-.31 0-.587.061-.831.181-.241.121-.432.287-.571.498-.138.21-.205.453-.203.728-.002.26.061.487.188.681.131.195.317.345.558.451.241.107.528.16.859.16zm0-3.452c.261 0 .492-.052.693-.156.203-.104.363-.25.479-.437.116-.187.175-.406.178-.657-.003-.246-.061-.46-.174-.642-.114-.185-.271-.327-.472-.426-.202-.102-.436-.153-.704-.153-.272 0-.51.051-.713.153-.204.099-.361.241-.473.426-.111.182-.165.396-.163.642-.002.251.053.47.167.657.116.187.276.333.479.437.204.104.438.156.703.156zM402.068 257.614c.298.002.597.059.895.17.298.111.571.296.817.554.246.258.444.61.593 1.055.149.442.224 1 .224 1.672 0 .647-.062 1.221-.185 1.723-.121.499-.296.921-.526 1.264-.227.343-.504.604-.831.781-.324.178-.691.266-1.1.266-.408 0-.771-.08-1.091-.241-.317-.163-.577-.389-.781-.678-.201-.292-.33-.629-.387-1.012h.866c.079.333.234.609.466.827.234.215.543.323.927.323.561 0 1.003-.245 1.328-.735.326-.49.49-1.182.49-2.077h-.057c-.133.199-.29.37-.472.515-.183.144-.385.255-.608.333-.222.079-.459.118-.71.118-.417 0-.799-.103-1.147-.309-.346-.209-.623-.494-.831-.856-.206-.365-.309-.781-.309-1.25 0-.45.1-.861.299-1.232.201-.372.482-.668.845-.888.364-.22.793-.328 1.285-.323zm0 .781c-.298 0-.567.074-.806.224-.237.149-.425.349-.565.6-.137.251-.206.53-.206.838 0 .303.067.579.199.827.135.246.319.443.551.59.234.144.5.216.799.216.225 0 .434-.043.628-.131.194-.09.364-.212.508-.366.147-.156.262-.332.345-.529.082-.199.124-.406.124-.621 0-.289-.069-.559-.206-.81-.135-.251-.322-.453-.561-.607-.237-.154-.507-.231-.81-.231zM434.31 257.727V265h-.881v-6.349h-.043l-1.775 1.179v-.895l1.818-1.208h.881zm4.463 7.372c-.535 0-.99-.145-1.367-.436-.376-.294-.664-.719-.863-1.275-.199-.559-.298-1.234-.298-2.024 0-.786.099-1.458.298-2.014.202-.559.49-.985.867-1.278.379-.296.833-.444 1.363-.444.531 0 .984.148 1.361.444.378.293.667.719.866 1.278.201.556.302 1.228.302 2.014 0 .79-.1 1.465-.298 2.024-.199.556-.487.981-.863 1.275-.377.291-.833.436-1.368.436zm0-.781c.531 0 .943-.256 1.236-.767.294-.511.441-1.24.441-2.187 0-.63-.068-1.166-.203-1.609-.132-.443-.324-.78-.575-1.012-.249-.232-.548-.348-.899-.348-.525 0-.936.259-1.232.778-.296.516-.444 1.246-.444 2.191 0 .629.067 1.164.199 1.605.133.44.323.775.572 1.005.251.229.553.344.905.344zM468.31 257.727V265h-.881v-6.349h-.043l-1.775 1.179v-.895l1.818-1.208h.881zm4.648 0V265h-.881v-6.349h-.042l-1.776 1.179v-.895l1.818-1.208h.881zM502.31 257.727V265h-.881v-6.349h-.043l-1.775 1.179v-.895l1.818-1.208h.881zm2.091 7.273v-.639l2.401-2.628c.282-.308.514-.575.696-.803.182-.229.317-.445.405-.646.09-.204.135-.417.135-.639 0-.256-.062-.477-.185-.664-.121-.187-.286-.332-.497-.433-.211-.102-.448-.153-.71-.153-.28 0-.524.058-.732.174-.206.114-.366.273-.479.479-.112.206-.167.448-.167.725h-.838c0-.426.098-.8.294-1.122.197-.322.464-.573.803-.753.341-.18.723-.27 1.147-.27.426 0 .804.09 1.133.27.329.18.587.422.774.728.187.305.281.645.281 1.019 0 .267-.049.529-.146.785-.095.253-.261.536-.497.848-.235.311-.56.689-.977 1.137l-1.633 1.747v.057h3.38V265h-4.588zM536.31 257.727V265h-.881v-6.349h-.043l-1.775 1.179v-.895l1.818-1.208h.881zm4.549 7.372c-.469 0-.887-.08-1.254-.241-.364-.161-.654-.385-.87-.671-.213-.289-.329-.624-.348-1.005h.895c.019.234.099.437.241.607.142.168.328.298.558.391.23.092.484.138.763.138.313 0 .59-.054.831-.163.242-.109.431-.261.569-.455.137-.194.206-.419.206-.674 0-.268-.067-.504-.199-.707-.133-.206-.327-.367-.583-.483-.255-.116-.568-.174-.937-.174h-.583v-.781h.583c.289 0 .542-.052.76-.157.22-.104.392-.251.515-.44.125-.189.188-.412.188-.668 0-.246-.055-.46-.163-.642-.109-.183-.263-.325-.462-.426-.197-.102-.429-.153-.696-.153-.251 0-.488.046-.71.138-.221.09-.4.222-.54.395-.14.17-.216.376-.227.617h-.853c.015-.381.129-.715.345-1.001.215-.289.497-.514.845-.675.35-.161.735-.241 1.154-.241.45 0 .836.091 1.158.273.322.18.569.418.742.714.173.296.259.616.259.959 0 .409-.108.759-.323 1.047-.213.289-.503.489-.87.601v.056c.459.076.818.271 1.076.586.258.313.387.7.387 1.162 0 .395-.108.75-.323 1.065-.213.312-.504.559-.874.739-.369.179-.789.269-1.26.269zM571.31 257.727V265h-.881v-6.349h-.043l-1.775 1.179v-.895l1.818-1.208h.881zm1.921 5.782v-.725l3.196-5.057h.525v1.122h-.355l-2.414 3.821v.057h4.304v.782h-5.256zm3.423 1.491v-7.273h.838V265h-.838zM604.31 257.727V265h-.881v-6.349h-.043l-1.775 1.179v-.895l1.818-1.208h.881zm4.364 7.372c-.417 0-.792-.082-1.126-.248-.334-.166-.601-.393-.802-.682-.201-.289-.312-.618-.331-.987h.853c.033.329.182.601.447.817.268.213.587.319.959.319.298 0 .563-.07.795-.209.235-.14.418-.332.551-.576.135-.246.202-.524.202-.834 0-.317-.07-.6-.209-.849-.138-.251-.327-.448-.568-.593-.242-.144-.518-.218-.828-.22-.222-.002-.451.032-.685.103-.235.069-.428.157-.579.266l-.824-.099.44-3.58h3.779v.782h-3.04l-.256 2.144h.043c.149-.118.336-.216.561-.294.225-.078.459-.118.703-.118.445 0 .842.107 1.19.32.35.211.625.5.824.867.201.367.302.786.302 1.257 0 .464-.105.878-.313 1.243-.206.362-.49.648-.852.859-.362.208-.774.312-1.236.312zM638.31 257.727V265h-.881v-6.349h-.043l-1.775 1.179v-.895l1.818-1.208h.881zm4.506 7.372c-.298-.004-.597-.061-.895-.17-.298-.109-.57-.292-.817-.55-.246-.261-.443-.612-.593-1.055-.149-.445-.223-1.004-.223-1.676 0-.647.06-1.219.181-1.719.12-.502.296-.925.525-1.268.23-.343.507-.603.831-.781.327-.178.695-.266 1.105-.266.407 0 .769.081 1.086.245.32.163.58.39.782.681.201.289.331.624.39 1.005h-.866c-.081-.333-.237-.608-.469-.823-.232-.218-.54-.327-.923-.327-.564 0-1.008.246-1.332.739-.322.49-.484 1.181-.486 2.073h.056c.133-.201.29-.372.473-.515.184-.144.388-.255.61-.333.223-.078.459-.118.707-.118.417 0 .798.105 1.144.313.345.206.622.491.831.856.208.362.312.778.312 1.246 0 .45-.101.862-.302 1.236-.201.372-.484.668-.849.888-.362.218-.788.324-1.278.319zm0-.781c.298 0 .566-.074.803-.224.239-.149.427-.349.564-.6.14-.251.21-.53.21-.838 0-.3-.068-.574-.203-.82-.132-.249-.316-.446-.55-.593-.232-.147-.497-.22-.796-.22-.224 0-.434.045-.628.135-.194.087-.365.208-.511.362-.145.154-.259.33-.341.529-.083.197-.125.404-.125.621 0 .289.068.559.203.81.137.251.324.453.561.607.239.154.51.231.813.231z"/>
    <path fill="#FFE4BB" stroke="#FFBE57" d="M120.5 95.942H134.5V244.942H120.5zM154.5 95.942H168.5V244.942H154.5zM188.5 125.942H202.5V244.942H188.5zM222.5 145.942H236.5V244.942H222.5zM256.5 145.942H270.5V244.942H256.5zM291.5 145.942H304.5V244.942H291.5zM325.5 155.942H338.5V244.942H325.5zM359.5 155.942H372.5V244.942H359.5z"/>
    <path fill="#333" d="M336.84 290.08V297h-.91v-5.16l-2.3 5.16h-.64l-2.31-5.17V297h-.91v-6.92h.98l2.56 5.72 2.56-5.72h.97zm3.933 7.01c-.513 0-.98-.117-1.4-.35-.413-.233-.74-.563-.98-.99-.233-.433-.35-.933-.35-1.5 0-.56.12-1.053.36-1.48.247-.433.58-.763 1-.99.42-.233.89-.35 1.41-.35.52 0 .99.117 1.41.35.42.227.75.553.99.98.247.427.37.923.37 1.49s-.126 1.067-.38 1.5c-.246.427-.583.757-1.01.99-.426.233-.9.35-1.42.35zm0-.8c.327 0 .634-.077.92-.23.287-.153.517-.383.69-.69.18-.307.27-.68.27-1.12 0-.44-.086-.813-.26-1.12-.173-.307-.4-.533-.68-.68-.28-.153-.583-.23-.91-.23-.333 0-.64.077-.92.23-.273.147-.493.373-.66.68-.166.307-.25.68-.25 1.12 0 .447.08.823.24 1.13.167.307.387.537.66.69.274.147.574.22.9.22zm6.677-4.87c.666 0 1.206.203 1.62.61.413.4.62.98.62 1.74V297h-.9v-3.1c0-.547-.137-.963-.41-1.25-.274-.293-.647-.44-1.12-.44-.48 0-.864.15-1.15.45-.28.3-.42.737-.42 1.31V297h-.91v-5.48h.91v.78c.18-.28.423-.497.73-.65.313-.153.656-.23 1.03-.23zm4.836.85v3.23c0 .267.057.457.17.57.114.107.31.16.59.16h.67v.77h-.82c-.506 0-.886-.117-1.14-.35-.253-.233-.38-.617-.38-1.15v-3.23h-.71v-.75h.71v-1.38h.91v1.38h1.43v.75h-1.43zm5.253-.85c.413 0 .786.09 1.12.27.333.173.593.437.78.79.193.353.29.783.29 1.29V297h-.9v-3.1c0-.547-.137-.963-.41-1.25-.274-.293-.647-.44-1.12-.44-.48 0-.864.15-1.15.45-.28.3-.42.737-.42 1.31V297h-.91v-7.4h.91v2.7c.18-.28.426-.497.74-.65.32-.153.676-.23 1.07-.23zm4.586-1.82v7.4h-.91v-7.4h.91zm6.271 1.92l-3.3 8.06h-.94l1.08-2.64-2.21-5.42h1.01l1.72 4.44 1.7-4.44h.94zm7.251 5.48l-1.66-2.85h-1.1V297h-.91v-6.97h2.25c.527 0 .97.09 1.33.27.367.18.64.423.82.73.18.307.27.657.27 1.05 0 .48-.14.903-.42 1.27-.273.367-.687.61-1.24.73l1.75 2.92h-1.09zm-2.76-3.58h1.34c.493 0 .863-.12 1.11-.36.247-.247.37-.573.37-.98 0-.413-.123-.733-.37-.96-.24-.227-.61-.34-1.11-.34h-1.34v2.64zm4.834.82c0-.56.113-1.05.34-1.47.227-.427.537-.757.93-.99.4-.233.843-.35 1.33-.35.48 0 .897.103 1.25.31.353.207.617.467.79.78v-1h.92V297h-.92v-1.02c-.18.32-.45.587-.81.8-.353.207-.767.31-1.24.31-.487 0-.927-.12-1.32-.36s-.703-.577-.93-1.01c-.227-.433-.34-.927-.34-1.48zm4.64.01c0-.413-.083-.773-.25-1.08-.167-.307-.393-.54-.68-.7-.28-.167-.59-.25-.93-.25-.34 0-.65.08-.93.24-.28.16-.503.393-.67.7-.167.307-.25.667-.25 1.08 0 .42.083.787.25 1.1.167.307.39.543.67.71.28.16.59.24.93.24.34 0 .65-.08.93-.24.287-.167.513-.403.68-.71.167-.313.25-.677.25-1.09zm3.568-1.98v3.23c0 .267.056.457.17.57.113.107.31.16.59.16h.67v.77h-.82c-.507 0-.887-.117-1.14-.35-.254-.233-.38-.617-.38-1.15v-3.23h-.71v-.75h.71v-1.38h.91v1.38h1.43v.75h-1.43zm7.532 1.78c0 .173-.01.357-.03.55h-4.38c.034.54.217.963.55 1.27.34.3.75.45 1.23.45.394 0 .72-.09.98-.27.267-.187.454-.433.56-.74h.98c-.146.527-.44.957-.88 1.29-.44.327-.986.49-1.64.49-.52 0-.986-.117-1.4-.35-.406-.233-.726-.563-.96-.99-.233-.433-.35-.933-.35-1.5s.114-1.063.34-1.49c.227-.427.544-.753.95-.98.414-.233.887-.35 1.42-.35.52 0 .98.113 1.38.34.4.227.707.54.92.94.22.393.33.84.33 1.34zm-.94-.19c0-.347-.076-.643-.23-.89-.153-.253-.363-.443-.63-.57-.26-.133-.55-.2-.87-.2-.46 0-.853.147-1.18.44-.32.293-.503.7-.55 1.22h3.46zm4.082 3.23c-.42 0-.797-.07-1.13-.21-.334-.147-.597-.347-.79-.6-.194-.26-.3-.557-.32-.89h.94c.026.273.153.497.38.67.233.173.536.26.91.26.346 0 .62-.077.82-.23.2-.153.3-.347.3-.58 0-.24-.107-.417-.32-.53-.214-.12-.544-.237-.99-.35-.407-.107-.74-.213-1-.32-.254-.113-.474-.277-.66-.49-.18-.22-.27-.507-.27-.86 0-.28.083-.537.25-.77.166-.233.403-.417.71-.55.306-.14.656-.21 1.05-.21.606 0 1.096.153 1.47.46.373.307.573.727.6 1.26h-.91c-.02-.287-.137-.517-.35-.69-.207-.173-.487-.26-.84-.26-.327 0-.587.07-.78.21-.194.14-.29.323-.29.55 0 .18.056.33.17.45.12.113.266.207.44.28.18.067.426.143.74.23.393.107.713.213.96.32.246.1.456.253.63.46.18.207.273.477.28.81 0 .3-.084.57-.25.81-.167.24-.404.43-.71.57-.3.133-.647.2-1.04.2z"/>
    <rect width="11" height="10" x="311.5" y="288.5" fill="#FFE4BB" stroke="#FFBE57" rx=".5"/>
    <path fill="#FFE4BB" stroke="#FFBE57" d="M393.5 165.942H406.5V244.942H393.5zM427.5 185.942H440.5V244.942H427.5zM461.5 195.942H475.5V244.942H461.5zM495.5 195.942H509.5V244.942H495.5zM529.5 215.942H543.5V244.942H529.5zM563.5 215.942H577.5V244.942H563.5zM597.5 215.942H611.5V244.942H597.5zM632.5 225.942H645.5V244.942H632.5z"/>
    <defs>
        <filter id="filter0_ddd" width="698" height="360" x="0" y="0" color-interpolation-filters="sRGB" filterUnits="userSpaceOnUse">
            <feFlood flood-opacity="0" result="BackgroundImageFix"/>
            <feColorMatrix in="SourceAlpha" values="0 0 0 0 0 0 0 0 0 0 0 0 0 0 0 0 0 0 127 0"/>
            <feOffset dy="16"/>
            <feGaussianBlur stdDeviation="12"/>
            <feColorMatrix values="0 0 0 0 0 0 0 0 0 0 0 0 0 0 0 0 0 0 0.02 0"/>
            <feBlend in2="BackgroundImageFix" result="effect1_dropShadow"/>
            <feColorMatrix in="SourceAlpha" values="0 0 0 0 0 0 0 0 0 0 0 0 0 0 0 0 0 0 127 0"/>
            <feOffset dy="4"/>
            <feGaussianBlur stdDeviation="4"/>
            <feColorMatrix values="0 0 0 0 0 0 0 0 0 0 0 0 0 0 0 0 0 0 0.02 0"/>
            <feBlend in2="effect1_dropShadow" result="effect2_dropShadow"/>
            <feColorMatrix in="SourceAlpha" values="0 0 0 0 0 0 0 0 0 0 0 0 0 0 0 0 0 0 127 0"/>
            <feOffset/>
            <feGaussianBlur stdDeviation=".5"/>
            <feColorMatrix values="0 0 0 0 0 0 0 0 0 0 0 0 0 0 0 0 0 0 0.02 0"/>
            <feBlend in2="effect2_dropShadow" result="effect3_dropShadow"/>
            <feBlend in="SourceGraphic" in2="effect3_dropShadow" result="shape"/>
        </filter>
    </defs>
</svg>
