<svg xmlns="http://www.w3.org/2000/svg" width="1440" height="1018" fill="none" viewBox="0 0 1440 1018">
    <g filter="url(#filter0_f)">
        <ellipse cx="720" cy="399" fill="url(#paint0_angular)" rx="720" ry="399"/>
    </g>
    <g opacity=".64">
        <mask id="kzgfu8w6aa" width="864" height="798" x="286" y="0" maskUnits="userSpaceOnUse">
            <path fill="url(#paint1_linear)" d="M0 0H862.454V798H0z" transform="matrix(-1 0 0 1 1149.28 0)"/>
        </mask>
        <g fill="#EB9200" mask="url(#kzgfu8w6aa)">
            <path d="M232.505 985.829c21.552 11.017 47.724 13.063 72.59 11.377 25.095-1.697 49.813-7.298 73.013-16.544 43.72-17.403 81.995-45.637 113.877-77.243 34.868-34.506 63.482-74.841 80.797-118.305 8.262-20.279 13.43-41.355 15.363-62.655 1.92-23.449-.451-46.95-4.581-69.917-9.49-52.863-28.324-103.869-47.374-154.239-8.927-23.442-19.054-46.786-25.831-70.873-7.144-25.712-11.017-52.148-11.548-78.825-.607-25.946 1.578-52.381 9.061-77.775 7.517-25.731 23.395-47.695 47.617-64.033 18.05-12.193 38.948-21.917 58.847-31.434 27.468-13.133 57.785-14.04 87.701-17.242 28.482-3.059 56.99-7.091 84.827-13.874 25.2-6.15 51.018-14.574 72.184-28.859 17.343-11.638 29.628-27.848 39.458-44.745 12.931-22.176 22.576-45.684 33.061-68.746 6.439-14.129 13.06-28.183 20.105-42.098.347-.693-.956-.3-1.196.165-13.194 26.066-24.577 52.72-36.904 79.096-9.691 20.727-20.092 42.093-36.441 59.647-17.198 18.545-41.265 29.826-66.211 37.861-28.135 9.057-57.651 14.205-87.022 17.995-26.559 3.431-54.334 3.677-80.42 9.818-22.734 5.341-42.968 16.843-63.305 27.217-19.909 10.149-38.699 22.214-52.452 38.776-15.77 19.075-22.713 41.952-26.555 64.75-8.068 49.653-3.838 99.875 12.392 147.156 17.026 49.247 37.856 97.235 52.965 147.082 14.101 46.476 26.176 96.22 19.032 145.153-6.618 45.43-29.028 89.05-58.123 127.249-55.741 73.171-152.53 146.576-257.485 133.673-12.902-1.428-25.293-5.016-36.517-10.577-.497-.246-1.521.654-.925.969z"/>
            <path d="M241.464 987.65c21.142 10.844 46.909 12.76 71.309 11.007 24.894-1.776 49.386-7.481 72.313-16.843 43.651-17.847 81.66-46.594 113.281-78.394 34.414-34.548 62.864-74.519 80.775-117.543 8.729-20.436 14.393-41.71 16.844-63.264 2.486-23.902.594-47.901-3.158-71.407-8.426-52.665-26.17-103.61-44.377-153.869-8.612-23.73-18.626-47.29-25.213-71.598-6.835-25.534-10.641-51.721-11.354-78.142-.766-25.85 1.092-52.172 7.909-77.615 7.015-26.114 22.3-49.036 45.601-66.721 9.061-6.702 18.618-12.851 28.603-18.402 9.31-5.327 18.515-11.139 28.191-15.884 26.689-13.12 56.601-13.727 85.838-16.567 29.237-2.84 58.426-6.454 87.052-12.92 24.711-5.578 50.119-13.184 71.251-26.451 40.077-25.246 57.342-70.974 74.528-109.392 6.273-14.016 12.52-28.049 19.002-42 .327-.7-.976-.306-1.196.165-12.124 26.121-23.096 52.515-35.824 78.366-9.984 20.253-21.305 40.802-38.298 57.42-18.102 17.666-42.369 27.973-67.34 35.308-28.396 8.305-57.962 12.862-87.366 16.247-26.89 3.1-55.244 3.065-81.585 9.581-22.233 5.502-41.209 17.424-60.316 28.719-18.175 10.713-35.172 23.081-47.805 39.051-15.867 20.064-22.832 43.55-26.477 67.225-7.347 49.582-3.076 99.603 12.544 146.924 16.32 49.244 36.514 97.212 50.709 147.09 13.403 47.138 24.452 97.533 16.211 146.853-7.6 45.546-30.564 89.18-59.856 127.493-55.381 72.597-150.496 147.603-255.194 134.973-12.657-1.369-24.812-4.883-35.807-10.352-.484-.252-1.508.649-.919.981l.124-.039z"/>
            <path d="M250.472 989.324c21.033 10.846 46.784 12.546 71.059 10.586 24.315-1.963 48.194-7.745 70.511-17.073 42.612-17.873 79.631-46.335 110.756-77.545 34.432-34.514 63.121-74.239 82.001-116.94 9.271-20.457 15.613-41.779 18.876-63.455 3.354-23.927 2.235-48.105-.885-71.785-6.907-52.579-23.459-103.605-40.828-153.791-8.253-23.843-18-47.476-24.685-71.756-6.653-24.537-10.64-49.66-11.909-75.033-2.782-51.453 1.952-109.316 45.269-149.267 8.698-7.83 18.099-15.024 28.103-21.505 9.338-6.203 18.787-12.873 28.779-18.186 26.703-14.268 57.788-14.25 87.426-17.863 29.122-3.557 58.166-8.07 86.88-14.059 14.337-2.985 28.594-6.341 42.727-10.34 11.053-3.107 22.5-6.258 32.735-11.286 41.665-20.352 58.162-67.41 73.297-103.998 5.927-14.313 11.739-28.66 17.761-42.944.15-.33-.971.291-1.094.581-11.16 26.433-21.228 53.273-33.694 79.291-9.978 20.822-21.969 42.677-41.872 57.73-20.575 15.55-49.899 21.257-75.163 27.004-28.972 6.476-58.251 11.62-87.719 15.409-12.697 1.686-25.414 3.167-38.152 4.443-14.491 1.449-28.768 2.694-42.735 7.012-20.498 6.318-38.255 18.984-55.24 30.789-16.984 11.804-32.185 25.198-43.312 41.538-14.028 20.583-20.089 43.833-23.16 67.192-6.28 49.494-1.639 99.249 13.663 146.485 16.147 49.499 35.504 97.925 48.669 148.288 12.066 46.166 21.436 95.33 12.989 143.262-7.978 45.248-30.805 88.712-59.531 127.129-29.692 39.739-67.175 76.191-111.562 103.36-41.952 25.619-93.592 42.123-144.059 36.021-12.31-1.335-24.126-4.776-34.796-10.131-.345-.172-1.222.734-1.157.86l.052-.023z"/>
            <path d="M259.614 991.137c21.243 11.013 47.538 12.363 72.009 10.033 23.97-2.261 47.439-8.31 69.288-17.852 43.305-18.98 80.592-48.937 111.818-81.375 33.797-35.091 62.015-75.046 80.739-117.862 9.126-20.363 15.382-41.563 18.622-63.109 3.4-24.057 2.543-48.348-.3-72.203-6.34-53.032-22.26-104.539-39.128-155.247-7.746-23.295-16.942-46.328-23.06-70.071-6.297-24.904-10.057-50.335-11.235-75.991-2.574-50.957 2.196-106.676 42.141-147.909 7.884-7.991 16.453-15.436 25.625-22.266 8.867-6.711 17.943-13.917 27.777-19.441 26.164-14.692 57.435-14.531 86.829-17.718 28.844-3.103 57.728-6.934 86.343-12.03 25.117-4.484 52.617-8.821 76.004-18.876 43.13-18.543 61.684-64.073 76.79-100.997 5.876-14.348 11.359-28.804 16.888-43.267.161-.431-1.024.19-1.167.502-10.515 27.493-20.591 55.34-34.375 81.814-10.439 20.086-23.695 40.52-44.331 53.908-21.597 14.01-50.963 18.676-76.376 23.608-28.5 5.534-57.324 9.605-86.239 12.975-12.527 1.455-25.079 2.772-37.653 3.95-13.294 1.254-26.51 2.225-39.407 5.888-21.712 6.17-39.093 19.469-55.984 32.725-15.951 12.531-30.28 26.805-40.654 43.392-13.314 21.281-19.157 44.828-21.898 68.546-5.584 49.876-.736 99.903 14.301 147.563 15.353 48.461 33.461 95.959 45.587 145.306 11.726 47.677 20.392 98.483 10.477 147.729-9.129 45.408-32.57 88.802-61.593 127.388-29.583 39.33-66.486 75.756-110.255 103.16-41.629 25.997-93.405 43.1-143.852 36.574-11.595-1.358-22.714-4.655-32.772-9.719-.333-.178-1.382.706-.968.918l.009-.046z"/>
            <path d="M268.603 992.865c20.313 10.575 45.305 12.015 68.737 9.935 23.931-2.1 47.378-8.076 69.168-17.621 42.685-18.783 79.29-48.572 110.159-80.494 34.553-35.765 63.554-76.405 83.28-119.888 9.226-19.839 15.875-40.472 19.813-61.489 4.34-24.531 4.168-49.45 1.81-73.918-5.07-53.147-19.92-105.002-36.064-155.951-7.385-23.311-16.276-46.28-22.298-69.869-6.311-24.98-10.234-50.459-11.728-76.169-3.14-51.091.608-106.523 36.942-149.995 7.26-8.557 15.285-16.595 23.991-24.031 8.859-7.656 18.115-15.845 28.496-21.8 25.632-14.728 56.981-14.322 85.942-17.015 28.96-2.694 58.057-5.836 86.9-10.179 14.88-2.216 29.589-4.762 44.22-7.86 11.136-2.39 22.509-4.785 33.017-9.037 43.225-17.525 63.393-60.71 78.27-97.55 5.744-14.262 10.886-28.697 15.855-43.156.141-.41-1.019.229-1.154.495-9.329 27.123-18.965 54.49-32.946 80.21-10.918 20.028-25.152 40.087-46.562 52.693-22.087 13.064-50.571 16.863-75.971 21.078-28.787 4.794-57.841 8.141-86.856 11.039-12.612 1.24-25.232 2.372-37.851 3.476-13.224 1.141-26.458 1.952-39.311 5.485-21.422 5.892-37.493 18.781-53.28 32.497-15.788 13.715-29.72 29.281-39.731 46.912-12.434 21.989-17.938 45.851-20.336 69.923-4.732 49.886.286 99.81 14.834 147.571 14.746 48.401 32.149 95.868 43.362 145.217 10.928 48.118 18.462 99.243 7.678 148.639-9.689 44.326-32.574 86.658-60.484 124.668-29.683 40.376-66.676 78.054-110.837 106.588-40.819 26.415-91.595 44.121-141.954 38.481-12.037-1.18-23.599-4.485-34.006-9.723-.376-.201-1.338.729-1.157.86l.052-.022z"/>
            <path d="M277.675 994.636c20.241 10.594 45.289 11.794 68.647 9.514 23.938-2.32 47.331-8.593 68.958-18.492 42.718-19.648 79.18-50.393 109.907-82.993 34.48-36.556 63.479-77.851 83.333-121.89 9.198-19.854 15.853-40.486 19.84-61.5 4.471-25.02 4.533-50.417 2.417-75.407-4.531-53.252-18.693-105.264-34.232-156.376-7.016-23.093-15.543-45.856-21.123-69.301-6.005-25.357-9.762-51.159-11.238-77.174-2.987-51.198 1.18-105.389 35.27-149.945 7.105-9.168 15.031-17.83 23.697-25.898 10.254-9.636 20.805-19.009 34.423-24.808 25.29-10.776 55.289-9.511 82.383-10.732 27.885-1.241 55.843-2.681 83.593-6.29 25.247-3.271 51.22-8.081 74.296-18.615 41.762-19.112 65.115-56.111 80.642-93.677 5.783-13.972 10.576-28.244 14.984-42.517.127-.375-1.008.28-1.099.57-14.151 46.076-33.435 99.517-80.921 127.975-22.027 13.179-47.993 19.366-73.534 23.433-28.894 4.616-58.173 6.415-87.318 7.793-24.204 1.136-50.058.264-73.889 5.435-22.747 4.915-38.948 17.024-54.692 31.878-14.816 13.689-27.27 29.219-36.934 46.058-12.7 22.717-18.813 47.258-21.226 72.076-4.888 49.886.543 101.316 14.067 149.308 6.527 23.108 14.768 45.813 21.586 68.865 7.379 24.971 14.198 50.1 19.655 75.507 10.386 48.338 17.244 99.461 6.773 148.932-9.554 45.145-32.8 88.358-60.925 127.255-29.679 41.126-66.537 79.778-110.708 109.376-40.533 27.184-90.975 45.724-141.622 40.324-12.004-1.09-23.541-4.351-33.902-9.579-.352-.183-1.229.724-1.158.86l.05.035z"/>
            <path d="M286.841 996.455c19.83 10.445 44.575 11.405 67.462 9.025 23.773-2.42 47.006-8.627 68.564-18.328 44.124-20.029 81.13-52.541 112.071-86.46 34.108-37.4 62.733-79.356 82.512-123.879 9.396-20.568 16.136-41.935 20.088-63.684 4.229-24.776 4.488-49.854 2.626-74.632-3.941-52.67-17.106-104.273-31.842-154.978-6.667-22.978-14.857-45.552-20.192-68.865-5.998-26.316-9.773-53.058-11.294-80.008-2.948-51.369 1.486-104.92 33.553-150.475 12.935-18.358 30.452-39.354 52.595-49.335 24.533-11.063 54.158-9.623 80.625-10.352 28.351-.773 56.767-1.545 85.067-4.4 25.381-2.549 51.493-6.471 75.133-15.853 43.602-17.352 68.846-53.143 84.273-91.586 5.477-13.841 10.111-27.909 13.878-42.14.21-.773-1.08-.454-1.24.114-12.333 45.589-31.471 96.862-78.902 123.973-21.893 12.507-47.323 18.338-72.516 21.963-27.806 3.995-55.926 5.337-83.93 6.225-24.451.755-49.485.101-73.815 3.257-13.396 1.564-26.307 5.864-37.702 12.557-8.698 5.273-15.782 12.208-22.64 19.24-33.687 34.528-51.101 76.223-55.032 120.805-4.454 50.229 1.22 101.694 14.073 150.156 6.162 23.208 14.292 45.975 20.804 69.117 7.13 25.357 13.66 50.889 18.844 76.665 9.856 49.792 15.705 102.464 3.511 153.066-10.955 45.441-34.782 88.833-63.196 128.161-29.217 40.44-65.071 78.646-108.249 108.027-39.942 27.181-90.799 45.939-140.98 40.889-11.737-.99-23.022-4.15-33.133-9.274-.552-.292-1.52.654-.9.987l-.116.022z"/>
            <path d="M295.804 998.177c20.086 10.633 45.257 11.393 68.389 8.713 23.394-2.65 46.156-9.236 67.052-19.395 42.832-21.008 78.781-53.302 109.257-86.882 34.388-37.91 63.533-80.285 84.091-125.101 9.35-19.911 16.295-40.576 20.714-61.639 5.122-25.899 5.96-52.117 4.473-78.061-3.1-53.77-15.822-106.498-30.199-158.305-6.257-22.527-13.995-44.598-18.998-67.426-5.706-26.045-9.429-52.46-11.145-79.069-3.378-51.922.458-106.04 30.342-153.179 13.924-21.961 32.672-45.439 60.774-53.506 24.287-6.985 52.154-5.04 77.127-5.28 29.511-.267 59.128-.608 88.609-3.442 24.027-2.314 48.539-6.078 70.92-15.073 42.066-16.915 67.017-51.2 81.201-88.76 4.839-13.071 8.799-26.36 11.859-39.793-.05-.091-1.07.377-1.21.758-10.991 46.891-31.21 98.337-82.184 122.998-22.507 10.889-47.913 15.525-72.861 18.292-29.533 3.26-59.267 3.776-88.862 4.066-22.692.221-46.105-.767-68.731 2.242-24.502 3.257-42.521 14.643-57.734 31.666-31.475 35.18-46.945 77.934-50.354 121.636-4.012 51.392 2.191 103.912 15.01 153.545 5.781 22.411 13.379 44.43 19.376 66.762 6.913 25.744 13.123 51.677 17.869 77.879 8.863 48.895 13.586 100.196 2.12 149.635-10.665 45.846-34.759 89.743-63.013 129.505-29.471 41.497-65.399 80.892-108.658 111.882-39.757 28.467-89.703 48.675-140.887 43.635-11.749-.97-23.047-4.13-33.159-9.26-.332-.178-1.223.735-1.164.849l-.024.108z"/>
            <path d="M304.876 999.933c19.7 10.477 44.496 11.157 67.212 8.447 23.478-2.73 46.287-9.497 67.128-19.925 42.79-21.644 78.417-54.623 108.763-88.579 34.122-38.269 63.134-80.685 84.061-125.562 9.739-20.388 17.05-41.553 21.81-63.142 5.343-25.38 6.639-51.21 5.668-76.776-2.068-54.562-14.137-108.226-28.002-160.811-5.872-22.246-13.316-43.998-18.148-66.495-5.677-26.409-9.507-53.159-11.471-80.1-3.797-52.578-.665-107.592 27.436-156.195 13.724-23.771 32.325-47.255 63.2-53.866 24.367-5.22 51.113-2.933 75.728-2.657 28.423.326 56.885.509 85.319-1.498 25.018-1.765 50.605-5.029 74.063-13.957 41.694-15.807 67.006-48.588 80.417-85.758 4.51-12.842 8.05-25.909 10.59-39.11.04-.2-1.08.336-1.15.717-9.33 46.5-29.288 96.229-80.271 119.542-22.945 10.506-48.62 14.686-73.801 16.939-29.195 2.613-58.498 2.568-87.688 2.279-22.549-.216-45.314-1.19-67.896.573-25.214 1.974-45.293 12.196-60.578 30.226-30.844 36.4-44.377 81.472-47.147 125.666-3.256 51.708 3.477 104.321 15.931 154.334 5.587 22.438 13.001 44.412 18.673 66.827 6.456 25.48 12.216 51.134 16.533 77.031 8.379 50.469 12.234 103.469-.92 154.26-11.686 45.142-35.628 88.249-63.461 127.648-29.395 41.675-64.904 81.446-107.743 113.093-39.42 29.117-89.123 50.166-140.641 45.136-11.527-.92-22.611-4.01-32.513-9.068-.37-.189-1.338.729-1.157.858l.055-.077z"/>
            <path d="M313.946 1001.69c19.654 10.51 44.493 10.94 67.121 8.06 23.756-2.96 46.757-10.143 67.6-21.123 42.133-22.296 76.986-55.624 106.863-89.741 33.878-38.681 62.828-81.278 84.117-126.228 9.768-20.152 17.273-41.044 22.405-62.366 5.994-25.981 7.83-52.531 7.29-78.811-1.149-53.871-12.104-106.996-25.038-159.173-5.673-22.791-13.138-45.049-18.026-68.025-5.648-26.41-9.637-53.129-11.949-80.033-4.477-52.9-2.743-108.818 22.863-158.774 4.76-9.388 10.471-18.4 17.063-26.92 11.756-15.063 27.669-25.223 47.99-28.537 24.161-3.947 49.959-1.447 74.141-.678 29.339.949 58.882 1.797 88.375.227 24.186-1.296 48.807-4.075 71.743-11.998 42.085-14.525 68.346-46.113 81.116-83.537 4.2-12.633 7.35-25.493 9.4-38.472.02-.148-1.09.371-1.21.757-7.88 47.144-28.274 96.114-81.068 117.599-23.106 9.39-48.477 12.826-73.327 14.449-28.833 1.886-57.685 1.229-86.371.333-23.598-.727-47.485-2.32-71.165-.726-24.04 1.609-44.448 11.011-58.744 28.629-29.865 36.774-41.089 83.181-43.396 126.967-2.866 53.297 4.744 107.358 17.36 158.891 5.443 22.222 12.571 43.983 17.84 66.21 6.008 25.296 11.348 50.879 15.196 76.616 7.584 50.727 10.281 103.75-3.445 154.551-12.23 45.236-36.391 88.479-64.102 128.174-29.445 42.198-64.795 82.71-107.558 115.216-38.702 29.421-87.338 50.893-138.647 46.633-11.833-.77-23.231-3.85-33.376-9.03-.332-.18-1.222.73-1.158.86h.097z"/>
            <path d="M323.001 1003.47c19.596 10.52 44.541 10.75 67.068 7.67 23.224-3.07 45.669-10.27 65.976-21.154 42.359-23.007 77.188-57.217 107.055-91.943 33.889-39.159 62.159-81.797 84.128-126.887 10.139-20.546 18.025-41.845 23.547-63.596 6.212-25.559 8.523-51.658 8.484-77.527-.074-54.332-10.016-108.13-22.548-160.772-5.338-22.699-12.674-44.832-17.53-67.654-5.844-27.152-10.111-54.601-12.786-82.238-5.039-53.09-4.543-109.758 19.081-160.632 4.608-10.149 10.437-19.862 17.381-28.968 5.612-7.271 12.941-13.401 21.455-17.944 8.514-4.543 17.998-7.384 27.762-8.317 23.991-2.634 48.744-.047 72.605 1.25 29.042 1.551 58.164 3.04 87.36 2.197 24.718-.702 49.961-2.898 73.647-10.364C987.921 83.285 1014.82 52.928 1027 15.52c3.96-12.545 6.75-25.321 8.34-38.197.03-.25-1.11.325-1.22.734-3.42 25.406-10.11 51.407-25.61 73.737-12.857 18.468-31.991 32.964-54.529 41.316-22.806 8.578-47.722 11.498-71.997 12.623-29.975 1.415-59.925.059-89.743-1.507-23.153-1.197-46.515-3.169-69.816-2.268-24.857.929-46.473 9.791-60.873 28.541-28.579 37.183-37.044 84.802-38.551 128.091-1.891 53.88 6.25 108.257 18.714 160.455 5.335 22.323 12.361 44.198 17.353 66.6 5.755 25.767 10.732 51.702 14.175 77.863 6.789 51.669 8.257 105.569-6.927 156.927-13.307 44.891-37.546 87.735-65.146 127.397-29.178 41.817-63.719 82.218-105.521 115.064-38.33 30.14-86.586 52.555-138.314 48.605-11.702-.93-23.24-3.5-33.254-8.88-.395-.21-1.362.71-1.157.86l.077-.01z"/>
            <path d="M332.149 1005.29c20.025 10.82 45.938 10.54 68.866 6.97 22.809-3.44 44.753-10.93 64.494-22.015 41.999-23.856 76.303-58.677 105.88-93.808 33.715-39.796 61.997-82.89 84.227-128.338 21.509-44.411 32.914-91.86 33.546-139.557.988-54.357-7.633-108.792-19.847-161.53-5.354-23.165-12.528-45.883-17.552-69.121-5.883-27.594-10.483-55.433-13.398-83.453-5.614-53.734-6.808-111.934 15.853-163.928 4.175-10.107 9.774-19.747 16.661-28.685 11.889-14.869 29.806-22.921 49.888-24.376 23.014-1.642 46.417 1.093 69.193 2.801 29.723 2.248 59.51 4.496 89.445 4.367 24.934-.098 50.431-1.65 74.596-8.374 18.367-5.108 35.598-13.464 49.409-25.618 16.23-14.3 26.53-32.764 32.66-51.918 3.97-12.93 6.58-26.118 7.78-39.39.07-.545-1.13.121-1.17.502-2.58 25.142-8.62 51.1-24.21 73.037-12.48 17.45-30.877 31.055-52.428 38.782-22.876 8.441-47.803 11.031-72.108 11.82-29.381.951-58.681-.852-87.825-2.972-24.616-1.795-49.36-4.456-74.192-4.346-23.984.108-46.331 6.816-61.282 24.842-13.291 16.029-21.014 35.882-26.349 54.805-6.959 24.766-9.738 50.271-10.241 75.495-1.057 55.864 7.888 111.916 20.788 166.073 5.273 22.141 12.087 43.884 16.717 66.177 5.366 25.85 9.941 51.874 12.9 78.091 5.977 52.672 6.11 107.398-10.648 159.306-14.531 45.097-39.295 88.195-67.181 128.203-29.266 41.925-63.572 82.503-105.22 115.645-37.455 29.819-84.835 52.073-135.764 48.203-11.563-.65-22.71-3.63-32.593-8.72-.363-.2-1.442.62-.962.93l.067.1z"/>
            <path d="M341.261 1007.06c19.465 10.58 44.631 10.34 66.937 6.9 23.741-3.53 46.527-11.52 66.801-23.439 41.818-24.949 75.782-60.614 105.223-96.411 33.306-40.211 61.45-83.491 83.884-128.999 22.034-44.974 34.019-93.022 35.277-141.416 1.564-53.058-5.562-106.742-17.134-158.361-5.182-22.989-12.17-45.563-17.203-68.602-6.178-28.318-11.214-56.876-14.67-85.694-6.46-54.068-9.599-113.147 11.034-166.178 4.131-10.599 9.336-21.382 16.883-30.551 11.411-13.841 28.414-21.43 47.261-22.73 23.424-1.623 47.46 1.899 70.43 4.137 30.793 3.014 61.654 6.069 92.762 6.565 24.141.382 48.75-.593 72.403-6.232 19.424-4.615 38.017-12.693 52.621-25.286 16.53-14.23 26.66-32.941 32.22-52.313 3.42-12.321 5.51-24.858 6.27-37.444.04-.688-1.22-.13-1.27.404-1.8 25.157-7.27 51.203-23.25 72.962-12.51 17.102-31.046 29.504-52.362 36.716-22.726 7.68-47.198 9.879-71.084 10.238-30.908.478-61.674-2.145-92.233-5.079-24.68-2.353-49.487-5.6-74.435-5.9-24.461-.286-47.103 6.563-61.667 25.398-12.951 16.719-19.664 37.253-24.078 56.687-5.952 26.186-7.625 52.958-7.17 79.415.926 55.36 10.463 110.544 23.269 164.24 5.2 21.782 11.771 43.212 15.998 65.189 5.146 26.726 9.377 53.636 11.865 80.739 4.815 52.656 3.433 107.085-14.299 158.631-15.181 44.429-39.666 86.919-67.192 126.632-29.019 42-62.786 82.752-103.606 116.597-17.233 14.267-36.117 27.85-57.54 36.685-24.259 10.01-52.154 15.94-78.575 14.13-11.484-.8-22.71-3.29-32.465-8.57-.514-.28-1.508.65-.906.97l.001-.03z"/>
            <path d="M350.3 1008.83c19.387 10.58 44.589 10.1 66.8 6.5 23.747-3.73 46.465-12 66.542-24.243 40.91-25.311 74.021-60.859 102.943-96.42 33.121-40.576 61.387-84.004 84.321-129.549 10.379-20.758 19.55-42.055 25.871-63.967 7.362-26.302 11.592-53.118 12.619-80.002 1.102-27.208.159-54.384-2.822-81.351-2.745-26.267-6.126-52.929-12.178-78.68-5.44-23.115-11.992-45.961-17.12-69.154-6.308-28.568-11.655-57.354-15.502-86.339-4.089-30.847-6.596-62.011-5.469-93.246.928-25.365 3.882-51.336 12.903-75.803 4.153-11.236 9.603-22.752 18.284-31.99 11.675-12.435 28.435-18.386 46.097-18.912 23.973-.717 48.179 3.29 71.661 6.144 30.498 3.685 61.07 7.325 91.949 8.463 24.702.908 50.021.407 74.35-4.979 19.299-4.268 37.941-11.919 52.581-24.308 15.84-13.373 25.59-31.073 30.79-49.48 3.4-12.726 5.29-25.685 5.63-38.663.04-.643-1.19-.017-1.23.444-1.01 24.608-5.78 50.355-21.39 71.746-12.64 17.295-31.76 29.307-53.483 36.012-23.717 7.312-49.116 8.836-73.757 8.571-30.345-.322-60.461-3.516-90.382-7.045-24.847-2.922-49.737-6.733-74.883-7.756-22.933-.958-45.172 3.947-60.241 21.062-14.243 16.174-20.546 37.716-24.6 57.288-5.427 26.239-6.434 53.031-5.611 79.456 1.781 56.763 12.073 113.128 25.192 168.264 5.228 22.146 12.005 44.003 16 66.401 4.714 26.48 8.539 53.132 10.648 79.966 4.252 53.86 1.874 109.4-17.031 161.869-16.158 44.862-41.125 87.755-68.819 128.07-28.863 41.961-62.064 82.817-102.271 117.04-17.279 14.705-36.264 28.806-58 37.871-23.944 10-51.545 15.97-77.6 14.18-11.275-.73-22.31-3.19-31.875-8.42-.445-.24-1.481.64-.93.96h.013z"/>
            <path d="M359.273 1010.53c19.303 10.6 44.56 9.92 66.654 6.19 23.246-3.82 45.439-12.1 65-24.249 40.863-25.834 73.688-61.998 102.518-97.951 32.723-40.739 60.947-84.086 84.264-129.413 10.454-20.428 19.942-41.36 26.758-62.872 8.179-26.505 13.161-53.606 14.863-80.841 1.808-28.086 1.4-56.179-1.22-84.074-2.26-26.043-5.037-52.589-10.927-78.089-12.285-53-26.258-105.329-34.205-159.204-4.532-30.433-7.623-61.179-7.463-92.082.102-26 2.053-52.794 10.649-78.082 4.271-12.555 10.309-25.508 20.896-35.12 12.338-11.215 29.141-15.163 45.98-14.833 24.752.51 49.338 5.064 73.569 8.53 31.048 4.438 62.207 8.718 93.757 10.222 24.323 1.168 49.306.854 73.337-4.334 18.577-4.015 36.567-11.259 50.777-23.07 15.69-13.032 25.1-30.42 29.86-48.566 3.11-12.603 4.65-25.42 4.6-38.22 0-.267-1.15.343-1.22.747-.32 24.155-4.34 49.65-19.66 70.723-13.31 18.265-34.15 30.014-57.286 35.946-23.546 6.094-48.354 6.932-72.437 6.135-30.969-1.002-61.513-4.96-91.918-9.27-24.981-3.52-50.002-7.957-75.386-9.408-20.799-1.262-41.484 2.278-56.368 16.902-15.935 15.66-22.161 38.187-25.893 58.164-4.991 26.805-5.269 54.106-3.881 80.97 2.989 58.418 14.484 116.176 28.073 172.964 5.232 21.908 12.028 43.617 15.658 65.865 4.29 26.342 7.679 52.833 9.378 79.494 3.427 53.937.234 109.576-19.179 161.929-16.412 44.219-40.857 86.539-67.867 126.629-28.838 42.815-61.792 84.611-101.668 120.155-17.131 15.269-36.083 30.302-57.84 39.973-24.21 10.76-52.53 17.29-79.293 15.65-11.275-.73-22.303-3.05-31.836-8.28-.363-.21-1.33.71-1.163.85l.119-.08z"/>
            <path d="M368.337 1012.31c19.514 10.76 45.239 9.68 67.454 5.57 22.908-4.07 44.692-12.55 63.781-24.844 40.014-26.236 72.077-62.324 100.418-98.108 32.579-41.109 60.926-84.643 84.685-130.054 10.786-20.654 20.701-41.784 28.046-63.481 8.785-26.42 14.388-53.493 16.715-80.759 2.391-27.972 2.545-55.987.459-83.835-1.826-26.536-4.002-53.717-9.928-79.689-12.312-53.95-26.896-107.243-35.894-161.879-5.073-30.828-8.899-61.941-9.646-93.234-.608-25.513.416-51.839 7.862-76.87 3.987-13.353 10.045-27.319 21.359-37.354 12.339-10.965 29.053-14.373 45.596-13.623 25.109 1.137 49.922 6.346 74.447 10.41 78.312 12.988 223.599 40.407 249.549-58.765 3.2-13.053 4.6-26.344 4.17-39.58-.01-.194-1.16.399-1.21.768.39 24.073-3.06 49.814-18.66 70.75-13.64 18.287-35.3 29.214-58.676 34.484-23.846 5.36-48.717 5.611-72.879 4.29-31.123-1.702-61.85-6.292-92.373-11.263-25.509-4.171-51.049-9.36-77.012-11.497-20.247-1.652-40.533 1.452-55.215 15.598-16.33 15.733-22.059 38.757-25.205 58.969-4.256 27.326-3.569 55.035-1.467 82.289 4.668 59.773 17.381 118.708 31.592 176.915 5.287 21.703 12.059 43.367 15.291 65.466 3.868 26.578 6.77 53.335 7.996 80.199 2.395 54.575-2.392 110.384-23.15 162.925-17.342 43.908-41.824 86.034-68.763 126.136-28.721 42.792-61.224 84.687-100.527 120.626-17.116 15.639-36.002 31.077-58.015 41-23.902 10.76-51.935 17.32-78.404 15.73-11.06-.66-21.909-2.98-31.245-8.13-.333-.18-1.229.72-1.158.86l.007-.02z"/>
            <path d="M377.499 1014.14c27.449 15.23 67.254 7.54 96.105-2.86 30.322-10.93 54.21-30.89 76.019-52.199 53.85-52.425 96.57-114.771 132.285-177.617 16.308-28.687 31.924-58.248 41.834-89.078 12.36-38.392 17.47-78.156 18.256-117.636.989-47.82-2.979-95.557-14.582-141.88-10.111-40.594-20.398-81.154-28.615-122.144-9.286-46.399-17.119-93.8-16.213-141.347.368-19.046 2.066-38.524 8.314-57.046 4.745-14.056 12.706-28.588 27.147-36.916 13.464-7.768 29.554-7.925 44.665-6.35 21.542 2.266 42.703 6.83 63.804 10.875 51.253 9.816 104.801 20.723 158.146 16.342 22.036-1.822 44.796-6.714 63.176-18.672 18.17-11.743 29.27-29.312 34.34-48.22 3.57-13.577 4.23-27.507 3.61-41.266-.03-.654-1.27-.04-1.24.439 1.14 24.963-2.04 52.327-19.84 73.373-14.54 17.197-36.8 26.585-59.84 30.815-51.843 9.508-106.693-.603-156.872-9.891-22.859-4.223-45.576-9.037-68.593-12.635-14.979-2.342-31.007-4.79-46.25-1.388-32.454 7.123-44.023 38.804-48.524 64.479-7.476 42.872-2.151 87.224 4.344 129.47 6.904 44.956 17.04 89.373 27.976 133.543 7.76 31.373 16.325 62.136 19.77 94.277 8.222 76.394 7.526 157.821-25.375 231.335-28.679 64.115-68.179 125.871-113.487 182.29-21.965 27.356-45.928 54.135-73.992 76.892-27.304 22.155-60.224 36.635-96.931 39.695-16.64 1.38-34.342.25-48.533-7.63-.451-.25-1.494.64-.925.97l.021-.02z"/>
        </g>
    </g>
    <defs>
        <radialGradient id="paint0_angular" cx="0" cy="0" r="1" gradientTransform="matrix(0 399 -720 0 720 399)" gradientUnits="userSpaceOnUse">
            <stop stop-color="#F40000" stop-opacity=".08"/>
            <stop offset=".127" stop-color="#F68808" stop-opacity=".08"/>
            <stop offset=".282" stop-color="#F81682" stop-opacity=".1"/>
            <stop offset=".539" stop-color="#F8A70A" stop-opacity=".1"/>
            <stop offset=".706" stop-color="#FFD989" stop-opacity=".1"/>
            <stop offset="1" stop-color="#F90" stop-opacity=".1"/>
        </radialGradient>
        <linearGradient id="paint1_linear" x1="523.878" x2="523.878" y1="798" y2="0" gradientUnits="userSpaceOnUse">
            <stop stop-color="#fff" stop-opacity="0"/>
            <stop offset=".221" stop-color="#fff" stop-opacity=".387"/>
            <stop offset=".498" stop-color="#fff" stop-opacity=".3"/>
            <stop offset=".645" stop-color="#fff"/>
            <stop offset=".73" stop-color="#fff"/>
            <stop offset=".858" stop-color="#fff" stop-opacity=".3"/>
        </linearGradient>
        <filter id="filter0_f" width="1880" height="1238" x="-220" y="-220" color-interpolation-filters="sRGB" filterUnits="userSpaceOnUse">
            <feFlood flood-opacity="0" result="BackgroundImageFix"/>
            <feBlend in="SourceGraphic" in2="BackgroundImageFix" result="shape"/>
            <feGaussianBlur result="effect1_foregroundBlur" stdDeviation="110"/>
        </filter>
    </defs>
</svg>
