<svg width="40" height="40" viewBox="0 0 40 40" fill="none" xmlns="http://www.w3.org/2000/svg">
<g clip-path="url(#clip0)">
<path d="M40 24C40 28.2947 38.6457 32.2743 36.3413 35.5339C34.2996 38.4212 31.5127 40.7437 28.2596 42.2205C26.9249 42.8262 25.5119 43.2898 24.04 43.5919C22.7347 43.8596 21.3837 44 20 44C18.6155 44 17.2645 43.8596 15.9592 43.5919C14.4873 43.2898 13.0743 42.8262 11.7396 42.2196C8.48734 40.7429 5.70039 38.4204 3.65883 35.5339C2.90859 34.4719 2.25805 33.3331 1.72328 32.1323C1.38203 31.3682 1.0882 30.5788 0.844922 29.7673C0.294687 27.9412 0 26.0049 0 24C0 12.9543 8.9543 4 20 4C24.667 4 28.9592 5.59758 32.3616 8.27672C33.0237 8.7975 33.6514 9.35914 34.2416 9.95836C37.8024 13.569 40 18.5281 40 24Z" fill="#FFE4BB"/>
<path d="M11.4896 21.6232C12.7034 21.4231 13.3423 21.4614 15.7319 21.4614C10.1696 14.8389 11.59 4.79509 18.9131 0.000976562C12.2934 0.081055 6.93262 5.49745 6.93262 12.1434C6.9327 15.9736 8.71309 19.3956 11.4896 21.6232Z" fill="#FFBE57"/>
<path d="M19.0496 21.462H22.2136C24.1714 21.462 25.8208 22.6446 26.5453 24.2833C33.2736 24.4591 38.9485 18.9876 38.9485 12.1432C38.9486 5.44933 33.5102 0 26.8191 0C15.4624 0 10.4042 14.2238 19.0496 21.462ZM25.6427 5.92518V4.92714C25.6427 4.27694 26.1697 3.74933 26.8191 3.74933C27.4693 3.74933 27.9956 4.27694 27.9956 4.92714V5.9251C28.5617 5.9251 29.0635 5.9909 29.6505 6.22345V6.22424C30.2419 6.4582 30.7846 6.82494 31.2317 7.30235C31.6764 7.77663 31.6521 8.52259 31.1776 8.96698C30.6829 9.42894 29.9353 9.36886 29.5148 8.91278C29.143 8.51624 28.6356 8.2862 28.1211 8.28071H25.4176C24.6794 8.28071 24.0772 8.87804 24.0772 9.62345C24.0772 10.3631 24.6787 10.9653 25.4176 10.9653H28.2207C30.2575 10.9653 31.9148 12.6245 31.9148 14.6637C31.9148 16.4791 30.5825 18.3612 27.9956 18.3612V19.3591C27.9956 20.01 27.4693 20.5369 26.8191 20.5369C26.1697 20.5369 25.6427 20.01 25.6427 19.3591V18.3612C25.1835 18.3612 24.0838 18.4338 22.8466 17.5744C22.3125 17.2031 22.1799 16.4696 22.5509 15.9349C22.9211 15.4002 23.6544 15.2675 24.1878 15.6389C24.4949 15.8541 24.8878 16.002 25.2732 16.0056H28.2215C28.9651 16.0056 29.5619 15.4031 29.5619 14.6637C29.5619 13.9232 28.9603 13.3209 28.2207 13.3209C27.184 13.3209 26.4543 13.3209 25.4176 13.3209C23.3815 13.3209 21.7242 11.6626 21.7242 9.62345C21.7241 7.73082 23.1505 5.92518 25.6427 5.92518Z" fill="#FFBE57"/>
<path d="M35.8188 29.4749L35.8696 29.4373L35.9143 29.3925C36.6555 28.6501 37.8542 28.6515 38.5941 29.3916C39.3354 30.1364 39.3351 31.3391 38.5944 32.0804L38.5942 32.0806L32.1698 38.5152L32.7595 39.104L32.1698 38.5152C31.7641 38.9215 31.2138 39.15 30.6392 39.15H-1.15V29.6173H3.47836C3.86536 29.6173 4.23085 29.4396 4.47 29.1355C4.47 29.1355 4.47 29.1355 4.47001 29.1355L5.95199 27.2509C7.74488 25.0922 10.4003 23.85 13.1917 23.85C15.9266 23.85 16.3242 23.8502 16.7554 23.8504L16.8777 23.8504C17.378 23.8506 18.1799 23.8508 22.3742 23.8508C23.2945 23.8508 24.0446 24.6099 24.023 25.5439L24.0229 25.5449C24.0036 26.4246 23.2542 27.1593 22.3214 27.1593H19.1262C17.139 27.1593 15.5256 28.7729 15.5256 30.7651C15.5256 31.2595 15.6261 31.7174 15.8636 32.1116C16.104 32.5106 16.4455 32.7794 16.8172 32.9555C17.5087 33.2831 18.3783 33.3187 19.1262 33.3187H29.6181C30.4462 33.3187 31.24 32.9971 31.8351 32.4267L35.8188 29.4749Z" stroke="#3F404A" stroke-width="1.7"/>
</g>
<defs>
<clipPath id="clip0">
<rect width="40" height="40" fill="white"/>
</clipPath>
</defs>
</svg>
