// Jest Snapshot v1, https://goo.gl/fbAQLP

exports[`company user(3) => data 1`] = `
Object {
  "address": Object {
    "city": "Greenland",
    "county": "Avon",
    "streetAddress": "46014 Crystal Locks",
    "zipCode": "58480-1022",
  },
  "ceo": "Jack Little",
  "companyId": 3,
  "email": "Haskell30@yahoo.com",
  "homepage": "https://kyleigh.info",
  "name": "Bernier - Quigley",
  "phone": "(364) 590-7592",
}
`;

exports[`company user(85) => data 1`] = `
Object {
  "address": Object {
    "city": "Elianetown",
    "county": "Buckinghamshire",
    "streetAddress": "619 Robel Forges",
    "zipCode": "72656-3338",
  },
  "ceo": "Miller Kemmer",
  "companyId": 85,
  "email": "Adriel_Hyatt@gmail.com",
  "homepage": "http://robin.com",
  "name": "Tromp - Lang",
  "phone": "182-212-6294 x235",
}
`;
