{
  "_class": "group",
  "do_objectID": "21E0F2D8-1C70-4E85-9248-7131B774BD6F",
  "exportOptions": {
    "_class": "exportOptions",
    "exportFormats": [
    ],
    "includedLayerIds": [
    ],
    "layerOptions": 0,
    "shouldTrim": false
  },
  "frame": {
    "_class": "rect",
    "constrainProportions": false,
    "height": 32,
    "width": 520,
    "x": 8,
    "y": 4
  },
  "hasClickThrough": false,
  "isFlippedHorizontal": false,
  "isFlippedVertical": false,
  "isLocked": false,
  "isVisible": true,
  "layerListExpandedType": 2,
  "layers": [
    {
      "class": "symbolInstance",
      "id": "7379A47A-13DB-4EAB-B078-4132EE085465"
    },
    {
      "class": "symbolInstance",
      "id": "C1C64C37-CC52-45EA-83EB-6B372CA7D388"
    },
    {
      "class": "symbolInstance",
      "id": "05D013F3-B42D-4BD7-966E-30DA8A1F270D"
    },
    {
      "class": "symbolInstance",
      "id": "0B34E90A-C86C-4904-87B4-5F7B73669B98"
    },
    {
      "class": "symbolInstance",
      "id": "021CC907-57AE-43EF-981B-44A0870F9D23"
    },
    {
      "class": "symbolInstance",
      "id": "D6C912AE-CFEA-4A1B-8475-2B85CB88EE8A"
    },
    {
      "class": "symbolInstance",
      "id": "2C081EE3-B6C8-4E1D-BA90-3E7E68F46C15"
    },
    {
      "class": "symbolInstance",
      "id": "92960338-A0D2-4D8B-A277-A9E26270B06D"
    }
  ],
  "name": "left-aligned",
  "nameIsFixed": true,
  "resizingConstraint": 25,
  "resizingType": 0,
  "rotation": 0,
  "shouldBreakMaskChain": false,
  "style": {
    "_class": "style",
    "endDecorationType": 0,
    "miterLimit": 10,
    "startDecorationType": 0
  }
}