{
  "_class": "group",
  "do_objectID": "FEF124B1-0056-41FF-97C2-456BA3F852C9",
  "exportOptions": {
    "_class": "exportOptions",
    "exportFormats": [
    ],
    "includedLayerIds": [
    ],
    "layerOptions": 0,
    "shouldTrim": false
  },
  "frame": {
    "_class": "rect",
    "constrainProportions": false,
    "height": 28,
    "width": 527,
    "x": 607,
    "y": 1012
  },
  "hasClickThrough": false,
  "isFlippedHorizontal": false,
  "isFlippedVertical": false,
  "isLocked": false,
  "isVisible": true,
  "layerListExpandedType": 2,
  "layers": [
    {
      "class": "shapeGroup",
      "id": "2F704DC1-D71F-4474-B658-5583922F8A18"
    },
    {
      "class": "shapeGroup",
      "id": "BFF5ED80-2A07-425F-AD83-7FBAC1B757D4"
    },
    {
      "class": "shapeGroup",
      "id": "D5814FEF-3AD3-4507-9311-075C0E411D54"
    },
    {
      "class": "shapeGroup",
      "id": "1E239863-27E4-480B-8960-7B4504A12CF3"
    },
    {
      "class": "text",
      "id": "732A2573-444E-4B71-9916-C36057B84B90"
    }
  ],
  "name": "new_epic copy 11",
  "nameIsFixed": true,
  "resizingConstraint": 63,
  "resizingType": 0,
  "rotation": 0,
  "shouldBreakMaskChain": false,
  "style": {
    "_class": "style",
    "endDecorationType": 0,
    "miterLimit": 10,
    "startDecorationType": 0
  }
}