{
  "_class": "group",
  "do_objectID": "98720BD6-89BB-4E8F-A9EC-7C65913CFA6D",
  "exportOptions": {
    "_class": "exportOptions",
    "exportFormats": [
    ],
    "includedLayerIds": [
    ],
    "layerOptions": 0,
    "shouldTrim": false
  },
  "frame": {
    "_class": "rect",
    "constrainProportions": false,
    "height": 51,
    "width": 102,
    "x": 165,
    "y": 0
  },
  "hasClickThrough": false,
  "isFlippedHorizontal": false,
  "isFlippedVertical": false,
  "isLocked": false,
  "isVisible": true,
  "layerListExpandedType": 0,
  "layers": [
    {
      "class": "shapeGroup",
      "id": "38191CBA-FDAA-427E-8C4B-BE9AB368BE68"
    },
    {
      "class": "shapeGroup",
      "id": "2748FFCC-4E26-4C71-80F3-BADC8AEBCA11"
    },
    {
      "class": "shapeGroup",
      "id": "1E9A0915-94E2-461B-B3EF-79D991027038"
    },
    {
      "class": "shapeGroup",
      "id": "7054B4C1-D162-4913-9828-6E2F06D3B351"
    },
    {
      "class": "shapeGroup",
      "id": "88F4BEBB-2957-4667-817D-35D0B57780AF"
    },
    {
      "class": "group",
      "id": "DA54FB98-B304-4A14-AB41-BC4ACDFFA0CD"
    },
    {
      "class": "text",
      "id": "02C7D12E-EB70-47CA-9F78-CE0924C5575D"
    }
  ],
  "name": "pipelines",
  "nameIsFixed": true,
  "resizingConstraint": 44,
  "resizingType": 1,
  "rotation": 0,
  "shouldBreakMaskChain": false,
  "style": {
    "_class": "style",
    "endDecorationType": 0,
    "miterLimit": 10,
    "startDecorationType": 0
  }
}