\relax 
\@writefile{toc}{\contentsline {section}{\numberline {1}Introduction}{1}{}\protected@file@percent }
\@writefile{toc}{\contentsline {section}{\numberline {2}Présentation de l’application}{1}{}\protected@file@percent }
\@writefile{lof}{\contentsline {figure}{\numberline {1}{\ignorespaces Activités principales}}{3}{}\protected@file@percent }
\@writefile{toc}{\contentsline {section}{\numberline {3}Choix techniques}{3}{}\protected@file@percent }
\@writefile{toc}{\contentsline {subsection}{\numberline {3.1}Représentation et stockage des questionnaires et des scores}{3}{}\protected@file@percent }
\@writefile{toc}{\contentsline {subsection}{\numberline {3.2}Gestion dynamique des questionnaires et des scores}{4}{}\protected@file@percent }
\@writefile{toc}{\contentsline {subsection}{\numberline {3.3}Partie administrateur}{4}{}\protected@file@percent }
\@writefile{lof}{\contentsline {figure}{\numberline {2}{\ignorespaces Partie administrateur}}{5}{}\protected@file@percent }
\@writefile{toc}{\contentsline {section}{\numberline {4}Conclusion}{5}{}\protected@file@percent }
\gdef \@abspage@last{5}
