\contentsline {section}{\numberline {1}Introduction}{1}{}%
\contentsline {section}{\numberline {2}Présentation de l’application}{1}{}%
\contentsline {section}{\numberline {3}Choix techniques}{3}{}%
\contentsline {subsection}{\numberline {3.1}Représentation et stockage des questionnaires et des scores}{3}{}%
\contentsline {subsection}{\numberline {3.2}Gestion dynamique des questionnaires et des scores}{4}{}%
\contentsline {subsection}{\numberline {3.3}Partie administrateur}{4}{}%
\contentsline {section}{\numberline {4}Conclusion}{5}{}%
