[gd_scene load_steps=2 format=3 uid="uid://c1q7p7oesyvf2"]

[ext_resource type="Script" path="res://src/zone/algues_zone.gd" id="1_cogux"]

[node name="AlguesZone" type="Node2D"]
z_index = 1
script = ExtResource("1_cogux")
