[gd_scene load_steps=7 format=3 uid="uid://dmra6avht4s0o"]

[ext_resource type="Script" path="res://src/collectables/fish_clans/clan_particles.gd" id="1_0w526"]

[sub_resource type="Gradient" id="Gradient_0bmxf"]
offsets = PackedFloat32Array(0.00564972, 1)
colors = PackedColorArray(1, 0.768627, 0.411765, 1, 1, 1, 1, 0)

[sub_resource type="GradientTexture2D" id="GradientTexture2D_c24sg"]
gradient = SubResource("Gradient_0bmxf")
width = 12
height = 12
fill = 1
fill_from = Vector2(0.501845, 0.512915)
fill_to = Vector2(0.501845, 0.97417)

[sub_resource type="Curve" id="Curve_my8e6"]
_data = [Vector2(0.0429185, 0.786477), 0.0, 0.614209, 0, 0, Vector2(1, 0.11032), -3.44429, 0.0, 0, 0]
point_count = 2

[sub_resource type="Gradient" id="Gradient_0netn"]
offsets = PackedFloat32Array(0, 0.455026, 1)
colors = PackedColorArray(1, 0.72549, 0.0980392, 1, 0.933333, 0.509804, 0.356863, 1, 1, 1, 1, 0)

[sub_resource type="Curve" id="Curve_f515h"]
min_value = -1.0
_data = [Vector2(0, 0.117438), 0.0, -1.13908, 0, 0, Vector2(1, 0.0462633), -0.909425, 0.0, 0, 0]
point_count = 2

[node name="clan_particles" type="CPUParticles2D"]
z_index = 30
z_as_relative = false
amount = 64
lifetime = 3.0
explosiveness = 0.11
lifetime_randomness = 0.4
texture = SubResource("GradientTexture2D_c24sg")
emission_shape = 1
emission_sphere_radius = 16.0
direction = Vector2(0, -1)
spread = 20.0
gravity = Vector2(0, 0)
initial_velocity_min = 20.0
initial_velocity_max = 35.0
linear_accel_min = 20.0
linear_accel_max = 40.0
radial_accel_min = -37.21
radial_accel_max = -23.26
tangential_accel_min = -10.0
tangential_accel_max = 10.0
scale_amount_min = 0.0
scale_amount_max = 3.0
scale_amount_curve = SubResource("Curve_my8e6")
color = Color(0.909804, 0.909804, 0.537255, 1)
color_ramp = SubResource("Gradient_0netn")
hue_variation_min = -0.29
hue_variation_max = 0.67
hue_variation_curve = SubResource("Curve_f515h")
script = ExtResource("1_0w526")
