[gd_scene load_steps=3 format=3 uid="uid://c4ugabfpxaes0"]

[ext_resource type="Script" path="res://src/ennemies/kraken/music_kraken.gd" id="1_fh7o7"]

[sub_resource type="RectangleShape2D" id="RectangleShape2D_awv43"]
size = Vector2(3770, 2595)

[node name="music_shark" type="Area2D"]
collision_layer = 0
collision_mask = 2
script = ExtResource("1_fh7o7")
metadata/_edit_group_ = true

[node name="CollisionShape2D" type="CollisionShape2D" parent="."]
shape = SubResource("RectangleShape2D_awv43")
