[gd_scene load_steps=7 format=3 uid="uid://b6q0wapax6klx"]

[ext_resource type="Script" path="res://src/collectables/fish_clans/fish_clans.gd" id="1_bapvf"]
[ext_resource type="PackedScene" uid="uid://dmra6avht4s0o" path="res://src/collectables/fish_clans/clan_particles.tscn" id="2_7ncsh"]
[ext_resource type="AudioStream" uid="uid://dt2itq7bmonpw" path="res://assets/sound/sfx/friend_school.ogg" id="3_1h6a1"]

[sub_resource type="Gradient" id="Gradient_y3lxy"]
offsets = PackedFloat32Array(0.201183, 1)
colors = PackedColorArray(1, 1, 1, 1, 0, 0, 0, 1)

[sub_resource type="GradientTexture2D" id="GradientTexture2D_8vang"]
gradient = SubResource("Gradient_y3lxy")
width = 84
height = 84
fill = 1
fill_from = Vector2(0.5, 0.5)
fill_to = Vector2(0.5, 1)

[sub_resource type="CircleShape2D" id="CircleShape2D_hmas3"]
radius = 150.0

[node name="fish_clans" type="Node2D"]
script = ExtResource("1_bapvf")

[node name="PointLight2D" type="PointLight2D" parent="."]
color = Color(0.94902, 0.85098, 0.486275, 1)
texture = SubResource("GradientTexture2D_8vang")
texture_scale = 16.0

[node name="Polygon2D" type="Polygon2D" parent="."]
color = Color(0.85098, 0.584314, 0.164706, 0.556863)
polygon = PackedVector2Array(-13, 2, -19, -18, -5, -18, 8, -30, 14, -10, 28, -5, 20, 6, 5, 7, -7, 14, -24, 13)

[node name="Radius" type="CollisionShape2D" parent="."]
shape = SubResource("CircleShape2D_hmas3")
debug_color = Color(1, 0.784314, 0.505882, 0.101961)

[node name="fishes" type="Node2D" parent="."]

[node name="clan_particles" parent="." instance=ExtResource("2_7ncsh")]

[node name="Voice" type="AudioStreamPlayer2D" parent="."]
stream = ExtResource("3_1h6a1")
autoplay = true
bus = &"Voice"
