[gd_scene load_steps=5 format=3 uid="uid://doy0n30tdm2p8"]

[ext_resource type="Texture2D" uid="uid://csvbrleik1r08" path="res://src/resourses/mouse_light.tres" id="2_h2hfk"]
[ext_resource type="Script" path="res://src/level/mouse_light/mouse_light.gd" id="2_q2p5r"]

[sub_resource type="CircleShape2D" id="CircleShape2D_1yco6"]
radius = 240.0

[sub_resource type="CircleShape2D" id="CircleShape2D_mebob"]
radius = 36.3456

[node name="MouseLight" type="Node2D"]
script = ExtResource("2_q2p5r")

[node name="MouseLight" type="PointLight2D" parent="."]
light_mask = 7
visibility_layer = 7
position = Vector2(1.76172, 3.52344)
scale = Vector2(0.580216, 0.580216)
color = Color(0.74902, 0.929412, 0.996078, 1)
range_item_cull_mask = 5
shadow_enabled = true
shadow_filter = 1
shadow_filter_smooth = 5.0
texture = ExtResource("2_h2hfk")
texture_scale = 5.0

[node name="LightZone" type="Area2D" parent="."]

[node name="CollisionShape2D" type="CollisionShape2D" parent="LightZone"]
shape = SubResource("CircleShape2D_1yco6")
debug_color = Color(0.584314, 0.380392, 1, 0.419608)

[node name="COL" type="CharacterBody2D" parent="."]
collision_layer = 2048
collision_mask = 0
motion_mode = 1
platform_on_leave = 2

[node name="CollisionShape2Doeu" type="CollisionShape2D" parent="COL"]
shape = SubResource("CircleShape2D_mebob")
