\begin{tikzpicture}
	\begin{pgfonlayer}{nodelayer}
		\node [style=none] (0) at (0, 0) {};
		\node [style=none] (1) at (0, 0) {};
		\node [style=none] (2) at (0, 6) {};
		\node [style=none] (3) at (8, 0) {};
		\node [style=none] (4) at (-1.25, 6) {$P$};
		\node [style=none] (7) at (8.5, -0.75) {$V$};
		\node [style=none] (10) at (6.25, 0) {};
		\node [style=none] (11) at (0, 4) {};
		\node [style=none] (12) at (1.75, 2) {};
		\node [style=none] (13) at (3.75, 1.75) {};
		\node [style=none] (14) at (6.25, 3.5) {};
		\node [style=none] (15) at (3.75, 3.75) {};
		\node [style=none] (16) at (4, 4.5) {$A$};
		\node [style=none] (17) at (6.75, 4) {$2$};
		\node [style=none] (18) at (4, 1.25) {$B$};
		\node [style=none] (19) at (1.75, 0) {};
		\node [style=none] (20) at (1.75, -0.5) {$C$};
		\node [style=none] (21) at (6.25, -0.5) {$D$};
		\node [style=none] (22) at (1.25, 2) {1};
	\end{pgfonlayer}
	\begin{pgfonlayer}{edgelayer}
		\draw [style=arrow] (1.center) to (3.center);
		\draw [style=arrow] (0.center) to (2.center);
		\draw [in=-135, out=30, looseness=1.25] (12.center) to (13.center);
		\draw [style=arrow, in=210, out=30] (13.center) to (14.center);
		\draw [in=-45, out=135, looseness=0.75] (14.center) to (15.center);
		\draw [style=arrow, in=-180, out=105, looseness=1.50] (12.center) to (15.center);
		\draw [style=pointille] (10.center) to (14.center);
		\draw [style=pointille] (19.center) to (12.center);
	\end{pgfonlayer}
\end{tikzpicture}
