\begin{tikzpicture}
	\begin{pgfonlayer}{nodelayer}
		\node [style=none] (0) at (-2, 2.75) {};
		\node [style=none] (1) at (-2, -2.25) {};
		\node [style=none] (2) at (2, -2.25) {};
		\node [style=none] (3) at (2, 2.75) {};
		\node [style=none] (6) at (-2, 0.325) {};
		\node [style=none] (7) at (2, 0.325) {};
		\node [style=none] (14) at (3.75, -0.5) {$Q=0$};
		\node [style=none] (15) at (2, 0) {};
		\node [style=nw-lines-rectangleX] (16) at (-1.75, -2) {};
		\node [style=nw-lines-rectangleX] (17) at (-1.25, -2) {};
		\node [style=nw-lines-rectangleX] (18) at (-0.75, -2) {};
		\node [style=nw-lines-rectangleX] (19) at (-0.25, -2) {};
		\node [style=nw-lines-rectangleX] (20) at (0.25, -2) {};
		\node [style=nw-lines-rectangleX] (21) at (0.75, -2) {};
		\node [style=nw-lines-rectangleX] (22) at (1.25, -2) {};
		\node [style=nw-lines-rectangleX] (23) at (1.75, -2) {};
		\node [style=nw-lines-rectangleXB] (24) at (-1.75, 0) {};
		\node [style=nw-lines-rectangleXB] (25) at (-1.25, 0) {};
		\node [style=nw-lines-rectangleXB] (26) at (-0.75, 0) {};
		\node [style=nw-lines-rectangleXB] (27) at (-0.25, 0) {};
		\node [style=nw-lines-rectangleXB] (28) at (0.25, 0) {};
		\node [style=nw-lines-rectangleXB] (29) at (0.75, 0) {};
		\node [style=nw-lines-rectangleXB] (30) at (1.25, 0) {};
		\node [style=nw-lines-rectangleXB] (31) at (1.75, 0) {};
	\end{pgfonlayer}
	\begin{pgfonlayer}{edgelayer}
		\draw (0.center) to (1.center);
		\draw (1.center) to (2.center);
		\draw (2.center) to (3.center);
		\draw (6.center) to (7.center);
		\draw [style=arrowZ] (14.center) to (15.center);
	\end{pgfonlayer}
\end{tikzpicture}
