{"tile_configs": {
    "Open_test": {
      "id": "effect4",
      "path": "tiles/borders.png",
      "row_count": 1,
      "col_count": 2,
      "row_index": 0,
      "col_index": 0,
      "row_span": 1,
      "col_span": 1
    }
  }
}