{
	"$schema": "https://developer.microsoft.com/json-schemas/spfx-build/package-solution.schema.json",
	"solution": {
		"name": "Coding News",
		"id": "9d3014ac-65fd-441a-957c-934eb08d10cf",
		"version": "1.3.0.0",
		"includeClientSideAssets": true
	},
	"paths": {
		"zippedPackage": "solution/coding-news.sppkg"
	}
}
