{
  "compilerOptions": {
    "baseUrl": ".",
    "paths": {
      "_assets": ["src/assets/*"],
      "_components": ["src/components/*"],
      "_nativeBaseTheme": ["src/components/native-base-theme/*"],
      "_navigation": ["src/navigation/*"],
      "_screens": ["src/screens/*"],
      "_services": ["src/services/*"],
      "_styles": ["src/styles/*"],
      "_utils": ["src/utils/*"]
    }
  }
}