{
    "name": "Details",
    "alias": "details",
    "description": "",
    "keywords": [],
    "priority": 0,
    "providers": [
        "Modules\\Details\\Providers\\DetailsServiceProvider"
    ],
    "aliases": {},
    "files": [],
    "requires": []
}
