Place,Name,BirthYear,BodyweightKg,Country,Squat1Kg,Squat2Kg,Squat3Kg,Squat4Kg,Best3SquatKg,Bench1Kg,Bench2Kg,Bench3Kg,Bench4Kg,Best3BenchKg,Deadlift1Kg,Deadlift2Kg,Deadlift3Kg,Deadlift4Kg,Best3DeadliftKg,TotalKg,Event,Equipment,Sex,Division,WeightClassKg,BirthDate,Age
1,Simona Rančev,2002,58.35,Czechia,-95,95,-102.5,,95,,,,,,,,,,,95,S,Wraps,F,J,60,,
1,Yana Gotlashova,1999,54.6,Ukraine,30,40,50,,50,,,,,,,,,,,50,S,Wraps,F,J,56,,
DQ,Hana Malinová,1993,65.4,Czechia,-105,-105,-115,,,,,,,,,,,,,,S,Multi-ply,F,O,67.5,,
1,Natalie Hurdley,1988,78.9,UK,112.5,,,,112.5,,,,,,,,,,,112.5,S,Multi-ply,F,O,82.5,,
1,Monika Aus,1971,52.25,Estonia,-80,80,90,,90,,,,,,,,,,,90,S,Multi-ply,F,M3,56,,
1,Katrin Ribb,1970,79.2,Germany,70,82.5,90,,90,,,,,,,,,,,90,S,Wraps,F,M3,82.5,,
1,Amanda Dewhurst,1965,67.05,UK,90,100,107.5,,107.5,,,,,,,,,,,107.5,S,Wraps,F,M4,67.5,,
1,Pavel Janíček,2002,92.65,Czechia,190,210,230,,230,,,,,,,,,,,230,S,Wraps,M,T3,100,,
1,Tomáš Kunz,2002,65.5,Czechia,150,160,175,185,175,,,,,,,,,,,175,S,Multi-ply,M,J,67.5,,
1,Filip Rotter,1999,96.6,Czechia,265,-285,310,,310,,,,,,,,,,,310,S,Wraps,M,J,100,,
2,Jan Kolář,2002,99.9,Czechia,180,200,210,,210,,,,,,,,,,,210,S,Wraps,M,J,100,,
1,Ruzbeh Jafarinamin,1986,79,Ukraine,190,205,215,,215,,,,,,,,,,,215,S,Wraps,M,O,82.5,,
1,Tibor Kiss,1988,94.4,Hungary,260,-275,-275,,260,,,,,,,,,,,260,S,Wraps,M,O,100,,
2,Tomáš Obert,1993,97.5,Czechia,220,230,235,,235,,,,,,,,,,,235,S,Wraps,M,O,100,,
3,Robert Kolena,1995,95.65,Czechia,220,-225,-235,,220,,,,,,,,,,,220,S,Wraps,M,O,100,,
DQ,Tomáš Komárek,1993,99.55,Czechia,,,,,,,,,,,,,,,,,S,Wraps,M,O,100,,
1,Juraj Kačmárik,1985,107.4,Slovakia,260,-285,,,260,,,,,,,,,,,260,S,Wraps,M,O,110,,
1,Dmitry Gotlashov,1985,123.2,Ukraine,260,280,290,,290,,,,,,,,,,,290,S,Wraps,M,O,125,,
DQ,Łukasz Lipka,1992,123.1,Poland,-320,,,,,,,,,,,,,,,,S,Wraps,M,O,125,,
1,Martin Hurdálek,1978,97.4,Czechia,-280,280,-300,,280,,,,,,,,,,,280,S,Multi-ply,M,M1,100,,
1,Austin Hickey,1980,105.3,Ireland,220,240,255,,255,,,,,,,,,,,255,S,Wraps,M,M1,110,,
1,Karel Sazma,1975,74.35,Czechia,150,160,171,,171,,,,,,,,,,,171,S,Wraps,M,M2,75,,
DQ,Josef Jeníček,1973,103.4,Czechia,-185,-185,-185,,,,,,,,,,,,,,S,Wraps,M,M2,110,,
DQ,Milan Greguš,1968,100,Czechia,-287.5,-300,,,,,,,,,,,,,,,S,Multi-ply,M,M3,100,,
1,Milan Greguš,1968,100,Czechia,252.5,-257.5,,,252.5,,,,,,,,,,,252.5,S,Wraps,M,M3,100,,
1,Hagen Ribb,1970,111.2,Germany,170,200,210,,210,,,,,,,,,,,210,S,Wraps,M,M3,125,,
1,Tomáš Leinveber,1972,135,Czechia,215,-222.5,-225,,215,,,,,,,,,,,215,S,Wraps,M,M3,140,,
1,Vladimír Gosin,1965,92.8,Israel,270,290,,,290,,,,,,,,,,,290,S,Multi-ply,M,M4,100,,
1,Pavel Malina,1960,63.25,Czechia,185,-200,,,185,,,,,,,,,,,185,S,Multi-ply,M,M5,67.5,,
1,Karol Brečka,1961,77.9,Czechia,190,197.5,-202.5,,197.5,,,,,,,,,,,197.5,S,Multi-ply,M,M5,82.5,,
1,Mieczysłąw Maczka,1954,81.25,Germany,120,,,,120,,,,,,,,,,,120,S,Multi-ply,M,M6,82.5,,
1,Mieczysłąw Maczka,1954,81.25,Germany,120,135,,,135,,,,,,,,,,,135,S,Wraps,M,M6,82.5,,
1,Vladimír Svoboda,1952,93.25,Czechia,135,-140,140,,140,,,,,,,,,,,140,S,Wraps,M,M6,100,,
DQ,Jozef Meravý,1950,97.75,Slovakia,-80,-120,-120,,,,,,,,,,,,,,S,Wraps,M,M7,100,,
1,David Rex Thomas,1951,112.3,UK,120,130,,,130,,,,,,,,,,,130,S,Multi-ply,M,M7,125,,
1,Terezie Uherková,2003,69.3,Czechia,85,-95,-100,,85,42.5,47.5,-50,,47.5,-110,110,117.5,,117.5,250,SBD,Wraps,F,T3,75,,18
1,Tereza Rykrová,2001,59.9,Czechia,115,-125,130,,130,50,-55,-55,,50,120,135,-140,,135,315,SBD,Wraps,F,J,60,,20
1,Michaela Zemanová,2000,66.15,Czechia,165,175,180,,180,87.5,90,92.5,,92.5,175,182.5,187.5,,187.5,460,SBD,Wraps,F,J,67.5,,22
1,Magda Urbanowicz,1993,49.75,Poland,115,120,-125,,120,62.5,67.5,70,,70,130,137.5,142.5,,142.5,332.5,SBD,Wraps,F,O,52,,28
2,Viktorija Polubojarinova-Ivanova,1992,51.95,Latvia,110,120,-130,,120,55,60,-65,,60,130,-135,-140,,130,310,SBD,Wraps,F,O,52,,29
1,Klára Haičmanová,1996,52.75,Czechia,135,145,-150,,145,62.5,-65,65,,65,135,-145,-145,,135,345,SBD,Wraps,F,O,56,,25
2,Małgorzata Bartosiak,1983,55.55,Poland,117.5,-122.5,122.5,,122.5,50,55,57.5,,57.5,-125,132.5,140,,140,320,SBD,Wraps,F,O,56,,39
1,Aleksandra Szymczykowska,1998,59.5,Poland,160,170,-180,,170,-105,105,110,,110,160,170,175,,175,455,SBD,Wraps,F,O,60,,24
2,Anna Przybysz,1989,59.35,Poland,125,135,142.5,,142.5,60,62.5,-65,,62.5,135,145,-147.5,,145,350,SBD,Wraps,F,O,60,,33
1,Hana Malinová,1983,63.45,Czechia,110,-120,-125,,110,50,57.5,-60,,57.5,80,100,115,,115,282.5,SBD,Multi-ply,F,O,67.5,,38
1,Kristine Rathena,1982,66.55,Latvia,100,107.5,-115,,107.5,55,60,-65,,60,110,120,130,,130,297.5,SBD,Wraps,F,O,67.5,,39
2,Julija Pajula,1985,61,Latvia,80,-90,95,,95,50,55,-60,,55,90,100,110,,110,260,SBD,Wraps,F,O,67.5,,36
5,Michaela Kučerová,1998,73.6,Czechia,122.5,127.5,132.5,,132.5,-72.5,75,-77.5,,75,140,147.5,152.5,,152.5,360,SBD,Wraps,F,O,75,,23
7,Zuzana Mautnerová,2000,70.2,Czechia,85,87.5,95,,95,55,60,-62.5,,60,105,115,122.5,,122.5,277.5,SBD,Wraps,F,O,75,,21
1,Romy Grieve,1993,74.85,Scotland,140,-147.5,-147.5,,140,80,85,-87.5,,85,175,-180,180,,180,405,SBD,Wraps,F,O,75,,28
2,Anita Wysokińska,1992,73.75,Poland,140,150,160,,160,70,72.5,75,,75,150,157.5,165,,165,400,SBD,Wraps,F,O,75,,29
3,Diane Gaughan,1989,73.8,Scotland,140,-150,152.5,,152.5,72.5,80,82.5,,82.5,150,160,165,,165,400,SBD,Wraps,F,O,75,,32
4,Aimee Brown,1995,73.55,Scotland,147.5,155,-162.5,,155,65,-67.5,-67.5,,65,150,160,170,,170,390,SBD,Wraps,F,O,75,,27
6,Olga Jermačenko,1983,72.8,Latvia,110,115,120,,120,65,67.5,70,,70,140,-145,145,,145,335,SBD,Wraps,F,O,75,,38
8,Alina Fisenkova,1983,67.95,Latvia,80,85,-95,,85,45,50,-55,,50,90,100,105,,105,240,SBD,Wraps,F,O,75,,38
1,Marie Tomečková,1998,82,Czechia,155,165,170,,170,77.5,82.5,-87.5,,82.5,175,187.5,190,,190,442.5,SBD,Wraps,F,O,82.5,,24
2,Samantha Cunningham,1994,82.2,Scotland,150,-160,-165,,150,65,-70,-70,,65,175,185,-190,,185,400,SBD,Wraps,F,O,82.5,,28
3,Natalie Hurdley,1988,78.7,UK,112.5,120,-122.5,,120,62.5,-65,-65,,62.5,125,130,-135,,130,312.5,SBD,Wraps,F,O,82.5,,33
1,Kristýna Kohoutová,1996,85.15,Czechia,180,-200,-205,,180,85,95,100,,100,170,-185,-185,,170,450,SBD,Wraps,F,O,90,,25
2,Karina Bagažkova,1986,86.4,Latvia,130,140,150,,150,75,80,-85,,80,150,160,-165,,160,390,SBD,Wraps,F,O,90,,36
1,Aija Mikulica,1978,59.05,Latvia,90,95,100,,100,50,55,57.5,,57.5,115,120,-125,,120,277.5,SBD,Wraps,F,M1,60,,44
1,Iveta Trakacenoka,1973,69.85,Latvia,90,100,110,,110,50,55,-60,,55,110,120,125,,125,290,SBD,Wraps,F,M2,75,,49
1,Marcela Zazvonilová,1971,55.35,Czechia,95,105,-110,,105,55,-60,-60,,55,130,137.5,140,,140,300,SBD,Wraps,F,M3,56,,50
1,Leena Stålstedt,1968,72.2,Finland,105,115,-122.5,,115,70,75,77.5,,77.5,110,115,120,,120,312.5,SBD,Wraps,F,M3,75,,54
1,Lesley Jayne Thomas,1966,59.3,UK,137.5,-142.5,-142.5,,137.5,67.5,70,-73,,70,-150,150,155,-160,155,362.5,SBD,Wraps,F,M4,60,,56
1,Amanda Dewhurst,1965,65.95,UK,90,100,105,,105,45,55,62.5,,62.5,110,125,140,,140,307.5,SBD,Wraps,F,M4,67.5,,57
1,Štěpán Král,2008,46.35,Czechia,60,-75,75,,75,30,37.5,-40,,37.5,80,100,-110,,100,212.5,SBD,Wraps,M,T1,56,,14
1,Ľubomír Tobias Majstrák,2009,58.6,Slovakia,60,70,80,,80,40,-50,-50,,40,60,70,80,,80,200,SBD,Wraps,M,T1,60,,13
1,Alexander Kopálek,2007,65.35,Slovakia,90,105,-115,,105,45,50,-52.5,,50,110,120,-125,,120,275,SBD,Wraps,M,T1,67.5,,15
1,Ondřej Ščuglík,2006,86.4,Czechia,230,-250,250,,250,130,-150,-150,,130,235,260,,,260,640,SBD,Wraps,M,T1,90,,15
1,Antonín Lejsek,2004,71.3,Czechia,-155,-155,155,,155,80,-87.5,-87.5,,80,165,170,-172.5,,170,405,SBD,Wraps,M,T2,75,,17
2,Adam Jonák,2004,69.3,Czechia,130,140,145,,145,75,-85,-85,,75,130,145,165,,165,385,SBD,Wraps,M,T2,75,,17
1,Martin Ferkl,2004,77.25,Czechia,140,160,180,,180,85,-92.5,97.5,,97.5,170,185,-200,,185,462.5,SBD,Wraps,M,T2,82.5,,17
1,Filip Zajíček,2005,92.25,Czechia,-210,-210,210,,210,125,-130,-130,,125,270,-290,,,270,605,SBD,Wraps,M,T2,100,,16
2,Adam Kaiser,2005,99.45,Czechia,185,195,205,,205,115,-120,-125,,115,190,202.5,-207.5,,202.5,522.5,SBD,Wraps,M,T2,100,,17
1,Jakub Lindovský,2002,59.25,Czechia,-160,160,-170.5,,160,70,75,80,,80,120,130,-140,,130,370,SBD,Wraps,M,T3,60,,19
1,Radek Knápek,2003,73.4,Czechia,200,210,220,,220,130,140,-145,,140,170,185,-190,,185,545,SBD,Wraps,M,T3,75,,19
2,Martin Chudoba,2002,71.6,Czechia,180,200,-220,,200,105,115,-120,,115,200,220,-225,,220,535,SBD,Wraps,M,T3,75,,19
3,Tyler Smith #4,2002,71.8,Scotland,145,-152.5,-155,,145,72.5,77.5,82.5,,82.5,175,185,190,,190,417.5,SBD,Wraps,M,T3,75,,19
1,Aleš Keřlík,2002,79.7,Czechia,-240,240,260,,260,110,120,125,,125,-260,260,270,,270,655,SBD,Wraps,M,T3,82.5,,19
2,Huw Curram,2004,80.65,UK,210,225,-235,,225,150,162.5,-167.5,,162.5,240,-260,-260,,240,627.5,SBD,Wraps,M,T3,82.5,,18
1,Dominik Nitsche,2002,85.15,Czechia,-260,260,280,,280,150,-160,160,,160,230,240,255,,255,695,SBD,Wraps,M,T3,90,,19
DQ,Lumír Solař,2003,87.55,Czechia,180,190,200,,200,-110,-115,-115,,,,,,,,,SBD,Wraps,M,T3,90,,18
DQ,Filip Kropáček,2002,89.8,Czechia,190,-200,200,,200,115,-125,125,,125,-230,-230,-230,,,,SBD,Wraps,M,T3,90,,19
1,Viktor Strážnický,2003,99.65,Czechia,-230,-230,230,,230,160,-170,-175,,160,265,280,-290,,280,670,SBD,Wraps,M,T3,100,,19
2,Martin Ondrišík,2003,97.6,Czechia,200,210,220,,220,125,130,137.5,,137.5,200,220,235,,235,592.5,SBD,Wraps,M,T3,100,,19
1,Tomáš Kunz,2002,64.15,Czechia,140,-155,160,,160,80,87.5,92.5,,92.5,140,145,150,,150,402.5,SBD,Wraps,M,J,67.5,,20
1,Dominik Bílý,2001,73.3,Czechia,200,-210,210,,210,120,125,130,,130,190,200,205,,205,545,SBD,Wraps,M,J,75,,21
2,Adam Keřlík,2001,72.65,Czechia,180,-200,-200,,180,110,120,-130,,120,200,220,237.5,,237.5,537.5,SBD,Wraps,M,J,75,,20
3,Ben Phillips #1,2000,74.1,UK,-175,-175,175,,175,105,112.5,117.5,,117.5,200,217.5,225,,225,517.5,SBD,Wraps,M,J,75,,21
4,Martin Chalupa,1999,73.9,Czechia,-130,130,-150,,130,100,-120,-120,,100,-140,140,,,140,370,SBD,Wraps,M,J,75,,22
1,Matěj Kubíček,2000,80.6,Czechia,240,260,-280,,260,110,115,-120,,115,280,305,-312.5,,305,680,SBD,Wraps,M,J,82.5,,22
2,Reko Sivonen,1999,75.15,Finland,-170,170,-180,,170,105,110,-115,,110,170,-182.5,-182.5,,170,450,SBD,Wraps,M,J,82.5,,23
1,Filip Rotter,1999,89.7,Czechia,265,285,305,,305,-150,162.5,167.5,,167.5,305,327.5,-332.5,,327.5,800,SBD,Wraps,M,J,90,,22
2,Hubert Przybylski,1998,83.1,Poland,245,-265,-270,,245,150,160,-167.5,,160,265,-270,-270,,265,670,SBD,Wraps,M,J,90,,23
3,Jack Haxton,1999,87.25,Scotland,215,225,235,,235,130,145,-155,,145,270,290,-302.5,,290,670,SBD,Wraps,M,J,90,,22
4,Filip Daněk,1998,89.7,Czechia,220,240,-250,,240,140,150,-160,,150,220,240,250,,250,640,SBD,Wraps,M,J,90,,23
5,Oldřich Janoušek,1999,88.5,Czechia,200,-217.5,-217.5,,200,140,152.5,-160,,152.5,210,227.5,-235,,227.5,580,SBD,Wraps,M,J,90,,23
6,Jan Jansa,2002,88.95,Czechia,200,-212.5,-212.5,,200,120,130,-135,,130,210,230,-250,,230,560,SBD,Wraps,M,J,90,,20
7,Jiří Šmolík,2001,88.1,Czechia,170,180,-185,,180,125,-132.5,132.5,,132.5,205,212.5,215,,215,527.5,SBD,Wraps,M,J,90,,20
1,David Kovanda,1998,98.8,Czechia,240,260,-270,,260,150,160,-167.5,,160,250,260,270,,270,690,SBD,Wraps,M,J,100,,23
2,David Emmanuel,2000,97.7,Scotland,210,220,227.5,,227.5,150,162.5,170,,170,245,255,-262.5,,255,652.5,SBD,Wraps,M,J,100,,22
3,Lukáš Hroděj,1999,94,Czechia,190,205,-215,,205,130,140,-145,,140,200,210,220,,220,565,SBD,Wraps,M,J,100,,22
4,Jakub Chlumecký,1999,92,Czechia,-150,150,-170,,150,90,-97.5,,,90,195,210,-215,,210,450,SBD,Wraps,M,J,100,,23
1,Matěj Syrovátka,1998,102.8,Czechia,310,325,-341,,325,205,220,225,,225,320,-340,,,320,870,SBD,Wraps,M,J,110,,23
2,Tomáš Hovorka,1998,108.9,Czechia,270,285,290,,290,190,200,205,,205,290,305,-312.5,,305,800,SBD,Wraps,M,J,110,,23
3,Adam Egermaier,2000,107.9,Czechia,-240,240,-255,,240,155,165,-172.5,,165,250,265,275,,275,680,SBD,Wraps,M,J,110,,21
4,Martin Platzer,2000,102.3,Czechia,240,255,-265,,255,135,142.5,-150,,142.5,250,265,-280,,265,662.5,SBD,Wraps,M,J,110,,22
5,Ondřej Kasal,1999,100.2,Czechia,190,210,220,,220,110,117.5,,,117.5,220,235,-245,,235,572.5,SBD,Wraps,M,J,110,,23
1,Vlastimil Šafařík,1998,122.4,Czechia,315,340,355,,355,200,-210,210,215,210,280,295,-300,,295,860,SBD,Wraps,M,J,125,,23
2,Martin Medvedyk,1999,122.4,Czechia,330,360,-400,,360,150,160,170,,170,280,290,-300,,290,820,SBD,Wraps,M,J,125,,23
3,Connor McKechnie,1998,112.9,Scotland,237.5,252.5,265,,265,150,170,175,,175,295,310,-320,,310,750,SBD,Raw,M,J,125,,23
4,Petr Matěna,2001,117.8,Czechia,220,240,250,,250,115,125,-130,,125,235,250,260,,260,635,SBD,Wraps,M,J,125,,20
1,Daniel Šimončič,1997,58.65,Slovakia,-120,-120,120,,120,100,-102.5,-105,,100,150,160,-165,,160,380,SBD,Wraps,M,O,60,,25
1,Jiří Lacina,1991,64.95,Czechia,160,165,170,,170,100,110,115,,115,190,215,220,,220,505,SBD,Wraps,M,O,67.5,,31
1,Michael Štěpánek,1995,74.2,Czechia,205,220,-225,,220,115,120,-125,,120,250,-260,260,,260,600,SBD,Wraps,M,O,75,,26
2,Rory Porter,1991,74.9,UK,207.5,220,230,,230,130,135,-140,,135,215,230,235,,235,600,SBD,Wraps,M,O,75,,31
3,Sean Smith #4,1986,75,UK,-205,205,,,205,117.5,-122.5,-122.5,,117.5,250,,,,250,572.5,SBD,Wraps,M,O,75,,36
4,Martin Ürban,1991,74.25,Czechia,-180,180,-205,,180,135,142.5,-150,,142.5,210,220,230,,230,552.5,SBD,Wraps,M,O,75,,31
5,František Tichý,1994,72.5,Czechia,170,185,195,,195,-130,130,-135,,130,210,220,-227.5,,220,545,SBD,Wraps,M,O,75,,27
6,Radek Trvaj,1997,73.65,Czechia,160,-170,-170,,160,135,142.5,150,,150,210,220,-230,,220,530,SBD,Wraps,M,O,75,,25
7,Jiří Růt,1988,73.4,Czechia,140,150,-160,,150,90,95,100,,100,170,180,190,,190,440,SBD,Wraps,M,O,75,,34
1,Ruzbeh Jafarinamin,1986,75.35,Ukraine,180,190,200,,200,125,135,140,,140,180,190,200,,200,540,SBD,Multi-ply,M,O,82.5,,36
1,Patrik Tomáš,1996,81.1,Czechia,220,-240,240,,240,145,155,,,155,-260,260,-285,,260,655,SBD,Wraps,M,O,82.5,,26
2,Radek Mandl,1993,75.3,Czechia,220,235,245,,245,130,140,142.5,,142.5,240,260,-267.5,,260,647.5,SBD,Wraps,M,O,82.5,,28
3,Tomasz Szymanski,1983,81.65,Poland,140,155,170,,170,90,-100,-100,,90,190,200,-205,,200,460,SBD,Wraps,M,O,82.5,,39
DQ,Edgars Peterlēvics,1986,88.5,Latvia,290,-300,-300,,290,-275,-275,-275,,,-250,,,,,,SBD,Multi-ply,M,O,90,,35
1,Jack Harman,1993,89.55,UK,-270,270,-292.5,,270,150,-160,160,,160,270,290,-300,,290,720,SBD,Wraps,M,O,90,,29
2,Marcin Kosut,1988,88.95,Poland,250,260,-270,,260,160,170,-175,,170,260,-280,-280,,260,690,SBD,Wraps,M,O,90,,33
3,Tavis Royer,1998,88.4,UK,222.5,232.5,242.5,,242.5,127.5,137.5,147.5,,147.5,-260,280,-300,,280,670,SBD,Raw,M,O,90,,24
4,Adam Vokál,1993,83.4,Czechia,230,250,-265,,250,140,155,165,,165,235,250,-255,,250,665,SBD,Wraps,M,O,90,,28
5,Tomáš Horák,1994,88.2,Czechia,-200,-200,200,,200,-120,120,132.5,,132.5,245,260,-270,,260,592.5,SBD,Wraps,M,O,90,,28
1,Chris Pugh #1,1993,97.3,UK,-320,320,358.5,,358.5,150,175,192.5,,192.5,250,275,,,275,826,SBD,Wraps,M,O,100,,29
2,Mateusz Morawiec,1985,97.1,Poland,255,-270,280,,280,155,162.5,167.5,,167.5,280,295,315,,315,762.5,SBD,Wraps,M,O,100,,36
3,Richard Novotný,1993,96.3,Czechia,280,300,-310,,300,150,160,-165,,160,300,-315,-315,,300,760,SBD,Wraps,M,O,100,,29
4,Tomáš Komárek,1993,99.55,Czechia,250,-270,-270,,250,170,180,,,180,270,285,-290,,285,715,SBD,Wraps,M,O,100,,29
5,Petr Vaněrka,1998,99.2,Czechia,190,205,215,,215,150,160,-165,,160,250,260,-265,,260,635,SBD,Wraps,M,O,100,,24
6,Tomáš Obert,1993,97.5,Czechia,220,230,-240,,230,140,-145,-145,,140,250,-260,260,,260,630,SBD,Wraps,M,O,100,,29
7,Martin Studnička,1993,98.5,Czechia,190,205,212.5,,212.5,100,107.5,112.5,,112.5,215,230,245,,245,570,SBD,Wraps,M,O,100,,29
1,Dušan Jovanović,1992,109.2,Serbia,320,-335,-335,,320,205,215,222.5,,222.5,360,-371,-371,,360,902.5,SBD,Wraps,M,O,110,,29
2,Juraj Kačmárik,1985,107.4,Slovakia,280,300,-310,,300,170,180,-185,,180,315,-335,-335,,315,795,SBD,Wraps,M,O,110,,37
3,Matthew Fealey,1980,106.6,UK,260,-280,280,,280,170,180,190,,190,275,295,305,,305,775,SBD,Wraps,M,O,110,,42
4,Robert Ivanič,1998,106.6,Czechia,260,275,,,275,190,202.5,-205,,202.5,-260,270,280,,280,757.5,SBD,Wraps,M,O,110,,24
5,Matěj Svoboda,1997,108.2,Czechia,260,-275,-275,,260,170,177.5,182.5,,182.5,265,275,-282.5,,275,717.5,SBD,Wraps,M,O,110,,25
6,Mateusz Wojciechowski,1994,108.5,Poland,215,230,-240,,230,160,-165,-165,,160,250,-270,,,250,640,SBD,Wraps,M,O,110,,27
DQ,Elviss Kranats,1994,110,Latvia,-280,-280,,,,,,,,,,,,,,,SBD,Wraps,M,O,110,,28
1,Pavel Urbánek,1993,123.6,Czechia,280,295,-300,,295,195,205,-210,,205,300,-312.5,312.5,,312.5,812.5,SBD,Wraps,M,O,125,,28
2,Łukasz Lipka,1992,123.1,Poland,310,-330,330,,330,175,180,-182.5,,180,300,-310,,,300,810,SBD,Wraps,M,O,125,,29
3,George Iacob,1991,119.4,Scotland,-290,300,-317.5,,300,195,205,212.5,,212.5,270,282.5,-300,,282.5,795,SBD,Wraps,M,O,125,,30
4,Liam Goldie,1997,123,Scotland,235,245,250,,250,130,-135,-135,,130,250,260,-262.5,,260,640,SBD,Wraps,M,O,125,,25
DQ,Kirils Afanasjevs,1982,111.9,Latvia,-265,-265,265,,265,160,-170,170,,170,-300,-300,,,,,SBD,Wraps,M,O,125,,39
DQ,John Sutherland,1987,117.9,Scotland,-265,-265,-265,,,,,,,,,,,,,,SBD,Wraps,M,O,125,,35
DQ,Jan Mulač,1987,117.6,Czechia,270,300,-310,,300,180,195,-200,,195,-290,,,,,,SBD,Wraps,M,O,125,,35
1,Maciej Młynarczyk,1991,126.1,Poland,290,305,320,,320,200,210,215,,215,-280,290,310,,310,845,SBD,Wraps,M,O,140,,31
1,Nino Jelčić,1995,161.5,Czechia,260,270,-280,,270,170,180,-190,,180,280,-300,300,,300,750,SBD,Wraps,M,O,140+,,27
1,Gleb Braginski,1980,73.6,Israel,152.5,-162.5,165,,165,117.5,125,,,125,210,222.5,-232.5,,222.5,512.5,SBD,Wraps,M,M1,75,,41
1,Robert Kucza,1977,81.45,Poland,110,120,-135,,120,100,110,-120,,110,160,165,175,,175,405,SBD,Wraps,M,M1,82.5,,44
1,Neil Gren,1981,98.85,UK,-230,230,,,230,140,-155,155,,155,260,265,270,,270,655,SBD,Wraps,M,M1,100,,41
1,Eben van Wyk,1981,107.6,Scotland,240,260,280,,280,170,180,-190,,180,295,315,330,,330,790,SBD,Wraps,M,M1,110,,41
1,Andrew Cairney,1979,120.8,Scotland,280,300,320,,320,160,170,-180,,170,300,312.5,-321,,312.5,802.5,SBD,Wraps,M,M1,125,,42
2,Andrey Sidurin,1980,123.8,Israel,-240,250,-270,,250,100,-110,,,100,230,240,250,,250,600,SBD,Wraps,M,M1,125,,42
1,Anton Frič,1973,82.4,Slovakia,230,250,260,,260,155,165,172.5,175.5,172.5,240,257.5,-267.5,,257.5,690,SBD,Wraps,M,M2,82.5,,49
2,Tomáš Šesták,1973,78.95,Czechia,180,195,202.5,,202.5,110,117.5,,,117.5,220,235,-250,,235,555,SBD,Wraps,M,M2,82.5,,48
1,James Ingram,1973,88.55,Scotland,185,200,-210,,200,120,-130,130,,130,210,222.5,230,,230,560,SBD,Wraps,M,M2,90,,48
1,Eugenijus Cibulskis,1975,97.45,Lithuania,200,220,240,,240,130,140,150,,150,205,220,230,,230,620,SBD,Multi-ply,M,M2,100,,47
1,Martin Macik,1975,95.4,Czechia,170,180,190,,190,120,130,135,,135,180,200,205,,205,530,SBD,Wraps,M,M2,100,,46
1,Ľubomír Majstrák,1974,115.6,Slovakia,110,120,130,,130,40,50,60,,60,110,120,130,,130,320,SBD,Wraps,M,M2,125,,48
1,Jiří Sucharda,1974,140.3,Czechia,210,-225,230,,230,145,155,-165,,155,220,240,,,240,625,SBD,Wraps,M,M2,140+,,47
DQ,Rory May,1967,66.1,Scotland,-160,-160,-160,,,-100,-105,-105,,,-160,-172.5,,,,,SBD,Wraps,M,M3,67.5,,54
1,Roman Mandík,1968,74.35,Czechia,140,150,-155,,150,95,100,-105,,100,170,180,-185,,180,430,SBD,Wraps,M,M3,75,,54
1,Krzysztof Tur,1967,94.9,Poland,215,225,240.5,,240.5,110,120,125,,125,220,235,-242.5,,235,600.5,SBD,Wraps,M,M3,100,,54
1,Richárd Ferkl,1969,102,Czechia,-160,160,175,,175,115,120,-125,,120,180,200,210,,210,505,SBD,Wraps,M,M3,110,,52
DQ,Radek Lešiga,1971,109.4,Czechia,-230,-230,-240,,,-160,,,,,,,,,,,SBD,Wraps,M,M3,110,,51
1,Vladimír Gosin,1965,92,Israel,230,240,250,,250,150,160,-170,,160,260,275,-280,,275,685,SBD,Wraps,M,M4,100,,57
1,František Nováček,1964,109,Czechia,215,225,-235,,225,-180,185,190,,190,235,245,255,,255,670,SBD,Wraps,M,M4,110,,57
2,Andrew Flavell,1966,107.9,Scotland,235,-250,257.5,,257.5,140,-150,-150,,140,240,260,-265,,260,657.5,SBD,Wraps,M,M4,110,,55
1,Pavel Malina,1960,62.9,Czechia,185,200,210,,210,107.5,112.5,-115,,112.5,165,175,-185,,175,497.5,SBD,Multi-ply,M,M5,67.5,,62
1,Karol Brečka,1961,77.65,Czechia,190,-205,,,190,-110,110,117.5,,117.5,180,190,-200,,190,497.5,SBD,Multi-ply,M,M5,82.5,,61
1,Juhani Kärkkäinen,1959,99.2,Finland,180,190,200,,200,130,135,140,,140,220,235,247.5,,247.5,587.5,SBD,Wraps,M,M5,100,,62
1,Dainis Polis,1959,103.2,Latvia,150,160,-170,,160,120,130,-140,,130,180,190,200,,200,490,SBD,Wraps,M,M5,110,,62
1,Stanislav Hoza,1956,82.5,Czechia,210,235,,,235,150,155,160,,160,190,205,215,,215,610,SBD,Multi-ply,M,M6,82.5,,66
2,Mieczysłąw Maczka,1954,81.4,Germany,-120,120,132.5,,132.5,90,,,,90,127.5,142.5,,,142.5,365,SBD,Multi-ply,M,M6,82.5,,67
1,Mieczysłąw Maczka,1954,81.4,Germany,120,132.5,-140,,132.5,90,97.5,,,97.5,125,140,,,140,370,SBD,Wraps,M,M6,82.5,,67
1,Jan Suda,1956,88.8,Czechia,97.5,110,115,,115,65,-70,70,,70,135,145,152.5,,152.5,337.5,SBD,Wraps,M,M6,90,,66
1,Vladimír Svoboda,1952,92.25,Czechia,-135,,135,,135,85,92.5,-100,,92.5,140,150,155,,155,382.5,SBD,Wraps,M,M6,100,,69
1,Boris Laishin,1950,71.7,Israel,85,100,-110,,100,105,110,-112.5,,110,140,150,160,,160,370,SBD,Wraps,M,M7,75,,71
1,Adam Jasiński,1951,79.2,Poland,185,195,-200,,195,80,87.5,-95,,87.5,180,190,195,,195,477.5,SBD,Wraps,M,M7,82.5,,71
1,Pavel Erban,1952,93.65,Czechia,-115,120,-135,,120,80,85,90,,90,130,140,145,,145,355,SBD,Wraps,M,M7,100,,70
1,David Rex Thomas,1951,111.2,UK,125,140,150,,150,75,102.5,,,102.5,140,152.5,160,,160,412.5,SBD,Multi-ply,M,M7,125,,70
1,Natalia Szpila,2005,53.7,Poland,,,,,,,,,,,95,97.5,102.5,,102.5,102.5,D,Raw,F,T2,56,,
1,Tereza Šimková,2004,74.6,Czechia,,,,,,,,,,,-130,135,145,151,145,145,D,Raw,F,T3,75,,
1,Magdalena Maria Szpila,2002,51.1,Poland,,,,,,,,,,,120,130,-135,,130,130,D,Raw,F,J,52,,
1,Nadine Schneider,1998,57.9,Germany,,,,,,,,,,,120,130,137.5,,137.5,137.5,D,Raw,F,J,60,,
2,Elżbieta Kardaś,1999,58.6,Poland,,,,,,,,,,,120,130,-140,,130,130,D,Raw,F,J,60,,
3,Simona Rančev,2002,59.3,Czechia,,,,,,,,,,,-122.5,122.5,-127.5,,122.5,122.5,D,Raw,F,J,60,,
1,Eva Strnadová,1983,51.05,Czechia,,,,,,,,,,,100,110,-115,,110,110,D,Raw,F,O,52,,
1,Eva Padová,1990,59.5,Slovakia,,,,,,,,,,,90,100,-110,,100,100,D,Raw,F,O,60,,
1,Andrea Benešová,1992,66.6,Czechia,,,,,,,,,,,-120,130,145,,145,145,D,Raw,F,O,67.5,,
1,Veronika Strolená,1985,69.05,Czechia,,,,,,,,,,,120,130,-140,,130,130,D,Raw,F,O,75,,
1,Renata Zapała,1994,80.7,Poland,,,,,,,,,,,110,120,125,,125,125,D,Raw,F,O,82.5,,
1,Kateřina Švecová,1989,96.2,Czechia,,,,,,,,,,,150,-165,-170,,150,150,D,Raw,F,O,110,,
1,Ágnes Papp,1978,50.1,Hungary,,,,,,,,,,,100,110,-115,,110,110,D,Raw,F,M1,52,,
1,Eszter Csonka,1977,58.2,Hungary,,,,,,,,,,,90,110,115,,115,115,D,Raw,F,M1,60,,
1,Daniela Poláková,1976,59.8,Czechia,,,,,,,,,,,140,150,160,,160,160,D,Raw,F,M2,60,,
1,Monika Aus,1971,53.2,Estonia,,,,,,,,,,,110,-120,120,,120,120,D,Multi-ply,F,M3,56,,
1,Ester Cichá,1970,55.6,Czechia,,,,,,,,,,,110,120.5,-122.5,,120.5,120.5,D,Raw,F,M3,56,,
2,Monika Aus,1971,53.2,Estonia,,,,,,,,,,,90,100,,,100,100,D,Raw,F,M3,56,,
1,Amanda Dewhurst,1965,67,UK,,,,,,,,,,,125,135,147.5,,147.5,147.5,D,Raw,F,M4,67.5,,
1,Brigitte Maczka,1961,71.1,Germany,,,,,,,,,,,95,106,,,106,106,D,Multi-ply,F,M5,75,,
1,Brigitte Maczka,1961,71.1,Germany,,,,,,,,,,,90,100,105,,105,105,D,Raw,F,M5,75,,
1,Dana Bešková,1954,55.4,Czechia,,,,,,,,,,,70,77.5,-82.5,,77.5,77.5,D,Raw,F,M6,56,,
1,Štěpán Král,2008,47.1,Czechia,,,,,,,,,,,80,100,-105,,100,100,D,Raw,M,T1,56,,
2,Daniel Pianka,2008,38.35,Czechia,,,,,,,,,,,60,70,80,,80,80,D,Raw,M,T1,56,,
1,Vít Vencelides,2006,76.15,Czechia,,,,,,,,,,,195,210,215,-220,215,215,D,Raw,M,T1,82.5,,
1,Marek Novotný,2004,59.6,Czechia,,,,,,,,,,,161.5,170.5,-180,180,170.5,170.5,D,Raw,M,T2,60,,
2,Tomáš Parížek,2004,58.6,Slovakia,,,,,,,,,,,161,-170,-172.5,,161,161,D,Raw,M,T2,60,,
1,Adam Novotný,2004,65.4,Czechia,,,,,,,,,,,140,150,162.5,,162.5,162.5,D,Raw,M,T2,67.5,,
1,Vojtěch Štegner,2006,73.6,Czechia,,,,,,,,,,,205,215,-220.5,-220.5,215,215,D,Raw,M,T2,75,,
1,Jakub Jarończyk,2005,81.15,Poland,,,,,,,,,,,180,195,202.5,,202.5,202.5,D,Raw,M,T2,82.5,,
1,David Krmášek,2004,92.8,Czechia,,,,,,,,,,,245,-255,,,245,245,D,Raw,M,T2,100,,
1,Roman Novotný,2005,100.2,Czechia,,,,,,,,,,,220,240,-250,,240,240,D,Raw,M,T2,110,,
1,František Mráček,2004,122.6,Czechia,,,,,,,,,,,180,190,-200,,190,190,D,Raw,M,T2,125,,
1,Jakub Fiala,2005,126.3,Czechia,,,,,,,,,,,190,-200,200,,200,200,D,Raw,M,T2,140,,
1,Radosław Bober,2004,59.95,Poland,,,,,,,,,,,140,152.5,162.5,,162.5,162.5,D,Raw,M,T3,60,,
1,Richard Jun. Ferkl,2002,82.6,Czechia,,,,,,,,,,,210,230,240,,240,240,D,Raw,M,T3,90,,
DQ,Aleš Keřlík,2002,83.45,Czechia,,,,,,,,,,,,,,,,,D,Raw,M,T3,90,,
1,Denis Jarma,1999,59.6,Czechia,,,,,,,,,,,220,-240,-240,-240,220,220,D,Raw,M,J,60,,
1,Tomáš Kunz,2002,65.8,Czechia,,,,,,,,,,,140,-170,170,,170,170,D,Multi-ply,M,J,67.5,,
1,Jan Kasper,1998,85.4,Czechia,,,,,,,,,,,225,235,-250,,235,235,D,Multi-ply,M,J,90,,
1,David Mareš,2001,89.4,Czechia,,,,,,,,,,,232.5,242.5,245,,245,245,D,Raw,M,J,90,,
2,Petr Valchář,2001,89.65,Czechia,,,,,,,,,,,225,235,-242.5,,235,235,D,Raw,M,J,90,,
1,Jakub Šanda,1999,96.3,Czechia,,,,,,,,,,,340,355,365,-372.5,365,365,D,Raw,M,J,100,,
2,Filip Rotter,1999,97,Czechia,,,,,,,,,,,275,-325,-325,,275,275,D,Raw,M,J,100,,
3,Jiří Šmolík,2001,91.15,Czechia,,,,,,,,,,,200,210,-220,,210,210,D,Raw,M,J,100,,
1,Kristian Móro,1999,116.9,Slovakia,,,,,,,,,,,275,285,-295,,285,285,D,Raw,M,J,125,,
2,Petr Matěna,2001,118.1,Czechia,,,,,,,,,,,240,255,-265,,255,255,D,Raw,M,J,125,,
1,Filip Kaňák,1993,61.85,Czechia,,,,,,,,,,,-200,205,215,,215,215,D,Multi-ply,M,O,67.5,,
1,Tomasz Miloch,1983,78.4,Poland,,,,,,,,,,,250,-260,-260,,250,250,D,Multi-ply,M,O,82.5,,
1,Šimon Matějka,1994,81.4,Czechia,,,,,,,,,,,-250,270,-280,,270,270,D,Raw,M,O,82.5,,
2,Jiří Balabán,1995,81.5,Czechia,,,,,,,,,,,260,270,-282.5,,270,270,D,Raw,M,O,82.5,,
3,Petr Nekvapil,1992,82.35,Czechia,,,,,,,,,,,140,162.5,165,,165,165,D,Raw,M,O,82.5,,
1,Dominik Šafránek,1992,87.1,Slovakia,,,,,,,,,,,270,-280,282.5,,282.5,282.5,D,Raw,M,O,90,,
2,Aivis Bogadajevs,1992,88.2,Latvia,,,,,,,,,,,240,272.5,,,272.5,272.5,D,Raw,M,O,90,,
1,Zdeněk Slovák,1986,96.1,Czechia,,,,,,,,,,,270,-290,-290,,270,270,D,Multi-ply,M,O,100,,
2,Martin Studnička,1993,100,Czechia,,,,,,,,,,,220,240,260,,260,260,D,Multi-ply,M,O,100,,
1,Martin Studnička,1993,100,Czechia,,,,,,,,,,,220,237.5,255,,255,255,D,Raw,M,O,100,,
1,Jaroslav Šoukal,1991,109.5,Czechia,,,,,,,,,,,340,-345,-345,,340,340,D,Raw,M,O,110,,
2,Juraj Kačmárik,1985,107.8,Slovakia,,,,,,,,,,,320,-340,-340,,320,320,D,Raw,M,O,110,,
3,Ľubomír Vidiščák,1987,102.6,Slovakia,,,,,,,,,,,240,260,-270,,260,260,D,Raw,M,O,110,,
1,Petr Pastýřík,1989,124.1,Czechia,,,,,,,,,,,260,270,-280,,270,270,D,Multi-ply,M,O,125,,
1,Martin Homola,1994,116.9,Czechia,,,,,,,,,,,330,355,365,,365,365,D,Raw,M,O,125,,
2,Coninck Kristof De,1985,121.8,Belarus,,,,,,,,,,,340,-355,-357.5,,340,340,D,Raw,M,O,125,,
3,Tomáš Tóth,1990,120.7,Slovakia,,,,,,,,,,,320,330,-340,,330,330,D,Raw,M,O,125,,
4,Václav Čáp,1991,118.9,Czechia,,,,,,,,,,,270,290,-300,,290,290,D,Raw,M,O,125,,
5,Petr Pastýřík,1989,124.1,Czechia,,,,,,,,,,,270,-280,,,270,270,D,Raw,M,O,125,,
DQ,Adam Kostura,1995,143.3,Czechia,,,,,,,,,,,-300,-300,,,,,D,Multi-ply,M,O,140+,,
1,Ivars Cīrulis,1979,105.1,Latvia,,,,,,,,,,,230,255,272.5,,272.5,272.5,D,Raw,M,M1,110,,
2,Eduard Valentík,1981,106.7,Czechia,,,,,,,,,,,250,-270,-270,,250,250,D,Raw,M,M1,110,,
1,Maris Kipurs,1978,110.8,Latvia,,,,,,,,,,,230,250,-260,,250,250,D,Raw,M,M1,125,,
1,Adam Švehla,1981,141.1,Czechia,,,,,,,,,,,320,335,-345,,335,335,D,Raw,M,M1,140+,,
2,Mariusz Wyrozębski,1982,143.4,Poland,,,,,,,,,,,-240,260,275,,275,275,D,Raw,M,M1,140+,,
1,Zsolt Horváth,1975,79.45,Hungary,,,,,,,,,,,235,245,-260,,245,245,D,Raw,M,M2,82.5,,
1,Ivan Obert,1973,98.4,Czechia,,,,,,,,,,,185,200,,,200,200,D,Raw,M,M2,100,,
2,Alvis Kranāts,1974,94.8,Latvia,,,,,,,,,,,160,170,,,170,170,D,Raw,M,M2,100,,
1,Grzegorz Drewniany,1977,101.9,Poland,,,,,,,,,,,240,260,270,,270,270,D,Raw,M,M2,110,,
2,Milan Pado,1972,105.6,Slovakia,,,,,,,,,,,240,260,-270,,260,260,D,Raw,M,M2,110,,
3,Przemysław Kozioł,1973,104.1,Poland,,,,,,,,,,,225,240,-245,,240,240,D,Raw,M,M2,110,,
4,Ľubomír Trstenský,1974,103.5,Slovakia,,,,,,,,,,,-220,220,230,,230,230,D,Raw,M,M2,110,,
5,Josef Jeníček,1973,104.4,Czechia,,,,,,,,,,,185,210,-222.5,,210,210,D,Raw,M,M2,110,,
1,Mariusz Cichocki,1977,118.9,Poland,,,,,,,,,,,270,-285,,,270,270,D,Raw,M,M2,125,,
1,Ivan Levický,1970,100.4,Slovakia,,,,,,,,,,,250,265,275,,275,275,D,Multi-ply,M,M3,110,,
2,Jan Bachman,1968,105.9,Czechia,,,,,,,,,,,140,170,,,170,170,D,Multi-ply,M,M3,110,,
1,Jan Bachman,1967,105.9,Czechia,,,,,,,,,,,140,170,200,,200,200,D,Raw,M,M3,110,,
1,Robert Nemś,1969,115.2,Poland,,,,,,,,,,,240,260,-267.5,,260,260,D,Raw,M,M3,125,,
1,Vladimír Gosin,1965,94.3,Israel,,,,,,,,,,,270,280,-290,,280,280,D,Raw,M,M4,100,,
1,Tibor Gejdoš,1963,102.3,Slovakia,,,,,,,,,,,230,250,-265,,250,250,D,Raw,M,M4,110,,
1,Kornel Karol Repiský,1964,122.8,Slovakia,,,,,,,,,,,230,-240,,,230,230,D,Multi-ply,M,M4,125,,
DQ,Pavel Malina,1960,64.05,Czechia,,,,,,,,,,,,,,,,,D,Multi-ply,M,M5,67.5,,
1,Karol Brečka,1961,77.95,Czechia,,,,,,,,,,,185,200,210,,210,210,D,Multi-ply,M,M5,82.5,,
1,Dainis Polis,1959,102.2,Latvia,,,,,,,,,,,190,-210,-210,,190,190,D,Raw,M,M5,110,,
1,Karel Schoř,1955,82.35,Czechia,,,,,,,,,,,-160,-160,160,,160,160,D,Raw,M,M6,82.5,,
1,Mieczysłąw Maczka,1954,83.3,Germany,,,,,,,,,,,125,150,,,150,150,D,Multi-ply,M,M6,90,,
1,Mieczysłąw Maczka,1954,83.3,Germany,,,,,,,,,,,125,145,,,145,145,D,Raw,M,M6,90,,
1,Wiesław Wrŏbel,1957,98.35,Poland,,,,,,,,,,,220,242.5,260,,260,260,D,Raw,M,M6,100,,
2,Vladimír Svoboda,1952,92.6,Czechia,,,,,,,,,,,140,150,157.5,,157.5,157.5,D,Raw,M,M6,100,,
1,Boris Laishin,1950,71.55,Israel,,,,,,,,,,,150,160,-165,,160,160,D,Raw,M,M7,75,,
1,Lothar Schulze,1950,80.6,Germany,,,,,,,,,,,150,160,,,160,160,D,Multi-ply,M,M7,82.5,,
1,Stefan Sochaňski,1948,88.3,Poland,,,,,,,,,,,180,192.5,202.5,,202.5,202.5,D,Multi-ply,M,M7,90,,
1,Stefan Sochaňski,1948,88.3,Poland,,,,,,,,,,,170,180,,,180,180,D,Raw,M,M7,90,,
1,Jozef Meravý,1950,96.8,Slovakia,,,,,,,,,,,120,140,-160,,140,140,D,Raw,M,M7,100,,
DQ,Jaroslav Tomanec,1943,81.75,Czechia,,,,,,,,,,,-140,-140,,,,,D,Multi-ply,M,M8,82.5,,
1,Kateřina Janoutová,2002,55.95,Czechia,,,,,,65,70,72.5,-75,72.5,,,,,,72.5,B,Raw,F,T3,56,,
1,Karolína Lepšová,2004,66.2,Czechia,,,,,,55,-57.5,57.5,,57.5,,,,,,57.5,B,Raw,F,T3,67.5,,
1,Diana Balážová,2003,96.35,Slovakia,,,,,,40,45,-50,,45,,,,,,45,B,Raw,F,T3,110,,
1,Iveta Mikesková,2002,56,Czechia,,,,,,55,60,62.5,,62.5,,,,,,62.5,B,Raw,F,J,56,,
1,Jagoda Owczarek,2002,73.1,Poland,,,,,,52.5,-57.5,-57.5,,52.5,,,,,,52.5,B,Raw,F,J,75,,
1,Eva Strnadová,1983,51.3,Czechia,,,,,,50,-52.5,-52.5,,50,,,,,,50,B,Raw,F,O,52,,
1,Anna Kubaszewka,1995,54,Poland,,,,,,65,72.5,-80,,72.5,,,,,,72.5,B,Raw,F,O,56,,
1,Eva Padová,1990,59.15,Slovakia,,,,,,45,50,-55,,50,,,,,,50,B,Raw,F,O,60,,
1,Joanna Kosik,1982,62.75,Poland,,,,,,112.5,-118,-118,,112.5,,,,,,112.5,B,Raw,F,O,67.5,,
2,Andrea Benešová,1992,64.5,Czechia,,,,,,90,95,100,,100,,,,,,100,B,Raw,F,O,67.5,,
1,Júlia Popa,1989,74.5,Slovakia,,,,,,75,85,-90,,85,,,,,,85,B,Raw,F,O,75,,
DQ,Pikula Małgorzata Malikowska,1985,83.1,,,,,,,,,,,,,,,,,,B,Raw,F,O,90,,
DQ,Tatiana Dudnik,1983,89.35,,,,,,,,,,,,,,,,,,B,Raw,F,O,90,,
DQ,Katarzyna Kamieńska,1984,85.15,,,,,,,,,,,,,,,,,,B,Raw,F,O,90,,
1,Monika Czarnecka,1981,80.7,Poland,,,,,,75,-80,80,,80,,,,,,80,B,Raw,F,M1,82.5,,
1,Iryna Bezyk,1974,51.65,Ukraine,,,,,,-55,55,-64,,55,,,,,,55,B,Raw,F,M2,52,,
1,Daniela Poláková,1976,59.55,Czechia,,,,,,85,92.5,-95,,92.5,,,,,,92.5,B,Raw,F,M2,60,,
1,Monika Aus,1971,52.75,Estonia,,,,,,50,52.5,-55,,52.5,,,,,,52.5,B,Raw,F,M3,56,,
DQ,Ester Cichá,1970,53.7,Czechia,,,,,,-52.5,-52.5,-52.5,,,,,,,,,B,Raw,F,M3,56,,
1,Leena Stålstedt,1968,73.6,Finland,,,,,,-72.5,72.5,80,,80,,,,,,80,B,Raw,F,M3,75,,
1,Korkis Razzouki,1965,55.9,,,,,,,,,,71,70,,,,,,70,B,Raw,F,M4,56,,
1,Brigitte Maczka,1961,71.05,Germany,,,,,,35,-40,-40,,35,,,,,,35,B,Raw,F,M5,75,,
1,Dana Bešková,1954,55.45,Czechia,,,,,,30,-35,35,,35,,,,,,35,B,Raw,F,M6,56,,
1,Dominik Jáci,2007,79.05,Czechia,,,,,,80,-92.5,100,,100,,,,,,100,B,Raw,M,T1,82.5,,
1,František Straka,2005,74.65,Czechia,,,,,,80,100,-110,,100,,,,,,100,B,Raw,M,T2,75,,
1,Tadeáš Zapletal,2004,81.4,Czechia,,,,,,-130,132.5,-137.5,,132.5,,,,,,132.5,B,Raw,M,T2,82.5,,
2,An Truong Vu,2004,82.1,Czechia,,,,,,92.5,105,112.5,,112.5,,,,,,112.5,B,Raw,M,T2,82.5,,
1,Roman Novotný,2005,98.45,Czechia,,,,,,120,130,-132.5,,130,,,,,,130,B,Raw,M,T2,100,,
1,Ondřej Stellar,2004,112.9,Czechia,,,,,,130,142.5,145,152,145,,,,,,145,B,Raw,M,T2,125,,
2,Martin Bláha,2006,119.8,Czechia,,,,,,130,140,145,-151.5,145,,,,,,145,B,Raw,M,T2,125,,
1,Radek Knápek,2003,74.1,Czechia,,,,,,130,140,-145,,140,,,,,,140,B,Raw,M,T3,75,,
1,Jan Fanta,2002,88.7,Czechia,,,,,,-100,105,110,,110,,,,,,110,B,Raw,M,T3,90,,
2,Márton Csák,2003,89.85,Hungary,,,,,,100,105,-110,,105,,,,,,105,B,Raw,M,T3,90,,
3,Matěj Bělina,2003,89.05,Czechia,,,,,,90,100,-105,,100,,,,,,100,B,Raw,M,T3,90,,
1,Pavel Janíček,2002,92.3,Czechia,,,,,,125,140,150,,150,,,,,,150,B,Raw,M,T3,100,,
1,Kacper Grabowski,2003,111.7,Poland,,,,,,135,-140,-140,,135,,,,,,135,B,Raw,M,T3,125,,
1,Marek Šimurda,2000,54.6,Slovakia,,,,,,70,80,85,,85,,,,,,85,B,Raw,M,J,56,,
1,Tamás Benedek Lóczi,2001,74.25,,,,,,,,,,,120,,,,,,120,B,Raw,M,J,75,,
2,Abdurrahman Egeli,2002,74.15,,,,,,,,,,,105,,,,,,105,B,Raw,M,J,75,,
1,Michał Kowalski,2001,81,Poland,,,,,,170,175,-180,,175,,,,,,175,B,Raw,M,J,82.5,,
2,Petr Bartošík,2001,82.25,Czechia,,,,,,145,-150,-150,,145,,,,,,145,B,Raw,M,J,82.5,,
1,Dominik Kovalčík,1999,88.8,Czechia,,,,,,175,182.5,-190,,182.5,,,,,,182.5,B,Raw,M,J,90,,
2,Petr Valchář,2001,87.5,Czechia,,,,,,130,140,145,,145,,,,,,145,B,Raw,M,J,90,,
1,Filip Krajča,1999,113.6,Czechia,,,,,,210,220,-225,,220,,,,,,220,B,Raw,M,J,125,,
2,David Bartošík,1998,116.9,Czechia,,,,,,190,-200,-200,,190,,,,,,190,B,Raw,M,J,125,,
3,Petr Jehlička,1999,115.6,Czechia,,,,,,140,150,-160,,150,,,,,,150,B,Raw,M,J,125,,
1,Krzysztof Kuraciński,1986,65.75,Poland,,,,,,130,137.5,-145,,137.5,,,,,,137.5,B,Raw,M,O,67.5,,
2,Jan Gorol,1993,66.1,Czechia,,,,,,120,130,135,,135,,,,,,135,B,Raw,M,O,67.5,,
1,Wiesław Kiwacki,1976,73,Poland,,,,,,125,130,132.5,,132.5,,,,,,132.5,B,Raw,M,O,75,,
2,Luděk Šmíd,1996,73.05,Czechia,,,,,,100,115,-130,,115,,,,,,115,B,Raw,M,O,75,,
1,Stanislav Beneš,1989,77.5,Czechia,,,,,,170,180,-185,,180,,,,,,180,B,Raw,M,O,82.5,,
2,Zdeněk Holeček,1988,78,Czechia,,,,,,170,180,-185,,180,,,,,,180,B,Raw,M,O,82.5,,
3,Mário Zastko,1995,78.6,Slovakia,,,,,,160,165,-167.5,,165,,,,,,165,B,Raw,M,O,82.5,,
4,Dawid Kluczyńśki,1990,79.5,Poland,,,,,,142.5,155,-167.5,,155,,,,,,155,B,Raw,M,O,82.5,,
5,Jan Slunečko,1994,78.85,Czechia,,,,,,140,145,-150,,145,,,,,,145,B,Raw,M,O,82.5,,
6,Damian Redzynia,1993,81.7,Poland,,,,,,140,145,-150,,145,,,,,,145,B,Raw,M,O,82.5,,
1,Vjačeslavs Letlans,1987,89.6,Latvia,,,,,,225,230,237.5,-251,237.5,,,,,,237.5,B,Raw,M,O,90,,
2,Artur Miksa,1983,87.25,Poland,,,,,,225,235,-237.5,,235,,,,,,235,B,Raw,M,O,90,,
3,Josef Rey,1984,85.85,Czechia,,,,,,197.5,-205,-205,,197.5,,,,,,197.5,B,Raw,M,O,90,,
4,Zdeněk Slovák,1986,87.9,Czechia,,,,,,170,185,-195,,185,,,,,,185,B,Raw,M,O,90,,
5,Kamil Babiš,1991,90,Czechia,,,,,,165,172.5,-180,,172.5,,,,,,172.5,B,Raw,M,O,90,,
1,Ákos Oláh,1989,99.4,Hungary,,,,,,220,227.5,235,,235,,,,,,235,B,Raw,M,O,100,,
2,Lukáš Gorol,1998,99.4,Czechia,,,,,,-210,210,-215,,210,,,,,,210,B,Raw,M,O,100,,
3,Július Mertvik,1996,96.4,Slovakia,,,,,,190,200,-205,,200,,,,,,200,B,Raw,M,O,100,,
4,Daniel Duduš,1997,97.8,Czechia,,,,,,200,-207.5,-207.5,,200,,,,,,200,B,Raw,M,O,100,,
5,Zdeněk Marvan,1997,95.95,Czechia,,,,,,180,192.5,-200,,192.5,,,,,,192.5,B,Raw,M,O,100,,
6,Mateusz Młynarczyk,1988,99.75,Poland,,,,,,185,-190,-192.5,,185,,,,,,185,B,Raw,M,O,100,,
7,Robert Kolena,1995,95.8,Czechia,,,,,,135,145,150,,150,,,,,,150,B,Raw,M,O,100,,
DQ,Tomáš Obert,1993,98.1,Czechia,,,,,,,,,,,,,,,,,B,Raw,M,O,100,,
1,Ádám Moszkál,1996,107.8,Hungary,,,,,,250,262.5,267.5,270,267.5,,,,,,267.5,B,Raw,M,O,110,,
2,Alexandr Popa,1988,108.3,Czechia,,,,,,242.5,-252.5,-252.5,,242.5,,,,,,242.5,B,Raw,M,O,110,,
3,Krystian Rudnicki,1984,104.1,Poland,,,,,,210,-220,-220,,210,,,,,,210,B,Raw,M,O,110,,
4,Lukáš Forejtek,1993,108.1,Czechia,,,,,,200,210,-215,,210,,,,,,210,B,Raw,M,O,110,,
5,Mariusz Małkowski,1987,103.1,Poland,,,,,,160,-170,-170,,160,,,,,,160,B,Raw,M,O,110,,
DQ,Daniel Tesař,1991,106.6,Czechia,,,,,,,,,,,,,,,,,B,Raw,M,O,110,,
1,Yaroslav Vdovichenko,1984,121,,,,,,,255,260,-270,,260,,,,,,260,B,Raw,M,O,125,,
2,Martin Tuček,1992,123.9,,,,,,,250,255,-260,,255,,,,,,255,B,Raw,M,O,125,,
3,Branislav Háber,1995,123.4,,,,,,,230,235,-240,,235,,,,,,235,B,Raw,M,O,125,,
4,Arkadiusz Redzynia,1993,113.5,,,,,,,215,220,225,,225,,,,,,225,B,Raw,M,O,125,,
5,Sebastian Pawlik,1992,114.7,,,,,,,220,225,-230,,225,,,,,,225,B,Raw,M,O,125,,
6,Patrik Loza,1985,119.1,,,,,,,220,-225,-225,,220,,,,,,220,B,Raw,M,O,125,,
7,Tomasz Pakulak,1991,110.2,,,,,,,200,210,-220,,210,,,,,,210,B,Raw,M,O,125,,
1,Miroslav Semín,1986,125.1,Czechia,,,,,,230,240,250,,250,,,,,,250,B,Raw,M,O,140,,
2,Tomáš Nesvadba,1993,139,Czechia,,,,,,230,242.5,-250,,242.5,,,,,,242.5,B,Raw,M,O,140,,
3,Krzysztof Cieślak,1984,136,Poland,,,,,,200,210,220,,220,,,,,,220,B,Raw,M,O,140,,
1,Martin Kuchař,1990,146.3,Czechia,,,,,,170,175,-180,,175,,,,,,175,B,Raw,M,O,140+,,
1,Sebastian Niedziela,1979,81.75,Poland,,,,,,175,180,-182.5,,180,,,,,,180,B,Raw,M,M1,82.5,,
1,Aleksandrs Ņikitins,1980,88.6,Latvia,,,,,,165,172.5,177.5,,177.5,,,,,,177.5,B,Raw,M,M1,90,,
2,Marcin Szrajber,1981,82.7,Poland,,,,,,160,167.5,175,,175,,,,,,175,B,Raw,M,M1,90,,
3,Přemysl Rychtera,1980,87.05,Czechia,,,,,,157.5,162.5,-167.5,,162.5,,,,,,162.5,B,Raw,M,M1,90,,
1,Andrzej Juraszek,1977,95.25,Poland,,,,,,157.5,162.5,-165,,162.5,,,,,,162.5,B,Raw,M,M1,100,,
2,Jan Maněna,1979,92.2,Czechia,,,,,,-145,145,-160,,145,,,,,,145,B,Raw,M,M1,100,,
1,Krzysztof Zakrzewski,1977,105.3,Poland,,,,,,195,202.5,-212.5,,202.5,,,,,,202.5,B,Raw,M,M1,110,,
2,Andrey Glukhov,1978,107.3,Israel,,,,,,195,-200,200,,200,,,,,,200,B,Raw,M,M1,110,,
3,Marcel Baláž,1977,103.4,Slovakia,,,,,,177.5,185,190,,190,,,,,,190,B,Raw,M,M1,110,,
4,Austin Hickey,1980,105.3,Ireland,,,,,,175,-185,185,,185,,,,,,185,B,Raw,M,M1,110,,
5,Edik Krugliak,1977,106.4,Israel,,,,,,160,167.5,-175,,167.5,,,,,,167.5,B,Raw,M,M1,110,,
6,Pavel Rychtera,1982,103.8,Czechia,,,,,,-160,165,-170,,165,,,,,,165,B,Raw,M,M1,110,,
1,Jaroslav Hlaváček,1977,119.3,Czechia,,,,,,150,160,-170,,160,,,,,,160,B,Raw,M,M1,125,,
2,Maris Kipurs,1978,111.4,Latvia,,,,,,-150,157.5,-170,,157.5,,,,,,157.5,B,Raw,M,M1,125,,
1,Daniel Prus,1977,139.1,Poland,,,,,,125,130,-132.5,,130,,,,,,130,B,Raw,M,M1,140,,
2,Ondřej Šťastný,1978,129.7,Czechia,,,,,,125,127.5,-130,,127.5,,,,,,127.5,B,Raw,M,M1,140,,
1,Milan Mrázek,1979,143,Czechia,,,,,,220,-235,-235,,220,,,,,,220,B,Raw,M,M1,140+,,
1,Sen. Jan Gorol,1975,74.1,Czechia,,,,,,-120,130,135,,135,,,,,,135,B,Raw,M,M2,75,,
DQ,Pāvels Grigorjevs,1974,80.4,,,,,,,,,,,,,,,,,,B,Raw,M,M2,82.5,,
DQ,Roch Szumarowski-Plewa,1973,77.45,,,,,,,,,,,,,,,,,,B,Raw,M,M2,82.5,,
1,Sławomír Purta,1973,88.1,Poland,,,,,,155,160,165,,165,,,,,,165,B,Raw,M,M2,90,,
2,Juliusz Zbierski,1974,89.4,Poland,,,,,,150,155,-162.5,,155,,,,,,155,B,Raw,M,M2,90,,
1,Michał Kopiec,1974,93.05,Poland,,,,,,172.5,180,185,,185,,,,,,185,B,Raw,M,M2,100,,
2,Daniel Kaufmann,1976,95.15,Germany,,,,,,160,165,170,,170,,,,,,170,B,Raw,M,M2,100,,
3,Ladislav Rakas,1976,95.35,Czechia,,,,,,162.5,167.5,-170,,167.5,,,,,,167.5,B,Raw,M,M2,100,,
1,Mirosław Zakrzewski,1974,123.7,Poland,,,,,,200,205,210,,210,,,,,,210,B,Raw,M,M2,125,,
2,Tomáš Chludil,1973,118.1,Czechia,,,,,,190,200,-207.5,,200,,,,,,200,B,Raw,M,M2,125,,
1,Krzysztof Halczyk,1974,127.5,Poland,,,,,,170,175,-177.5,,175,,,,,,175,B,Raw,M,M2,140,,
1,Josef Mazač,1976,143.1,Czechia,,,,,,230,242.5,-245,,242.5,,,,,,242.5,B,Raw,M,M2,140+,,
2,Ireneusz Aletorowicz,1974,141.1,Poland,,,,,,190,-200,-200,,190,,,,,,190,B,Raw,M,M2,140+,,
1,Vladan Zapletal,1971,88.4,Czechia,,,,,,160,165,170,,170,,,,,,170,B,Raw,M,M3,90,,
1,Hovhannes Yazichyan,1971,96.6,Armenia,,,,,,165,170,175,,175,,,,,,175,B,Raw,M,M3,100,,
2,Ireneusz Fuja,1970,95.15,Poland,,,,,,140,150,155,,155,,,,,,155,B,Raw,M,M3,100,,
1,Wojciech Kaliciak,1971,101.9,Poland,,,,,,140,150,-155,,150,,,,,,150,B,Raw,M,M3,110,,
1,László Baross,1970,116.4,Hungary,,,,,,150,157.5,-162.5,,157.5,,,,,,157.5,B,Raw,M,M3,125,,
1,Grzegorz Kantor,1972,146,Poland,,,,,,175,-180,180,,180,,,,,,180,B,Raw,M,M3,140+,,
1,Piotr Jurkiewicz,1966,71.75,Poland,,,,,,100,105,-110,,105,,,,,,105,B,Raw,M,M4,75,,
1,Milan Suk,1963,79,Czechia,,,,,,170,180,-184,-184,180,,,,,,180,B,Raw,M,M4,82.5,,
1,Ladislav Jantek,1965,87.5,Slovakia,,,,,,160,-165,-165,,160,,,,,,160,B,Raw,M,M4,90,,
1,Roman Růžička,1965,97.2,Czechia,,,,,,120,127.5,130,,130,,,,,,130,B,Raw,M,M4,100,,
1,František Nováček,1964,107.9,Czechia,,,,,,180,185,190,191,190,,,,,,190,B,Raw,M,M4,110,,
1,Peter Rathke,1959,91.25,Germany,,,,,,140,-145,145,,145,,,,,,145,B,Raw,M,M5,100,,
2,Roman Raczykowski,1961,98.4,Poland,,,,,,130,135,-140,,135,,,,,,135,B,Raw,M,M5,100,,
1,Krzysztof Kłopocki,1959,104.3,Poland,,,,,,170,177.5,185,-190,185,,,,,,185,B,Raw,M,M5,110,,
1,Antoni Kaliňski,1953,64.25,Poland,,,,,,95,100,102.5,,102.5,,,,,,102.5,B,Raw,M,M6,67.5,,
1,Karel Schoř,1955,80.75,Czechia,,,,,,130,140,145,-148,145,,,,,,145,B,Raw,M,M6,82.5,,
2,Mirosław Fugiel,1955,82.15,Poland,,,,,,130,140,-142.5,,140,,,,,,140,B,Raw,M,M6,82.5,,
3,Mieczysłąw Maczka,1954,81.35,Germany,,,,,,90,,,,90,,,,,,90,B,Raw,M,M6,82.5,,
1,Ryszard Wilczak,1955,100,Poland,,,,,,140,142.5,145,,145,,,,,,145,B,Raw,M,M6,100,,
2,Miroslav Kolek,1954,91.9,Czechia,,,,,,110,120,130,,130,,,,,,130,B,Raw,M,M6,100,,
1,Július Vrbiniak,1956,107.5,Slovakia,,,,,,150,155,-160,,155,,,,,,155,B,Raw,M,M6,110,,
2,Erich Koch,1955,107.8,Czechia,,,,,,135,140,145,,145,,,,,,145,B,Raw,M,M6,110,,
1,Boris Laišin,1950,74,Israel,,,,,,105,110,-112.5,,110,,,,,,110,B,Raw,M,M7,75,,
1,Stefan Sochaňski,1948,87.65,Poland,,,,,,67.5,72.5,77.5,,77.5,,,,,,77.5,B,Raw,M,M7,90,,
1,Jozef Meravý,1950,97.8,Slovakia,,,,,,70,-85,85,,85,,,,,,85,B,Raw,M,M7,100,,
1,Hynek Stružka,1951,109.3,Czechia,,,,,,110,120,-130,,120,,,,,,120,B,Raw,M,M7,110,,
1,Natalie Hurdley,1988,78.9,UK,,,,,,-60,60,65,,65,,,,,,65,B,Multi-ply,F,O,82.5,,
1,Monika Aus,1971,52.25,Estonia,,,,,,67.5,,,,67.5,,,,,,67.5,B,Multi-ply,F,M3,56,,
1,Lesley Jayne Thomas,1966,62.35,UK,,,,,,75,80,-85,,80,,,,,,80,B,Multi-ply,F,M4,67.5,,
1,Brigitte Maczka,1961,71.8,Germany,,,,,,35,40,42.5,,42.5,,,,,,42.5,B,Multi-ply,F,M5,75,,
DQ,Andrii Hryb,2003,98.8,Ukraine,,,,,,-210,-210,-210,,,,,,,,,B,Multi-ply,M,T3,100,,
1,Krzysztof Wolszczak,1985,73.45,Poland,,,,,,160,180,-190,,180,,,,,,180,B,Multi-ply,M,O,75,,
1,Lukas Kovacik,1988,81.15,Czechia,,,,,,165,175,182.5,,182.5,,,,,,182.5,B,Multi-ply,M,O,82.5,,
1,Edgars Peterlēvics,1986,87.5,Latvia,,,,,,260,270,-281,,270,,,,,,270,B,Multi-ply,M,O,90,,
2,Dawid Deptuch,1986,88.85,Poland,,,,,,-220,220,-230,,220,,,,,,220,B,Multi-ply,M,O,90,,
1,Petr Bolf,1987,122.3,Czechia,,,,,,-385,385,-400,,385,,,,,,385,B,Unlimited,M,O,125,,
1,Václav Mařík,1979,96.6,Czechia,,,,,,240,250,-255,,250,,,,,,250,B,Multi-ply,M,M1,100,,
1,Henning Tiedje,1979,112.7,Germany,,,,,,285,-305,305,,305,,,,,,305,B,Unlimited,M,M1,125,,
1,Daniel Prus,1977,139.3,Poland,,,,,,130,140,150,,150,,,,,,150,B,Multi-ply,M,M1,140,,
1,Oskars Zvarts,1978,146.7,Latvia,,,,,,260,-270,-280,,260,,,,,,260,B,Multi-ply,M,M1,140+,,
2,David Zdražil,1978,157.1,Czechia,,,,,,-210,210,-240,,210,,,,,,210,B,Multi-ply,M,M1,140+,,
1,Roch Szumarowski-Plewa,1973,76.35,Poland,,,,,,130,140,-145,,140,,,,,,140,B,Multi-ply,M,M2,82.5,,
1,Zoltán Győri,1975,97.1,Hungary,,,,,,-185,185,195,,195,,,,,,195,B,Multi-ply,M,M2,100,,
2,Daniel Kaufmann,1976,93.35,Germany,,,,,,-185,185,192.5,,192.5,,,,,,192.5,B,Multi-ply,M,M2,100,,
1,Saša Mašanović,1967,131.1,,,,,,,225,-235,-237.5,,225,,,,,,225,B,Multi-ply,M,M3,140,,
DQ,Peter Rathke,1959,90,Germany,,,,,,-160,-170,-170,,,,,,,,,B,Multi-ply,M,M5,90,,
1,Mieczysłąw Maczka,1954,81.25,Germany,,,,,,90,97.5,,,97.5,,,,,,97.5,B,Multi-ply,M,M6,82.5,,
1,Franciszek Szabluk,1956,94.1,Poland,,,,,,-180,180,-190,,180,,,,,,180,B,Multi-ply,M,M6,100,,
1,Stefan Sochaňski,1948,88.25,Poland,,,,,,85,90,,,90,,,,,,90,B,Multi-ply,M,M7,90,,
1,David Rex Thomas,1951,112.3,UK,,,,,,110,-117.5,,,110,,,,,,110,B,Unlimited,M,M7,125,,
