<svg xmlns="http://www.w3.org/2000/svg" xmlns:xlink="http://www.w3.org/1999/xlink" width="215.761" height="70"
     viewBox="0 0 215.761 70">
    <defs>
        <style>.a{fill:url(#a);}.b{fill:url(#b);}.c{fill:url(#c);}.d{fill:url(#d);}.e{fill:#009ee2;}.f{fill:#fab900;}
        </style>
        <linearGradient id="a" x1="0.727" y1="0.9" x2="0.306" y2="0.042" gradientUnits="objectBoundingBox">
            <stop offset="0" stop-color="#e53212"/>
            <stop offset="0.288" stop-color="#ec620c"/>
            <stop offset="0.611" stop-color="#f49105"/>
            <stop offset="0.859" stop-color="#f8ae01"/>
            <stop offset="1" stop-color="#fab900"/>
        </linearGradient>
        <linearGradient id="b" x1="0.319" x2="0.806" y2="0.869" gradientUnits="objectBoundingBox">
            <stop offset="0" stop-color="#e53212"/>
            <stop offset="1" stop-color="#fab900"/>
        </linearGradient>
        <linearGradient id="c" x1="0.237" y1="0.132" x2="0.5" y2="0.724" gradientUnits="objectBoundingBox">
            <stop offset="0" stop-color="#312782"/>
            <stop offset="1" stop-color="#009ee2"/>
        </linearGradient>
        <linearGradient id="d" x1="0.68" y1="0.906" x2="0.23" gradientUnits="objectBoundingBox">
            <stop offset="0" stop-color="#312782"/>
            <stop offset="0.188" stop-color="#23499e"/>
            <stop offset="0.426" stop-color="#146ebb"/>
            <stop offset="0.648" stop-color="#0988d0"/>
            <stop offset="0.846" stop-color="#0298dd"/>
            <stop offset="1" stop-color="#009ee2"/>
        </linearGradient>
    </defs>
    <g transform="translate(0 0)">
        <g transform="translate(39.824)">
            <g transform="translate(2.924 0)">
                <path class="a"
                      d="M670.483,49.411A18.13,18.13,0,0,0,656.1,56.5a21.2,21.2,0,0,1,0,22.323,18.2,18.2,0,0,0,14.383,7.093H675.4l4.524-10.446h-9.437a7.815,7.815,0,0,1,0-15.63h11.726L686.733,49.4l-16.25.011Z"
                      transform="translate(-590.221 -49.4)"/>
                <path class="b" d="M977.78,62.7l10.148,23.4h11.36L983.448,49.6ZM972.1,49.6Z"
                      transform="translate(-871.097 -49.578)"/>
                <path class="c"
                      d="M359.637,49.5l-4.524,10.446h9.437a7.815,7.815,0,0,1,0,15.63H352.824L348.3,86.021h16.25a18.261,18.261,0,0,0,0-36.521Z"
                      transform="translate(-316.633 -49.489)"/>
                <path class="d" d="M90.576,86ZM84.9,72.9,74.76,49.5H63.4L79.217,86Z"
                      transform="translate(-63.4 -49.489)"/>
                <path class="e" d="M205.7,86.01,221.528,49.5h11.349L217.06,86.01Z"
                      transform="translate(-189.883 -49.489)"/>
                <path class="f" d="M856.976,49.5,841.148,86.01H829.8L845.617,49.5Z"
                      transform="translate(-744.614 -49.489)"/>
            </g>
            <path class="e"
                  d="M378.135,408.034a.593.593,0,1,0,.6-.594.594.594,0,0,0-.6.594m-96.773,0a.592.592,0,1,0,.6-.594.594.594,0,0,0-.6.594m-4.474-1.4h1.192v-6.8h-1.192v2.742h-2.506v-2.742H273.19v6.79h1.192v-2.992h2.506Zm5.606-7.152h.9l-.98-1.148H281.5l-.971,1.148h.89l.525-.614h.02Zm1.06,3.727c0,1.4-.548,2.55-1.6,2.55s-1.616-1.087-1.616-2.5.548-2.539,1.616-2.539,1.6,1.228,1.6,2.488m1.254-.04c0-1.914-.991-3.425-2.809-3.425-1.758,0-2.908,1.462-2.908,3.526,0,2.011,1.049,3.473,2.807,3.473,1.676,0,2.91-1.208,2.91-3.566m1.02,3.473h1.192v-6.81h-1.192Zm6.485-5.763h1.738v-1.027h-4.657v1.027h1.727v5.763h1.192Zm5.576.938a1.137,1.137,0,0,1-1.279,1.139H296v-2.193a2.722,2.722,0,0,1,.656-.06c.779,0,1.223.382,1.223,1.108m.009,1.612v-.02a1.8,1.8,0,0,0,1.183-1.713,1.718,1.718,0,0,0-.565-1.36,2.915,2.915,0,0,0-1.981-.534,10.081,10.081,0,0,0-1.707.141v6.7H296V403.83h.515c.656.011.96.3,1.141,1.179a9.431,9.431,0,0,0,.424,1.621H299.3a14.1,14.1,0,0,1-.5-1.862,1.672,1.672,0,0,0-.914-1.351m7.092.433v-4.012H303.8v4.122c0,1.259-.473,1.793-1.243,1.793-.716,0-1.212-.534-1.212-1.793v-4.122h-1.19v4.021c0,1.994.9,2.86,2.376,2.86,1.5,0,2.464-.9,2.464-2.881m3.869-.051,2.04-3.959h-1.312l-.716,1.7c-.2.5-.384.947-.536,1.4h-.02c-.163-.473-.334-.9-.536-1.391l-.731-1.713h-1.342l1.959,4v2.789h1.192Zm6.253-3.959H311.5v6.79h3.749v-1h-2.559V403.6h2.283v-.976H312.7v-1.784h2.414Zm-1.382-1.5h-.848l-.859,1.148h.808l.466-.634h.018l.466.634h.837Zm.98.453h.647l-.676-1.1h-1.1Zm5.3,7.846h1.2v-6.79h-1.1v2.237c0,1.1.04,2.01.111,2.912h-.02a21.475,21.475,0,0,0-1.051-2.237l-1.588-2.912H316.29v6.79h1.1v-2.266c0-1.208-.02-2.126-.069-2.972h.029a20.592,20.592,0,0,0,1.082,2.287Zm6.487-5.763h1.736v-1.027h-4.668v1.027h1.727v5.763h1.194Zm6.214,5.763h1.194v-6.79h-1.194v2.742h-2.5v-2.742h-1.192v6.79h1.192v-2.992h2.5Zm5.608-7.161h.9l-1-1.15h-.914l-.971,1.15h.89l.525-.616h.02Zm1.06,3.736c0,1.4-.548,2.55-1.6,2.55s-1.616-1.088-1.616-2.5.548-2.539,1.616-2.539,1.6,1.228,1.6,2.488m1.254-.04c0-1.914-.991-3.425-2.809-3.425-1.756,0-2.908,1.462-2.908,3.526,0,2.011,1.049,3.473,2.807,3.473,1.676,0,2.91-1.208,2.91-3.566m4.738,3.473h1.2v-6.8h-1.1v2.237c0,1.1.04,2.01.11,2.912h-.02a21.092,21.092,0,0,0-1.049-2.237l-1.577-2.912h-1.292v6.79h1.1v-2.266c0-1.208-.02-2.126-.071-2.972h.031a20.574,20.574,0,0,0,1.08,2.287Zm5.525.071a6.2,6.2,0,0,0,1.93-.333v-3.473H350.61v.947h1.06v1.762a2,2,0,0,1-.768.111c-1.2,0-2.08-.826-2.08-2.467a2.171,2.171,0,0,1,2.243-2.478,3.051,3.051,0,0,1,1.312.252l.252-.978a4,4,0,0,0-1.576-.281,3.291,3.291,0,0,0-3.486,3.526,3.493,3.493,0,0,0,.93,2.568,3.313,3.313,0,0,0,2.376.837m6.061-5.149c0-.4.323-.815,1.062-.815a2.594,2.594,0,0,1,1.2.292l.263-.978a3.25,3.25,0,0,0-1.446-.3,2.022,2.022,0,0,0-2.283,1.934c0,.9.667,1.521,1.678,1.945.768.333,1.111.634,1.111,1.159,0,.563-.424.936-1.172.936a3.221,3.221,0,0,1-1.475-.382l-.243,1a3.533,3.533,0,0,0,1.658.384c1.6,0,2.435-.9,2.435-2.025,0-.9-.506-1.512-1.586-1.994-.848-.384-1.2-.625-1.2-1.15m7.728-2.074-.888-1.148h-.841l-.859,1.148h.808l.464-.634h.02l.466.634Zm.143-.846,1.232-1.108h-1.1l-.758,1.108Zm.069,4.569c0,1.4-.548,2.55-1.6,2.55s-1.616-1.087-1.616-2.5.548-2.539,1.616-2.539c1.1,0,1.6,1.228,1.6,2.488m1.254-.04c0-1.914-.991-3.425-2.809-3.425-1.758,0-2.908,1.462-2.908,3.526,0,2.011,1.049,3.473,2.807,3.473,1.678,0,2.91-1.208,2.91-3.566m5.383,3.473,2.122-6.79h-1.279l-.854,3.06c-.223.815-.446,1.645-.6,2.467h-.02c-.161-.826-.366-1.645-.6-2.478l-.81-3.067h-1.3l2,6.79Zm2.829,0h1.192v-6.808h-1.192Zm4.918-7.152h.9l-.98-1.148h-.914l-.969,1.148h.888l.526-.614h.02Zm-2.363,7.152h3.749v-1h-2.559V403.6h2.283v-.976H378.1v-1.784h2.414v-1H376.9Zm7.183-5.763h1.736v-1.027h-4.641v1.027H382.9v5.763H384.1Zm8.172,5.763h1.2v-6.808h-1.1v2.237c0,1.1.04,2.01.11,2.912h-.018a21.486,21.486,0,0,0-1.038-2.237l-1.576-2.912h-1.294v6.79h1.1v-2.266c0-1.208-.02-2.126-.071-2.972h.031a20.57,20.57,0,0,0,1.082,2.277Zm5.556-2.8h-1.565l.453-1.645c.112-.413.212-.938.3-1.36h.031c.09.422.183.936.313,1.36Zm.718,2.78h1.241l-1.968-6.79h-1.49l-1.974,6.79h1.212l.515-1.873h1.919Zm8.667,0-.395-6.79h-1.479l-.859,2.731c-.241.826-.453,1.612-.616,2.367h-.02c-.161-.766-.366-1.541-.6-2.367l-.817-2.731h-1.486l-.455,6.79h1.1l.143-2.689c.049-.886.09-1.915.121-2.771h.02c.163.826.384,1.722.627,2.539l.828,2.84h.888l.914-2.891c.254-.8.5-1.682.7-2.488h.029c-.011.875.04,1.894.08,2.729l.132,2.731Z"
                  transform="translate(-273.19 -357.976)"/>
        </g>
        <g transform="translate(0 50.652)">
            <path class="e" d="M18.57,495.58h9.059v2.21H18.57Zm3.365,1h2.329V507.76H21.935Z"
                  transform="translate(-18.57 -488.619)"/>
            <path class="e"
                  d="M78.48,495.526h2.329v12.189H78.48Zm.925,5.076h4.3a1.142,1.142,0,0,0,.63-.174,1.157,1.157,0,0,0,.421-.5,1.9,1.9,0,0,0,.157-.755,1.8,1.8,0,0,0-.15-.753,1.134,1.134,0,0,0-.419-.5,1.146,1.146,0,0,0-.638-.174h-4.3v-2.215h4.488a3.478,3.478,0,0,1,1.793.452,3.078,3.078,0,0,1,1.2,1.276,4.532,4.532,0,0,1,0,3.826,3.067,3.067,0,0,1-1.2,1.276,3.478,3.478,0,0,1-1.788.454H79.405Zm2.609,1.835,2.49-.386,3.33,5.664H85Z"
                  transform="translate(-68.062 -488.573)"/>
            <path class="e"
                  d="M142.859,507.353a3.561,3.561,0,0,1-1.539-1.549,5.273,5.273,0,0,1-.522-2.45V495.58h2.329v7.826a2.219,2.219,0,0,0,.57,1.624,2.137,2.137,0,0,0,1.605.577,2,2,0,0,0,2.193-2.2V495.58h2.329v7.773a5.229,5.229,0,0,1-.532,2.45,3.577,3.577,0,0,1-1.546,1.549,5.875,5.875,0,0,1-4.887,0Z"
                  transform="translate(-119.541 -488.619)"/>
            <path class="e"
                  d="M206.36,495.58h2.847l4.6,9.332-.2.217V495.58h2.226v12.173h-2.864l-4.579-9.192.2-.217v9.408h-2.226Z"
                  transform="translate(-173.703 -488.619)"/>
            <path class="e"
                  d="M284.045,500.332v2.379a4.98,4.98,0,0,1-.556,2.393,3.925,3.925,0,0,1-1.577,1.6,4.8,4.8,0,0,1-2.362.565,5.134,5.134,0,0,1-2.384-.532,3.826,3.826,0,0,1-1.6-1.5,4.391,4.391,0,0,1-.565-2.261v-3.588a4.935,4.935,0,0,1,.556-2.388,3.913,3.913,0,0,1,1.576-1.6,4.808,4.808,0,0,1,2.363-.565,4.646,4.646,0,0,1,2.038.449,4.216,4.216,0,0,1,1.565,1.269,4.6,4.6,0,0,1,.845,1.9h-2.527a1.629,1.629,0,0,0-.421-.666,1.972,1.972,0,0,0-.7-.426,2.3,2.3,0,0,0-.819-.148,2.186,2.186,0,0,0-1.092.268,1.831,1.831,0,0,0-.73.763,2.4,2.4,0,0,0-.261,1.139v3.593a1.913,1.913,0,0,0,.264,1.007,1.739,1.739,0,0,0,.748.67,2.546,2.546,0,0,0,1.122.235,2.276,2.276,0,0,0,1.1-.256,1.739,1.739,0,0,0,.727-.741,2.46,2.46,0,0,0,.254-1.148v-.2h-1.862v-2.21Z"
                  transform="translate(-230.409 -488.002)"/>
            <path class="e" d="M358.23,495.58h9.059v2.21H358.23Zm3.365,1h2.334V507.76H361.6Z"
                  transform="translate(-299.162 -488.619)"/>
            <path class="e"
                  d="M411.625,475.2h1.48l4.723,12.173h-2.506l-2.956-8.319-2.956,8.319H406.9Zm-2.447,8.015h6.5v2.212h-6.5Zm6.179-10.01-1.351,1.172-1.657-1.256-1.657,1.256-1.351-1.172,3.009-2.3Z"
                  transform="translate(-339.368 -468.239)"/>
            <path class="e"
                  d="M486.315,495.58h3.068v12.173h-2.115V498.3l.083.536L484.99,506.4h-2.057l-2.362-7.4.085-.7v9.459H478.54V495.6h3.068l2.355,8.208Z"
                  transform="translate(-398.55 -488.619)"/>
            <path class="e"
                  d="M583.41,495.571h2.329v12.173H583.41Zm1.019,9.968h3.942a1.822,1.822,0,0,0,1.236-.381,1.341,1.341,0,0,0,.438-1.068v-.026a1.507,1.507,0,0,0-.195-.788,1.25,1.25,0,0,0-.574-.5,2.177,2.177,0,0,0-.906-.174h-3.942V500.4h3.942a1.6,1.6,0,0,0,1.118-.36,1.3,1.3,0,0,0,.395-1.014,1.12,1.12,0,0,0-.395-.913,1.715,1.715,0,0,0-1.118-.327h-3.942v-2.21h4.019a4.869,4.869,0,0,1,2.049.39,2.83,2.83,0,0,1,1.292,1.13,3.417,3.417,0,0,1,.442,1.779,2.7,2.7,0,0,1-.285,1.261,2.348,2.348,0,0,1-.828.9,3.4,3.4,0,0,1-1.31.478,3.325,3.325,0,0,1,1.391.49,2.473,2.473,0,0,1,.883.991,3.16,3.16,0,0,1,.3,1.417v.024a3.429,3.429,0,0,1-.447,1.793,2.849,2.849,0,0,1-1.3,1.136,4.935,4.935,0,0,1-2.054.39h-4.156Z"
                  transform="translate(-485.183 -488.61)"/>
            <path class="e"
                  d="M644.425,477.831H645.9L650.628,490H648.12l-2.956-8.32L642.208,490H639.7Zm-2.456,8.015h6.5v2.212h-6.5Zm4.826-11.42a1.127,1.127,0,0,1,.544,1.026,1.233,1.233,0,0,1-.5,1.076,2.563,2.563,0,0,1-1.5.357l-.741-.636a1.217,1.217,0,0,0,.541-.083.289.289,0,0,0,.174-.268.278.278,0,0,0-.162-.256,1.058,1.058,0,0,0-.492-.089,5.359,5.359,0,0,0-.892.077l-.1-1.416a7.854,7.854,0,0,1,1.487-.118A3.215,3.215,0,0,1,646.8,474.426Zm-2.582,1.823h1.913v.746h-1.913Z"
                  transform="translate(-531.684 -470.869)"/>
            <path class="e"
                  d="M711.34,495.58h2.847l4.6,9.332-.2.217V495.58h2.226v12.173h-2.869l-4.574-9.192.2-.217v9.408h-2.226Z"
                  transform="translate(-590.866 -488.619)"/>
            <path class="e"
                  d="M808.959,506.726a3.909,3.909,0,0,1-1.586-1.576,4.806,4.806,0,0,1-.56-2.358V499.34a4.8,4.8,0,0,1,.553-2.358,3.894,3.894,0,0,1,1.586-1.574,5.3,5.3,0,0,1,4.734,0,3.9,3.9,0,0,1,1.584,1.574,4.8,4.8,0,0,1,.56,2.358v3.452a4.8,4.8,0,0,1-.56,2.358,3.915,3.915,0,0,1-1.584,1.576,5.311,5.311,0,0,1-4.734,0Zm3.478-2a1.829,1.829,0,0,0,.736-.75,2.35,2.35,0,0,0,.259-1.122v-3.568a2.36,2.36,0,0,0-.259-1.123,1.829,1.829,0,0,0-.736-.75,2.435,2.435,0,0,0-2.21,0,1.814,1.814,0,0,0-.734.75,2.339,2.339,0,0,0-.259,1.123v3.568a2.332,2.332,0,0,0,.259,1.122,1.814,1.814,0,0,0,.734.75,2.435,2.435,0,0,0,2.21,0Zm-1.469-.943,1.24-1.549,4.775,3.568-1.24,1.565Z"
                  transform="translate(-669.734 -488.016)"/>
            <path class="e"
                  d="M875.2,507.353a3.561,3.561,0,0,1-1.539-1.549,5.273,5.273,0,0,1-.522-2.45V495.58h2.329v7.826a2.223,2.223,0,0,0,.569,1.624,2.152,2.152,0,0,0,1.607.577,2.184,2.184,0,0,0,1.619-.577,2.207,2.207,0,0,0,.574-1.624V495.58h2.32v7.773a5.228,5.228,0,0,1-.532,2.45,3.577,3.577,0,0,1-1.546,1.549,5.864,5.864,0,0,1-4.881,0Z"
                  transform="translate(-724.525 -488.619)"/>
            <path class="e" d="M935.337,503.06v4.7h-2.328v-4.7l-3.638-7.478H931.8l2.37,5.241,2.363-5.243h2.435Z"
                  transform="translate(-770.979 -488.619)"/>
            <path class="e"
                  d="M990.46,462.511h2.329v12.173H990.46Zm.84,0h7.436v2.21H991.3Zm0,5.026h6.5v2.21h-6.5Zm0,4.942h7.436v2.212H991.3Zm6.434-11.963-1.349,1.172-1.657-1.256-1.657,1.256-1.351-1.172,3.008-2.3Zm-3.339-3.4,1.546-1.565,2.435,2.052-1.469,1.407Z"
                  transform="translate(-821.446 -455.55)"/>
            <path class="e"
                  d="M1050.27,495.58h2.847l4.6,9.332-.2.217V495.58h2.226v12.173h-2.862l-4.581-9.191.2-.217v9.408h-2.226Z"
                  transform="translate(-870.855 -488.619)"/>
            <path class="e"
                  d="M1146.585,507.38l-.847-.174a7.545,7.545,0,0,1-1.588-.522,6.087,6.087,0,0,1-1.33-.816l1.078-1.894a5.236,5.236,0,0,0,1.649.892,5.974,5.974,0,0,0,1.913.315,3.424,3.424,0,0,0,1.767-.381,1.2,1.2,0,0,0,.63-1.076v-.009a1.053,1.053,0,0,0-.28-.77,1.659,1.659,0,0,0-.732-.419,8.812,8.812,0,0,0-1.155-.243.176.176,0,0,0-.047,0,.124.124,0,0,1-.047,0l-.186-.024a11.617,11.617,0,0,1-2.057-.482,3.032,3.032,0,0,1-1.391-1.014,3.263,3.263,0,0,1-.569-2.056h0a3.673,3.673,0,0,1,.536-2.019,3.37,3.37,0,0,1,1.555-1.278,6.224,6.224,0,0,1,2.464-.44,6.361,6.361,0,0,1,1.356.151,7.493,7.493,0,0,1,1.355.435,7.725,7.725,0,0,1,1.257.687l-.986,1.944a6.293,6.293,0,0,0-1.469-.779,4.607,4.607,0,0,0-1.492-.268,3.274,3.274,0,0,0-1.657.348,1.087,1.087,0,0,0-.586.976h0a1.129,1.129,0,0,0,.306.835,1.815,1.815,0,0,0,.756.447,11.945,11.945,0,0,0,1.266.3l.068.012.068.012a.729.729,0,0,1,.1.021.845.845,0,0,0,.1.021,10.434,10.434,0,0,1,1.958.55,3.031,3.031,0,0,1,1.313,1.043,3.267,3.267,0,0,1,.522,1.956v.017a3.509,3.509,0,0,1-.553,1.993,3.433,3.433,0,0,1-1.61,1.264,6.668,6.668,0,0,1-2.544.437Z"
                  transform="translate(-947.31 -488.113)"/>
            <path class="e"
                  d="M1207.559,474.285a3.915,3.915,0,0,1-1.584-1.576,4.8,4.8,0,0,1-.56-2.358V466.9a4.805,4.805,0,0,1,.56-2.358,3.9,3.9,0,0,1,1.584-1.574,5.3,5.3,0,0,1,4.734,0,3.893,3.893,0,0,1,1.586,1.574,4.805,4.805,0,0,1,.56,2.358v3.452a4.805,4.805,0,0,1-.56,2.358,3.91,3.91,0,0,1-1.586,1.576A5.311,5.311,0,0,1,1207.559,474.285Zm5.349-13.738-1.349,1.172-1.657-1.256-1.657,1.256-1.351-1.172,3.009-2.3Zm-1.876,11.74a1.814,1.814,0,0,0,.734-.75,2.332,2.332,0,0,0,.259-1.122v-3.574a2.339,2.339,0,0,0-.259-1.123,1.814,1.814,0,0,0-.734-.75,2.435,2.435,0,0,0-2.21,0,1.83,1.83,0,0,0-.736.75,2.36,2.36,0,0,0-.259,1.123v3.568a2.351,2.351,0,0,0,.259,1.122,1.83,1.83,0,0,0,.736.75,2.435,2.435,0,0,0,2.21,0Zm-.146-14.655,2.346-2.052,1.548,1.565-2.508,1.894Z"
                  transform="translate(-999.018 -455.575)"/>
        </g>
    </g>
</svg>