<svg xmlns="http://www.w3.org/2000/svg" width="25.039" height="30.93" viewBox="0 0 25.039 30.93">
  <g id="icons8_prize_2" transform="translate(-7 -3.001)">
    <path id="Path_3587" data-name="Path 3587" d="M28.729,27H14V40.256l7.365-2.209,7.365,2.209Z" transform="translate(-1.845 -6.325)" fill="#ff3d00"/>
    <path id="Path_3588" data-name="Path 3588" d="M28.729,31.332l-.366.008A3.893,3.893,0,0,0,25.1,33.226l-.207.342a.962.962,0,0,1-1.289.347l-.352-.194a3.891,3.891,0,0,0-3.773,0l-.348.192a.964.964,0,0,1-1.291-.346l-.207-.342a3.891,3.891,0,0,0-3.264-1.885L14,31.332v2.947l.306.007a.959.959,0,0,1,.806.465l.208.342a3.9,3.9,0,0,0,5.233,1.4l.35-.193a.96.96,0,0,1,.928,0l.353.194a3.9,3.9,0,0,0,5.231-1.4l.206-.342a.961.961,0,0,1,.807-.465l.3-.007Z" transform="translate(-1.845 -7.466)" fill="#dd2c00"/>
    <path id="Path_3589" data-name="Path 3589" d="M31.542,16.7a2.436,2.436,0,0,1,0-2.35l.193-.351a2.438,2.438,0,0,0-.874-3.261l-.342-.208a2.44,2.44,0,0,1-1.175-2.035l-.009-.4A2.437,2.437,0,0,0,26.948,5.7l-.4-.009A2.435,2.435,0,0,1,24.512,4.52L24.3,4.177A2.439,2.439,0,0,0,21.044,3.3l-.351.193a2.436,2.436,0,0,1-2.35,0l-.35-.192a2.438,2.438,0,0,0-3.26.874l-.208.342A2.44,2.44,0,0,1,12.49,5.7l-.4.009A2.437,2.437,0,0,0,9.7,8.091l-.009.4a2.435,2.435,0,0,1-1.175,2.035l-.342.208A2.439,2.439,0,0,0,7.3,14l.193.351a2.436,2.436,0,0,1,0,2.35l-.192.35a2.438,2.438,0,0,0,.874,3.261l.342.208a2.44,2.44,0,0,1,1.175,2.035l.009.4a2.437,2.437,0,0,0,2.387,2.387l.4.009a2.435,2.435,0,0,1,2.035,1.175l.208.342a2.439,2.439,0,0,0,3.261.874l.351-.193a2.436,2.436,0,0,1,2.35,0l.351.193a2.438,2.438,0,0,0,3.261-.874l.208-.342a2.44,2.44,0,0,1,2.035-1.175l.4-.009a2.437,2.437,0,0,0,2.387-2.387l.009-.4a2.435,2.435,0,0,1,1.175-2.035l.342-.208a2.439,2.439,0,0,0,.874-3.261Z" fill="#ffa000"/>
    <path id="Path_3590" data-name="Path 3590" d="M21.08,8.923a8.158,8.158,0,1,0,8.158,8.158A8.158,8.158,0,0,0,21.08,8.923Z" transform="translate(-1.561 -1.561)" fill="#ffb300"/>
    <path id="Path_3591" data-name="Path 3591" d="M20.837,25.676a8.838,8.838,0,1,1,8.837-8.838A8.847,8.847,0,0,1,20.837,25.676Zm0-16.2A7.365,7.365,0,1,0,28.2,16.837,7.373,7.373,0,0,0,20.837,9.473Z" transform="translate(-1.318 -1.317)" fill="#ffca28"/>
  </g>
</svg>
