<svg id="Group_5476" data-name="Group 5476" xmlns="http://www.w3.org/2000/svg" width="19.004" height="19.004" viewBox="0 0 19.004 19.004">
  <g id="Component_14_57" data-name="Component 14 – 57">
    <g id="search">
      <path id="Shape" d="M17.324,19h0l-5.058-5.058A7.649,7.649,0,0,1,7.72,15.44a7.72,7.72,0,1,1,7.72-7.72,7.648,7.648,0,0,1-1.494,4.546L19,17.324,17.325,19ZM7.719,2.374A5.345,5.345,0,1,0,11.5,3.94,5.31,5.31,0,0,0,7.719,2.374Z" fill="#333"/>
    </g>
  </g>
</svg>
