@startuml
rectangle {
    rectangle "service-requests" as requests_topic #Strategy
    rectangle "service" as service #PaleTurquoise
    rectangle "service-events" as events_topic #LightPink
    rectangle "service-responses" as responses_topic #Implementation
}
rectangle {
    rectangle "other-service-events" as other_events_topic #LightPink
    rectangle "other-service-responses" as other_responses_topic #Implementation
}
note right of responses_topic
    exactly one
    response per request
end note

requests_topic -r->  service
service        -r-|> responses_topic
service        -d-|> events_topic

other_events_topic    -d-> service
other_responses_topic -d-> service
@enduml
