Date,EMISSION,IDsource
2006-07-01,0,1
2006-07-02,0,1
2006-07-03,0,1
2006-07-04,0,1
2006-07-05,0,1
2006-07-06,0,1
2006-07-07,0,1
2006-07-08,0,1
2006-07-09,0,1
2006-07-10,0,1
2006-07-11,0,1
2006-07-12,0,1
2006-07-13,0,1
2006-07-14,0,1
2006-07-15,0,1
2006-07-16,0,1
2006-07-17,0,1
2006-07-18,0,1
2006-07-19,0,1
2006-07-20,0,1
2006-07-21,0,1
2006-07-22,0,1
2006-07-23,0,1
2006-07-24,0,1
2006-07-25,0,1
2006-07-26,0,1
2006-07-27,0,1
2006-07-28,0,1
2006-07-29,0,1
2006-07-30,0,1
2006-07-31,0,1
2006-08-01,0,1
2006-08-02,0,1
2006-08-03,0,1
2006-08-04,0,1
2006-08-05,0,1
2006-08-06,0,1
2006-08-07,0,1
2006-08-08,0,1
2006-08-09,0,1
2006-08-10,0,1
2006-08-11,0,1
2006-08-12,3146003.2658558316,1
2006-08-13,12584013.063423326,1
2006-08-14,29458030.58028642,1
2006-08-15,35940703.97659541,1
2006-08-16,33080701.00763556,1
2006-08-17,29744030.877182405,1
2006-08-18,22098289.60682975,1
2006-08-19,12774679.92802065,1
2006-08-20,7188140.795319081,1
2006-08-21,3184136.638775296,1
2006-08-22,1048667.755285277,1
2006-08-23,419467.1021141109,1
2006-08-24,0,1
2006-08-25,0,1
2006-08-26,0,1
2006-08-27,0,1
2006-08-28,0,1
2006-08-29,0,1
2006-08-30,0,1
2006-08-31,0,1
2006-09-01,0,1
2006-07-01,0,2
2006-07-02,0,2
2006-07-03,0,2
2006-07-04,0,2
2006-07-05,0,2
2006-07-06,0,2
2006-07-07,0,2
2006-07-08,0,2
2006-07-09,0,2
2006-07-10,0,2
2006-07-11,0,2
2006-07-12,0,2
2006-07-13,0,2
2006-07-14,0,2
2006-07-15,0,2
2006-07-16,0,2
2006-07-17,0,2
2006-07-18,0,2
2006-07-19,0,2
2006-07-20,0,2
2006-07-21,0,2
2006-07-22,0,2
2006-07-23,0,2
2006-07-24,0,2
2006-07-25,0,2
2006-07-26,0,2
2006-07-27,0,2
2006-07-28,0,2
2006-07-29,0,2
2006-07-30,0,2
2006-07-31,0,2
2006-08-01,0,2
2006-08-02,0,2
2006-08-03,0,2
2006-08-04,0,2
2006-08-05,0,2
2006-08-06,0,2
2006-08-07,0,2
2006-08-08,0,2
2006-08-09,0,2
2006-08-10,1686843.5514853108,2
2006-08-11,6747374.205941243,2
2006-08-12,15794989.618453365,2
2006-08-13,19270909.663938247,2
2006-08-14,17737415.526224326,2
2006-08-15,15948339.032224756,2
2006-08-16,11848798.037402881,2
2006-08-17,6849607.148455505,2
2006-08-18,3854181.9327876493,2
2006-08-19,1707290.139988163,2
2006-08-20,562281.1838284369,2
2006-08-21,224912.4735313748,2
2006-08-22,0,2
2006-08-23,0,2
2006-08-24,0,2
2006-08-25,0,2
2006-08-26,0,2
2006-08-27,0,2
2006-08-28,0,2
2006-08-29,0,2
2006-08-30,0,2
2006-08-31,0,2
2006-09-01,0,2
2006-07-01,0,3
2006-07-02,0,3
2006-07-03,0,3
2006-07-04,0,3
2006-07-05,0,3
2006-07-06,0,3
2006-07-07,0,3
2006-07-08,0,3
2006-07-09,0,3
2006-07-10,0,3
2006-07-11,0,3
2006-07-12,0,3
2006-07-13,0,3
2006-07-14,0,3
2006-07-15,0,3
2006-07-16,0,3
2006-07-17,0,3
2006-07-18,0,3
2006-07-19,0,3
2006-07-20,0,3
2006-07-21,0,3
2006-07-22,0,3
2006-07-23,0,3
2006-07-24,0,3
2006-07-25,0,3
2006-07-26,0,3
2006-07-27,0,3
2006-07-28,0,3
2006-07-29,0,3
2006-07-30,0,3
2006-07-31,0,3
2006-08-01,0,3
2006-08-02,0,3
2006-08-03,0,3
2006-08-04,0,3
2006-08-05,0,3
2006-08-06,0,3
2006-08-07,0,3
2006-08-08,0,3
2006-08-09,1201299.426182556,3
2006-08-10,4805197.704730224,3
2006-08-11,11248530.990618477,3
2006-08-12,13723935.868812835,3
2006-08-13,12631845.481374146,3
2006-08-14,11357740.029362345,3
2006-08-15,8438218.393609589,3
2006-08-16,4878003.730559469,3
2006-08-17,2744787.173762567,3
2006-08-18,1215860.631348405,3
2006-08-19,400433.1420608519,3
2006-08-20,160173.2568243408,3
2006-08-21,0,3
2006-08-22,0,3
2006-08-23,0,3
2006-08-24,0,3
2006-08-25,0,3
2006-08-26,0,3
2006-08-27,0,3
2006-08-28,0,3
2006-08-29,0,3
2006-08-30,0,3
2006-08-31,0,3
2006-09-01,0,3
2006-07-01,0,4
2006-07-02,0,4
2006-07-03,0,4
2006-07-04,0,4
2006-07-05,0,4
2006-07-06,0,4
2006-07-07,0,4
2006-07-08,0,4
2006-07-09,0,4
2006-07-10,0,4
2006-07-11,0,4
2006-07-12,825045.2279966928,4
2006-07-13,3300180.911986771,4
2006-07-14,7725423.4985144865,4
2006-07-15,9425516.69559858,4
2006-07-16,8675475.579237951,4
2006-07-17,7800427.61015055,4
2006-07-18,5795317.692413133,4
2006-07-19,3350183.65307748,4
2006-07-20,1885103.339119716,4
2006-07-21,835045.7762148344,4
2006-07-22,275015.07599889755,4
2006-07-23,110006.03039955904,4
2006-07-24,0,4
2006-07-25,0,4
2006-07-26,0,4
2006-07-27,0,4
2006-07-28,0,4
2006-07-29,0,4
2006-07-30,0,4
2006-07-31,0,4
2006-08-01,0,4
2006-08-02,0,4
2006-08-03,0,4
2006-08-04,0,4
2006-08-05,0,4
2006-08-06,0,4
2006-08-07,0,4
2006-08-08,0,4
2006-08-09,0,4
2006-08-10,0,4
2006-08-11,0,4
2006-08-12,0,4
2006-08-13,0,4
2006-08-14,0,4
2006-08-15,0,4
2006-08-16,0,4
2006-08-17,0,4
2006-08-18,0,4
2006-08-19,0,4
2006-08-20,0,4
2006-08-21,0,4
2006-08-22,0,4
2006-08-23,0,4
2006-08-24,0,4
2006-08-25,0,4
2006-08-26,0,4
2006-08-27,0,4
2006-08-28,0,4
2006-08-29,0,4
2006-08-30,0,4
2006-08-31,0,4
2006-09-01,0,4
2006-07-01,0,5
2006-07-02,0,5
2006-07-03,0,5
2006-07-04,0,5
2006-07-05,0,5
2006-07-06,0,5
2006-07-07,0,5
2006-07-08,0,5
2006-07-09,0,5
2006-07-10,0,5
2006-07-11,0,5
2006-07-12,0,5
2006-07-13,0,5
2006-07-14,0,5
2006-07-15,0,5
2006-07-16,0,5
2006-07-17,0,5
2006-07-18,0,5
2006-07-19,0,5
2006-07-20,0,5
2006-07-21,0,5
2006-07-22,0,5
2006-07-23,0,5
2006-07-24,0,5
2006-07-25,0,5
2006-07-26,0,5
2006-07-27,0,5
2006-07-28,0,5
2006-07-29,0,5
2006-07-30,0,5
2006-07-31,0,5
2006-08-01,0,5
2006-08-02,0,5
2006-08-03,0,5
2006-08-04,0,5
2006-08-05,0,5
2006-08-06,0,5
2006-08-07,0,5
2006-08-08,0,5
2006-08-09,0,5
2006-08-10,0,5
2006-08-11,0,5
2006-08-12,0,5
2006-08-13,1438539.7873658014,5
2006-08-14,5754159.149463206,5
2006-08-15,13469963.46351614,5
2006-08-16,16434227.267785065,5
2006-08-17,15126463.824725244,5
2006-08-18,13600739.807822123,5
2006-08-19,10104652.203375539,5
2006-08-20,5841343.379000528,5
2006-08-21,3286845.4535570126,5
2006-08-22,1455976.6332732656,5
2006-08-23,479513.26245526713,5
2006-08-24,191805.30498210687,5
2006-08-25,0,5
2006-08-26,0,5
2006-08-27,0,5
2006-08-28,0,5
2006-08-29,0,5
2006-08-30,0,5
2006-08-31,0,5
2006-09-01,0,5
2006-07-01,0,6
2006-07-02,0,6
2006-07-03,0,6
2006-07-04,0,6
2006-07-05,0,6
2006-07-06,0,6
2006-07-07,0,6
2006-07-08,0,6
2006-07-09,0,6
2006-07-10,0,6
2006-07-11,0,6
2006-07-12,0,6
2006-07-13,0,6
2006-07-14,0,6
2006-07-15,0,6
2006-07-16,0,6
2006-07-17,0,6
2006-07-18,0,6
2006-07-19,0,6
2006-07-20,0,6
2006-07-21,0,6
2006-07-22,0,6
2006-07-23,0,6
2006-07-24,0,6
2006-07-25,0,6
2006-07-26,0,6
2006-07-27,0,6
2006-07-28,0,6
2006-07-29,0,6
2006-07-30,0,6
2006-07-31,0,6
2006-08-01,0,6
2006-08-02,560240.3033703839,6
2006-08-03,2240961.2134815357,6
2006-08-04,5245886.477013595,6
2006-08-05,6400321.041534387,6
2006-08-06,5891011.674834037,6
2006-08-07,5296817.41368363,6
2006-08-08,3935263.706704697,6
2006-08-09,2274915.1712615592,6
2006-08-10,1280064.2083068772,6
2006-08-11,567031.0949263886,6
2006-08-12,186746.76779012798,6
2006-08-13,74698.7071160512,6
2006-08-14,0,6
2006-08-15,0,6
2006-08-16,0,6
2006-08-17,0,6
2006-08-18,0,6
2006-08-19,0,6
2006-08-20,0,6
2006-08-21,0,6
2006-08-22,0,6
2006-08-23,0,6
2006-08-24,0,6
2006-08-25,0,6
2006-08-26,0,6
2006-08-27,0,6
2006-08-28,0,6
2006-08-29,0,6
2006-08-30,0,6
2006-08-31,0,6
2006-09-01,0,6
2006-07-01,0,7
2006-07-02,0,7
2006-07-03,0,7
2006-07-04,0,7
2006-07-05,0,7
2006-07-06,0,7
2006-07-07,0,7
2006-07-08,0,7
2006-07-09,0,7
2006-07-10,0,7
2006-07-11,0,7
2006-07-12,0,7
2006-07-13,0,7
2006-07-14,0,7
2006-07-15,0,7
2006-07-16,0,7
2006-07-17,0,7
2006-07-18,0,7
2006-07-19,0,7
2006-07-20,0,7
2006-07-21,0,7
2006-07-22,0,7
2006-07-23,0,7
2006-07-24,0,7
2006-07-25,0,7
2006-07-26,0,7
2006-07-27,0,7
2006-07-28,0,7
2006-07-29,0,7
2006-07-30,0,7
2006-07-31,0,7
2006-08-01,0,7
2006-08-02,0,7
2006-08-03,0,7
2006-08-04,1689915.3678599698,7
2006-08-05,6759661.471439879,7
2006-08-06,15823752.989961535,7
2006-08-07,19306002.83888511,7
2006-08-08,17769716.14083059,7
2006-08-09,15977381.659766987,7
2006-08-10,11870375.220301243,7
2006-08-11,6862080.584643514,7
2006-08-12,3861200.5677770213,7
2006-08-13,1710399.1905006967,7
2006-08-14,563305.1226199899,7
2006-08-15,225322.04904799597,7
2006-08-16,0,7
2006-08-17,0,7
2006-08-18,0,7
2006-08-19,0,7
2006-08-20,0,7
2006-08-21,0,7
2006-08-22,0,7
2006-08-23,0,7
2006-08-24,0,7
2006-08-25,0,7
2006-08-26,0,7
2006-08-27,0,7
2006-08-28,0,7
2006-08-29,0,7
2006-08-30,0,7
2006-08-31,0,7
2006-09-01,0,7
2006-07-01,0,8
2006-07-02,0,8
2006-07-03,0,8
2006-07-04,0,8
2006-07-05,0,8
2006-07-06,0,8
2006-07-07,489314.48581234395,8
2006-07-08,1957257.9432493758,8
2006-07-09,4581762.912606494,8
2006-07-10,5590047.307613747,8
2006-07-11,5145215.956875253,8
2006-07-12,4626246.047680343,8
2006-07-13,3437063.5700394344,8
2006-07-14,1986913.366631942,8
2006-07-15,1118009.4615227494,8
2006-07-16,495245.57048885716,8
2006-07-17,163104.82860411465,8
2006-07-18,65241.931441645866,8
2006-07-19,0,8
2006-07-20,0,8
2006-07-21,0,8
2006-07-22,0,8
2006-07-23,0,8
2006-07-24,0,8
2006-07-25,0,8
2006-07-26,0,8
2006-07-27,0,8
2006-07-28,0,8
2006-07-29,0,8
2006-07-30,0,8
2006-07-31,0,8
2006-08-01,0,8
2006-08-02,0,8
2006-08-03,0,8
2006-08-04,0,8
2006-08-05,0,8
2006-08-06,0,8
2006-08-07,0,8
2006-08-08,0,8
2006-08-09,0,8
2006-08-10,0,8
2006-08-11,0,8
2006-08-12,0,8
2006-08-13,0,8
2006-08-14,0,8
2006-08-15,0,8
2006-08-16,0,8
2006-08-17,0,8
2006-08-18,0,8
2006-08-19,0,8
2006-08-20,0,8
2006-08-21,0,8
2006-08-22,0,8
2006-08-23,0,8
2006-08-24,0,8
2006-08-25,0,8
2006-08-26,0,8
2006-08-27,0,8
2006-08-28,0,8
2006-08-29,0,8
2006-08-30,0,8
2006-08-31,0,8
2006-09-01,0,8
2006-07-01,0,9
2006-07-02,0,9
2006-07-03,0,9
2006-07-04,0,9
2006-07-05,0,9
2006-07-06,0,9
2006-07-07,0,9
2006-07-08,0,9
2006-07-09,0,9
2006-07-10,0,9
2006-07-11,0,9
2006-07-12,0,9
2006-07-13,0,9
2006-07-14,0,9
2006-07-15,0,9
2006-07-16,0,9
2006-07-17,0,9
2006-07-18,0,9
2006-07-19,0,9
2006-07-20,0,9
2006-07-21,0,9
2006-07-22,0,9
2006-07-23,0,9
2006-07-24,0,9
2006-07-25,0,9
2006-07-26,0,9
2006-07-27,0,9
2006-07-28,0,9
2006-07-29,0,9
2006-07-30,0,9
2006-07-31,0,9
2006-08-01,0,9
2006-08-02,0,9
2006-08-03,0,9
2006-08-04,0,9
2006-08-05,0,9
2006-08-06,0,9
2006-08-07,0,9
2006-08-08,0,9
2006-08-09,0,9
2006-08-10,510739.41995248303,9
2006-08-11,2042957.6798099321,9
2006-08-12,4782378.205009613,9
2006-08-13,5834810.949154125,9
2006-08-14,5370502.385560958,9
2006-08-15,4828809.06136893,9
2006-08-16,3587557.5013631987,9
2006-08-17,2073911.5840494765,9
2006-08-18,1166962.1898308247,9
2006-08-19,516930.2008003919,9
2006-08-20,170246.47331749432,9
2006-08-21,68098.58932699774,9
2006-08-22,0,9
2006-08-23,0,9
2006-08-24,0,9
2006-08-25,0,9
2006-08-26,0,9
2006-08-27,0,9
2006-08-28,0,9
2006-08-29,0,9
2006-08-30,0,9
2006-08-31,0,9
2006-09-01,0,9
2006-07-01,0,10
2006-07-02,0,10
2006-07-03,0,10
2006-07-04,0,10
2006-07-05,0,10
2006-07-06,0,10
2006-07-07,0,10
2006-07-08,0,10
2006-07-09,0,10
2006-07-10,0,10
2006-07-11,0,10
2006-07-12,0,10
2006-07-13,0,10
2006-07-14,0,10
2006-07-15,0,10
2006-07-16,0,10
2006-07-17,1395673.982059744,10
2006-07-18,5582695.928238976,10
2006-07-19,13068583.650195785,10
2006-07-20,15944517.916258287,10
2006-07-21,14675723.387113065,10
2006-07-22,13195463.103110306,10
2006-07-23,9803552.395195413,10
2006-07-24,5667282.230181991,10
2006-07-25,3188903.5832516574,10
2006-07-26,1412591.242448347,10
2006-07-27,465224.6606865813,10
2006-07-28,186089.86427463253,10
2006-07-29,0,10
2006-07-30,0,10
2006-07-31,0,10
2006-08-01,0,10
2006-08-02,0,10
2006-08-03,0,10
2006-08-04,0,10
2006-08-05,0,10
2006-08-06,0,10
2006-08-07,0,10
2006-08-08,0,10
2006-08-09,0,10
2006-08-10,0,10
2006-08-11,0,10
2006-08-12,0,10
2006-08-13,0,10
2006-08-14,0,10
2006-08-15,0,10
2006-08-16,0,10
2006-08-17,0,10
2006-08-18,0,10
2006-08-19,0,10
2006-08-20,0,10
2006-08-21,0,10
2006-08-22,0,10
2006-08-23,0,10
2006-08-24,0,10
2006-08-25,0,10
2006-08-26,0,10
2006-08-27,0,10
2006-08-28,0,10
2006-08-29,0,10
2006-08-30,0,10
2006-08-31,0,10
2006-09-01,0,10
2006-07-01,0,11
2006-07-02,0,11
2006-07-03,0,11
2006-07-04,0,11
2006-07-05,0,11
2006-07-06,0,11
2006-07-07,0,11
2006-07-08,0,11
2006-07-09,0,11
2006-07-10,0,11
2006-07-11,0,11
2006-07-12,0,11
2006-07-13,0,11
2006-07-14,0,11
2006-07-15,0,11
2006-07-16,0,11
2006-07-17,0,11
2006-07-18,0,11
2006-07-19,0,11
2006-07-20,0,11
2006-07-21,0,11
2006-07-22,0,11
2006-07-23,0,11
2006-07-24,0,11
2006-07-25,0,11
2006-07-26,0,11
2006-07-27,0,11
2006-07-28,0,11
2006-07-29,0,11
2006-07-30,0,11
2006-07-31,0,11
2006-08-01,0,11
2006-08-02,0,11
2006-08-03,0,11
2006-08-04,0,11
2006-08-05,0,11
2006-08-06,0,11
2006-08-07,0,11
2006-08-08,0,11
2006-08-09,0,11
2006-08-10,0,11
2006-08-11,678336.9022137191,11
2006-08-12,2713347.6088548764,11
2006-08-13,6351700.084364823,11
2006-08-14,7749485.216199154,11
2006-08-15,7132815.305095772,11
2006-08-16,6413367.075475162,11
2006-08-17,4764802.84645879,11
2006-08-18,2754458.9362617685,11
2006-08-19,1549897.0432398305,11
2006-08-20,686559.1676950974,11
2006-08-21,226112.30073790633,11
2006-08-22,90444.92029516253,11
2006-08-23,0,11
2006-08-24,0,11
2006-08-25,0,11
2006-08-26,0,11
2006-08-27,0,11
2006-08-28,0,11
2006-08-29,0,11
2006-08-30,0,11
2006-08-31,0,11
2006-09-01,0,11
2006-07-01,0,12
2006-07-02,0,12
2006-07-03,0,12
2006-07-04,0,12
2006-07-05,0,12
2006-07-06,0,12
2006-07-07,0,12
2006-07-08,0,12
2006-07-09,0,12
2006-07-10,0,12
2006-07-11,0,12
2006-07-12,0,12
2006-07-13,0,12
2006-07-14,0,12
2006-07-15,1060686.7502382793,12
2006-07-16,4242747.000953117,12
2006-07-17,9931885.024958434,12
2006-07-18,12117542.57090398,12
2006-07-19,11153281.888869178,12
2006-07-20,10028311.093161913,12
2006-07-21,7450520.86985555,12
2006-07-22,4307031.046422104,12
2006-07-23,2423508.5141807953,12
2006-07-24,1073543.5593320765,12
2006-07-25,353562.2500794264,12
2006-07-26,141424.90003177058,12
2006-07-27,0,12
2006-07-28,0,12
2006-07-29,0,12
2006-07-30,0,12
2006-07-31,0,12
2006-08-01,0,12
2006-08-02,0,12
2006-08-03,0,12
2006-08-04,0,12
2006-08-05,0,12
2006-08-06,0,12
2006-08-07,0,12
2006-08-08,0,12
2006-08-09,0,12
2006-08-10,0,12
2006-08-11,0,12
2006-08-12,0,12
2006-08-13,0,12
2006-08-14,0,12
2006-08-15,0,12
2006-08-16,0,12
2006-08-17,0,12
2006-08-18,0,12
2006-08-19,0,12
2006-08-20,0,12
2006-08-21,0,12
2006-08-22,0,12
2006-08-23,0,12
2006-08-24,0,12
2006-08-25,0,12
2006-08-26,0,12
2006-08-27,0,12
2006-08-28,0,12
2006-08-29,0,12
2006-08-30,0,12
2006-08-31,0,12
2006-09-01,0,12
2006-07-01,0,13
2006-07-02,0,13
2006-07-03,0,13
2006-07-04,0,13
2006-07-05,0,13
2006-07-06,0,13
2006-07-07,0,13
2006-07-08,0,13
2006-07-09,0,13
2006-07-10,0,13
2006-07-11,0,13
2006-07-12,0,13
2006-07-13,0,13
2006-07-14,0,13
2006-07-15,0,13
2006-07-16,0,13
2006-07-17,0,13
2006-07-18,0,13
2006-07-19,0,13
2006-07-20,0,13
2006-07-21,0,13
2006-07-22,0,13
2006-07-23,0,13
2006-07-24,0,13
2006-07-25,0,13
2006-07-26,0,13
2006-07-27,0,13
2006-07-28,0,13
2006-07-29,0,13
2006-07-30,0,13
2006-07-31,0,13
2006-08-01,0,13
2006-08-02,0,13
2006-08-03,0,13
2006-08-04,0,13
2006-08-05,0,13
2006-08-06,0,13
2006-08-07,0,13
2006-08-08,0,13
2006-08-09,0,13
2006-08-10,0,13
2006-08-11,0,13
2006-08-12,0,13
2006-08-13,1894203.0789805008,13
2006-08-14,7576812.315922003,13
2006-08-15,17736628.83045378,13
2006-08-16,21639835.17501966,13
2006-08-17,19917832.375946477,13
2006-08-18,17908829.110361096,13
2006-08-19,13305341.627505457,13
2006-08-20,7691612.502526882,13
2006-08-21,4327967.035003931,13
2006-08-22,1917163.1163014765,13
2006-08-23,631401.0263268335,13
2006-08-24,252560.41053073344,13
2006-08-25,0,13
2006-08-26,0,13
2006-08-27,0,13
2006-08-28,0,13
2006-08-29,0,13
2006-08-30,0,13
2006-08-31,0,13
2006-09-01,0,13
2006-07-01,0,14
2006-07-02,0,14
2006-07-03,0,14
2006-07-04,636875.6823981989,14
2006-07-05,2547502.7295927955,14
2006-07-06,5963472.298819498,14
2006-07-07,7275822.189821848,14
2006-07-08,6696844.296732576,14
2006-07-09,6021370.088128425,14
2006-07-10,4473569.187269772,14
2006-07-11,2586101.255798747,14
2006-07-12,1455164.4379643693,14
2006-07-13,644595.3876393891,14
2006-07-14,212291.89413273294,14
2006-07-15,84916.75765309318,14
2006-07-16,0,14
2006-07-17,0,14
2006-07-18,0,14
2006-07-19,0,14
2006-07-20,0,14
2006-07-21,0,14
2006-07-22,0,14
2006-07-23,0,14
2006-07-24,0,14
2006-07-25,0,14
2006-07-26,0,14
2006-07-27,0,14
2006-07-28,0,14
2006-07-29,0,14
2006-07-30,0,14
2006-07-31,0,14
2006-08-01,0,14
2006-08-02,0,14
2006-08-03,0,14
2006-08-04,0,14
2006-08-05,0,14
2006-08-06,0,14
2006-08-07,0,14
2006-08-08,0,14
2006-08-09,0,14
2006-08-10,0,14
2006-08-11,0,14
2006-08-12,0,14
2006-08-13,0,14
2006-08-14,0,14
2006-08-15,0,14
2006-08-16,0,14
2006-08-17,0,14
2006-08-18,0,14
2006-08-19,0,14
2006-08-20,0,14
2006-08-21,0,14
2006-08-22,0,14
2006-08-23,0,14
2006-08-24,0,14
2006-08-25,0,14
2006-08-26,0,14
2006-08-27,0,14
2006-08-28,0,14
2006-08-29,0,14
2006-08-30,0,14
2006-08-31,0,14
2006-09-01,0,14
2006-07-01,0,15
2006-07-02,0,15
2006-07-03,0,15
2006-07-04,0,15
2006-07-05,0,15
2006-07-06,0,15
2006-07-07,0,15
2006-07-08,0,15
2006-07-09,0,15
2006-07-10,650934.8759513812,15
2006-07-11,2603739.5038055247,15
2006-07-12,6095117.474817478,15
2006-07-13,7436437.825262748,15
2006-07-14,6844678.847125128,15
2006-07-15,6154293.37263124,15
2006-07-16,4572324.371076671,15
2006-07-17,2643190.1023480324,15
2006-07-18,1487287.5650525496,15
2006-07-19,658824.9956598827,15
2006-07-20,216978.2919837937,15
2006-07-21,86791.31679351749,15
2006-07-22,0,15
2006-07-23,0,15
2006-07-24,0,15
2006-07-25,0,15
2006-07-26,0,15
2006-07-27,0,15
2006-07-28,0,15
2006-07-29,0,15
2006-07-30,0,15
2006-07-31,0,15
2006-08-01,0,15
2006-08-02,0,15
2006-08-03,0,15
2006-08-04,0,15
2006-08-05,0,15
2006-08-06,0,15
2006-08-07,0,15
2006-08-08,0,15
2006-08-09,0,15
2006-08-10,0,15
2006-08-11,0,15
2006-08-12,0,15
2006-08-13,0,15
2006-08-14,0,15
2006-08-15,0,15
2006-08-16,0,15
2006-08-17,0,15
2006-08-18,0,15
2006-08-19,0,15
2006-08-20,0,15
2006-08-21,0,15
2006-08-22,0,15
2006-08-23,0,15
2006-08-24,0,15
2006-08-25,0,15
2006-08-26,0,15
2006-08-27,0,15
2006-08-28,0,15
2006-08-29,0,15
2006-08-30,0,15
2006-08-31,0,15
2006-09-01,0,15
2006-07-01,0,16
2006-07-02,0,16
2006-07-03,0,16
2006-07-04,0,16
2006-07-05,0,16
2006-07-06,0,16
2006-07-07,0,16
2006-07-08,266375.3411864263,16
2006-07-09,1065501.3647457052,16
2006-07-10,2494241.8311092644,16
2006-07-11,3043136.4735540217,16
2006-07-12,2800977.072475452,16
2006-07-13,2518457.7712171213,16
2006-07-14,1871084.972333746,16
2006-07-15,1081645.32481761,16
2006-07-16,608627.2947108042,16
2006-07-17,269604.1332008072,16
2006-07-18,88791.78039547542,16
2006-07-19,35516.712158190174,16
2006-07-20,0,16
2006-07-21,0,16
2006-07-22,0,16
2006-07-23,0,16
2006-07-24,0,16
2006-07-25,0,16
2006-07-26,0,16
2006-07-27,0,16
2006-07-28,0,16
2006-07-29,0,16
2006-07-30,0,16
2006-07-31,0,16
2006-08-01,0,16
2006-08-02,0,16
2006-08-03,0,16
2006-08-04,0,16
2006-08-05,0,16
2006-08-06,0,16
2006-08-07,0,16
2006-08-08,0,16
2006-08-09,0,16
2006-08-10,0,16
2006-08-11,0,16
2006-08-12,0,16
2006-08-13,0,16
2006-08-14,0,16
2006-08-15,0,16
2006-08-16,0,16
2006-08-17,0,16
2006-08-18,0,16
2006-08-19,0,16
2006-08-20,0,16
2006-08-21,0,16
2006-08-22,0,16
2006-08-23,0,16
2006-08-24,0,16
2006-08-25,0,16
2006-08-26,0,16
2006-08-27,0,16
2006-08-28,0,16
2006-08-29,0,16
2006-08-30,0,16
2006-08-31,0,16
2006-09-01,0,16
2006-07-01,0,17
2006-07-02,0,17
2006-07-03,0,17
2006-07-04,0,17
2006-07-05,0,17
2006-07-06,0,17
2006-07-07,0,17
2006-07-08,0,17
2006-07-09,0,17
2006-07-10,0,17
2006-07-11,0,17
2006-07-12,0,17
2006-07-13,0,17
2006-07-14,0,17
2006-07-15,0,17
2006-07-16,0,17
2006-07-17,0,17
2006-07-18,0,17
2006-07-19,0,17
2006-07-20,0,17
2006-07-21,0,17
2006-07-22,0,17
2006-07-23,0,17
2006-07-24,0,17
2006-07-25,1313496.7236847756,17
2006-07-26,5253986.894739103,17
2006-07-27,12299105.68541199,17
2006-07-28,15005704.994823042,17
2006-07-29,13811617.064200519,17
2006-07-30,12418514.478474243,17
2006-07-31,9226319.41061003,17
2006-08-01,5333592.756780604,17
2006-08-02,3001140.998964608,17
2006-08-03,1329417.8960930759,17
2006-08-04,437832.2412282585,17
2006-08-05,175132.89649130343,17
2006-08-06,0,17
2006-08-07,0,17
2006-08-08,0,17
2006-08-09,0,17
2006-08-10,0,17
2006-08-11,0,17
2006-08-12,0,17
2006-08-13,0,17
2006-08-14,0,17
2006-08-15,0,17
2006-08-16,0,17
2006-08-17,0,17
2006-08-18,0,17
2006-08-19,0,17
2006-08-20,0,17
2006-08-21,0,17
2006-08-22,0,17
2006-08-23,0,17
2006-08-24,0,17
2006-08-25,0,17
2006-08-26,0,17
2006-08-27,0,17
2006-08-28,0,17
2006-08-29,0,17
2006-08-30,0,17
2006-08-31,0,17
2006-09-01,0,17
2006-07-01,0,18
2006-07-02,0,18
2006-07-03,0,18
2006-07-04,0,18
2006-07-05,0,18
2006-07-06,0,18
2006-07-07,1136961.8640237523,18
2006-07-08,4547847.456095009,18
2006-07-09,10646097.454040589,18
2006-07-10,12988927.961725896,18
2006-07-11,11955326.26715885,18
2006-07-12,10749457.623497294,18
2006-07-13,7986295.760021388,18
2006-07-14,4616754.235732812,18
2006-07-15,2597785.592345179,18
2006-07-16,1150743.2199513128,18
2006-07-17,378987.2880079174,18
2006-07-18,151594.91520316698,18
2006-07-19,0,18
2006-07-20,0,18
2006-07-21,0,18
2006-07-22,0,18
2006-07-23,0,18
2006-07-24,0,18
2006-07-25,0,18
2006-07-26,0,18
2006-07-27,0,18
2006-07-28,0,18
2006-07-29,0,18
2006-07-30,0,18
2006-07-31,0,18
2006-08-01,0,18
2006-08-02,0,18
2006-08-03,0,18
2006-08-04,0,18
2006-08-05,0,18
2006-08-06,0,18
2006-08-07,0,18
2006-08-08,0,18
2006-08-09,0,18
2006-08-10,0,18
2006-08-11,0,18
2006-08-12,0,18
2006-08-13,0,18
2006-08-14,0,18
2006-08-15,0,18
2006-08-16,0,18
2006-08-17,0,18
2006-08-18,0,18
2006-08-19,0,18
2006-08-20,0,18
2006-08-21,0,18
2006-08-22,0,18
2006-08-23,0,18
2006-08-24,0,18
2006-08-25,0,18
2006-08-26,0,18
2006-08-27,0,18
2006-08-28,0,18
2006-08-29,0,18
2006-08-30,0,18
2006-08-31,0,18
2006-09-01,0,18
2006-07-01,0,19
2006-07-02,0,19
2006-07-03,0,19
2006-07-04,0,19
2006-07-05,0,19
2006-07-06,0,19
2006-07-07,0,19
2006-07-08,0,19
2006-07-09,1132070.6197742452,19
2006-07-10,4528282.479096981,19
2006-07-11,10600297.621522477,19
2006-07-12,12933049.201663347,19
2006-07-13,11903894.092777668,19
2006-07-14,10703213.132411046,19
2006-07-15,7951938.474656668,19
2006-07-16,4596892.8196893595,19
2006-07-17,2586609.840332669,19
2006-07-18,1145792.6878927208,19
2006-07-19,377356.87325808173,19
2006-07-20,150942.7493032327,19
2006-07-21,0,19
2006-07-22,0,19
2006-07-23,0,19
2006-07-24,0,19
2006-07-25,0,19
2006-07-26,0,19
2006-07-27,0,19
2006-07-28,0,19
2006-07-29,0,19
2006-07-30,0,19
2006-07-31,0,19
2006-08-01,0,19
2006-08-02,0,19
2006-08-03,0,19
2006-08-04,0,19
2006-08-05,0,19
2006-08-06,0,19
2006-08-07,0,19
2006-08-08,0,19
2006-08-09,0,19
2006-08-10,0,19
2006-08-11,0,19
2006-08-12,0,19
2006-08-13,0,19
2006-08-14,0,19
2006-08-15,0,19
2006-08-16,0,19
2006-08-17,0,19
2006-08-18,0,19
2006-08-19,0,19
2006-08-20,0,19
2006-08-21,0,19
2006-08-22,0,19
2006-08-23,0,19
2006-08-24,0,19
2006-08-25,0,19
2006-08-26,0,19
2006-08-27,0,19
2006-08-28,0,19
2006-08-29,0,19
2006-08-30,0,19
2006-08-31,0,19
2006-09-01,0,19
2006-07-01,0,20
2006-07-02,0,20
2006-07-03,0,20
2006-07-04,0,20
2006-07-05,0,20
2006-07-06,0,20
2006-07-07,0,20
2006-07-08,0,20
2006-07-09,0,20
2006-07-10,0,20
2006-07-11,0,20
2006-07-12,0,20
2006-07-13,0,20
2006-07-14,0,20
2006-07-15,0,20
2006-07-16,0,20
2006-07-17,0,20
2006-07-18,0,20
2006-07-19,0,20
2006-07-20,0,20
2006-07-21,0,20
2006-07-22,0,20
2006-07-23,334356.76897849864,20
2006-07-24,1337427.0759139946,20
2006-07-25,3130795.2004350326,20
2006-07-26,3819772.784996787,20
2006-07-27,3515812.0859254245,20
2006-07-28,3161191.270342169,20
2006-07-29,2348603.0014913934,20
2006-07-30,1357691.122518752,20
2006-07-31,763954.5569993574,20
2006-08-01,338409.5782994501,20
2006-08-02,111452.2563261662,20
2006-08-03,44580.90253046648,20
2006-08-04,0,20
2006-08-05,0,20
2006-08-06,0,20
2006-08-07,0,20
2006-08-08,0,20
2006-08-09,0,20
2006-08-10,0,20
2006-08-11,0,20
2006-08-12,0,20
2006-08-13,0,20
2006-08-14,0,20
2006-08-15,0,20
2006-08-16,0,20
2006-08-17,0,20
2006-08-18,0,20
2006-08-19,0,20
2006-08-20,0,20
2006-08-21,0,20
2006-08-22,0,20
2006-08-23,0,20
2006-08-24,0,20
2006-08-25,0,20
2006-08-26,0,20
2006-08-27,0,20
2006-08-28,0,20
2006-08-29,0,20
2006-08-30,0,20
2006-08-31,0,20
2006-09-01,0,20
2006-07-01,0,21
2006-07-02,0,21
2006-07-03,0,21
2006-07-04,0,21
2006-07-05,0,21
2006-07-06,0,21
2006-07-07,0,21
2006-07-08,0,21
2006-07-09,0,21
2006-07-10,0,21
2006-07-11,0,21
2006-07-12,0,21
2006-07-13,0,21
2006-07-14,0,21
2006-07-15,0,21
2006-07-16,0,21
2006-07-17,0,21
2006-07-18,0,21
2006-07-19,0,21
2006-07-20,0,21
2006-07-21,821256.2627319882,21
2006-07-22,3285025.050927953,21
2006-07-23,7689945.005581344,21
2006-07-24,9382230.637877561,21
2006-07-25,8635634.035393935,21
2006-07-26,7764604.665829706,21
2006-07-27,5768703.081856814,21
2006-07-28,3334798.1577601945,21
2006-07-29,1876446.1275755123,21
2006-07-30,831210.8840984365,21
2006-07-31,273752.08757732937,21
2006-08-01,109500.83503093176,21
2006-08-02,0,21
2006-08-03,0,21
2006-08-04,0,21
2006-08-05,0,21
2006-08-06,0,21
2006-08-07,0,21
2006-08-08,0,21
2006-08-09,0,21
2006-08-10,0,21
2006-08-11,0,21
2006-08-12,0,21
2006-08-13,0,21
2006-08-14,0,21
2006-08-15,0,21
2006-08-16,0,21
2006-08-17,0,21
2006-08-18,0,21
2006-08-19,0,21
2006-08-20,0,21
2006-08-21,0,21
2006-08-22,0,21
2006-08-23,0,21
2006-08-24,0,21
2006-08-25,0,21
2006-08-26,0,21
2006-08-27,0,21
2006-08-28,0,21
2006-08-29,0,21
2006-08-30,0,21
2006-08-31,0,21
2006-09-01,0,21
