<?xml version="1.0" encoding="UTF-8" standalone="no"?>
<!-- Created with Inkscape (http://www.inkscape.org/) -->

<svg
   version="1.1"
   id="svg2"
   width="1002.6667"
   height="1333.3333"
   viewBox="0 0 1002.6667 1333.3333"
   xmlns="http://www.w3.org/2000/svg"
   xmlns:svg="http://www.w3.org/2000/svg">
  <defs
     id="defs6" />
  <g
     id="g8">
    <g
       id="g1507267">
      <path
         style="fill:#6d9191;stroke-width:1.33333"
         d="m 498.92396,1299.081 -1.2566,-2.4144 -14.31454,-31.6666 -14.31454,-31.6667 -1.51913,0.032 -1.51913,0.032 -8.37932,12.6946 -8.37931,12.6946 -1.93036,0.7407 -1.93038,0.7408 -34.94197,-34.059 -34.94197,-34.059 -1.57834,0.9254 -1.57832,0.9255 -12.45546,14.3333 -12.45549,14.3333 -2.04788,-0.029 -2.04788,-0.029 -28,-39.9573 -28,-39.9574 -1.41998,-0.014 -1.42,-0.013 -9.60842,12 -9.60841,12 h -1.14167 -1.14166 L 261.71345,1165 260.43372,1163.3333 246.71707,1132 233.00042,1100.6667 231.67029,1099 l -1.33014,-1.6667 h -42.42472 -42.42472 l -0.70388,-1.1389 -0.70389,-1.1389 11.29187,-31.17 11.29186,-31.1699 v -1.6911 -1.6912 l -3.66666,0.035 -3.66667,0.034 -16.66667,2.4937 -16.66667,2.4936 -1.32542,-1.2536 -1.32542,-1.2536 6.53775,-24.9413 6.53776,-24.94121 1.37732,-6.29924 1.37732,-6.29923 -0.58965,-0.57865 -0.58966,-0.57865 -31.1159,-3.3047 -31.115897,-3.30468 -1.269099,-1.26909 -1.269098,-1.26911 21.580952,-27.215 21.580952,-27.215 9.25055,-11.66049 9.25054,-11.66049 -0.44649,-1.23582 L 134,878.87403 90.66667,902.07036 47.333335,925.2667 45.666668,925.3 l -1.666667,0.0333 v -2.22495 -2.22494 l 20.747217,-91.44172 20.747216,-91.44172 0.730662,-3 0.730662,-3 -3.811211,0.005 -3.811211,0.005 -25.923974,4.67053 -25.923974,4.67053 -1.057142,-1.05714 -1.05714,-1.05714 39.412521,-36.45414 39.412523,-36.45415 -1.19099,-1.19098 -1.19099,-1.19099 -37.085277,-10.5964 -37.08528,-10.59639 -0.732917,-0.73292 -0.732918,-0.7329 1.244446,-1.18251 1.244444,-1.18252 33.333334,-14.87361 33.333335,-14.87362 1.266666,-1.25498 1.266667,-1.25467 H 75.128924 52.391178 l -8.195589,-0.85661 -8.195588,-0.8566 V 603.81637 602.68 l 27.721504,-23.67368 27.721503,-23.67368 5.922815,-4.91124 5.922817,-4.91124 -0.69253,-0.69252 -0.69253,-0.69253 -22.517464,6.60377 -22.517467,6.60376 h -1.100991 -1.10099 v -1.27431 -1.2743 l 29.333335,-25.4814 29.333337,-25.48142 v -0.97449 -0.97451 L 90.000003,484.76137 66.666669,467.64984 v -1.07957 -1.07957 l 1,-0.61356 1,-0.61356 L 104,462.67402 l 35.33334,-1.58956 3.25944,-0.96206 3.25944,-0.96204 -30.92611,-17.67873 -30.926107,-17.67873 v -1.90146 -1.90145 l 1.666667,-0.001 1.666666,-10e-4 34.000004,-2.65013 34,-2.65015 1.66667,-0.0148 1.66666,-0.0156 v -1.14091 -1.14089 l -30.33333,-20.44291 -30.333337,-20.44289 -0.913762,-1.35536 -0.913762,-1.35535 0.913762,-1.58516 0.913762,-1.58515 14.666667,-16.87165 14.66667,-16.87164 0.4256,-1.21418 0.4256,-1.21419 -16.36889,-8.20547 -16.368901,-8.20548 2.284628,-1.67056 2.284623,-1.67056 8.11367,-1.72184 8.11367,-1.72184 0.7719,-2.01154 0.7719,-2.01154 -4.52405,-23.25534 -4.52406,-23.25535 3.74494,-33.52511 3.74495,-33.52509 1.118,-1.16578 1.11799,-1.16579 24.09779,11.72444 24.09779,11.72442 0.69661,-0.6966 0.6966,-0.69661 -16.26796,-47.80669 -16.26796,-47.80669 5.80865,-22.722014 5.80865,-22.722014 1.20563,-2.764011 1.20561,-2.764011 26.45266,-25.505959 26.45265,-25.50596 8.44086,2.441477 8.44085,2.441477 7.70528,2.267663 7.70527,2.267662 2.27592,3.473485 2.27592,3.473486 10.68546,18.369029 10.68549,18.369027 60.52636,65.051653 60.52636,65.051 1.87679,0.44454 1.8768,0.44455 26.17949,-6.28213 26.17951,-6.28214 2.08401,2.59646 2.08401,2.59645 10.63194,19.58604 10.63193,19.58605 1.17386,-0.39129 1.17384,-0.39128 7.89112,-19.20608 7.89112,-19.20608 0.66818,-0.66819 0.66818,-0.66817 1.788,1.92063 1.78801,1.92064 7.03077,20.99999 7.03079,21 h 0.85357 0.85358 l 7.16098,-21 7.16099,-20.99999 1.68477,-1.83559 1.68479,-1.83559 1.55745,2.50226 1.55744,2.50225 7.01896,17.26432 7.01898,17.26432 1.24506,0.41501 1.24507,0.41503 11.16993,-20.68867 11.16994,-20.68866 1.74327,-1.44679 1.74326,-1.44679 25.61079,6.18555 25.6108,6.18555 2.18567,-0.3961 2.18568,-0.3961 60.58564,-65.06933 60.58565,-65.06932 10.68549,-18.351354 10.68546,-18.351355 2.27592,-3.473486 2.27592,-3.473485 7.70527,-2.267662 7.70528,-2.267663 8.46671,-2.44887 8.4667,-2.44887 26.19996,25.412086 26.19997,25.412085 1.47522,2.865278 1.47522,2.865278 5.67157,22.955624 5.67157,22.955624 -16.17647,47.57026 -16.17646,47.57025 0.75076,0.75077 0.75077,0.75076 23.92083,-11.90138 23.92083,-11.9014 1.2326,1.29141 1.23261,1.29141 3.73299,33.64324 3.73297,33.64323 -4.50108,23.13721 -4.50107,23.13721 0.7719,2.01154 0.7719,2.01154 8.11367,1.72184 8.11367,1.72184 2.28462,1.67056 2.28463,1.67056 -16.36889,8.20548 -16.3689,8.20547 0.4256,1.19499 0.4256,1.19498 15.71546,18.21976 15.71544,18.21976 -1.61234,1.94275 -1.61233,1.94274 -29.76979,20.11175 -29.76977,20.11175 v 1.14089 1.14091 l 1.66666,0.0148 1.66667,0.0148 34,2.65014 34,2.65014 1.66667,0.001 1.66667,10e-4 v 1.90146 1.90145 l -30.92611,17.67873 -30.92611,17.67874 3.25944,0.96497 3.25944,0.96497 35.29278,1.5571 35.29276,1.55709 1.04057,0.64309 1.04056,0.64311 v 1.07359 1.07358 l -23.33333,17.08559 -23.33334,17.08557 v 1.03645 1.03646 l 29.33334,25.4814 29.33333,25.48141 v 1.24429 1.24428 h -1.08793 -1.08795 l -20.57872,-6.02088 -20.57873,-6.02088 -2.49108,-0.7857 -2.4911,-0.78571 0.4911,1.39768 0.49108,1.39769 32.5751,27.74223 32.57513,27.74224 0.47337,1.47878 0.47337,1.47879 -6.23458,0.85455 -6.23458,0.85454 h -24.74724 -24.74724 l 1.26667,1.25499 1.26666,1.25499 33.33334,14.87361 33.33333,14.87361 1.24444,1.18252 1.24446,1.18251 -0.73292,0.73291 -0.73292,0.73292 -37.08529,10.59638 -37.08528,10.5964 -1.18425,1.18426 -1.18425,1.18425 37.758,34.91356 37.75801,34.91356 1.28618,1.86448 1.28617,1.86448 -0.72223,0.72224 -0.72224,0.72222 -26.22629,-4.65828 -26.22631,-4.65749 h -3.33764 -3.33764 v 0.71227 0.71226 l 21.33333,93.74346 21.33334,93.74346 v 2.21095 2.21093 h -1.51776 -1.51776 l -34.14891,-18.19335 -34.14891,-18.19336 -9.66666,-5.26049 -9.66667,-5.26049 0.0484,1.78717 0.0484,1.78719 30.64607,38.5722 30.64608,38.57221 -1.18198,1.18197 -1.18198,1.18199 -29.17915,3.21819 -29.17915,3.2182 -2.33333,0.0276 -2.33336,0.0276 v 2.82881 2.82881 l 7.33333,27.6757 7.33334,27.6757 v 2.0835 2.0834 l -1,0.5906 -1,0.5905 -16.66667,-2.4773 -16.66667,-2.4773 -3.66667,-0.034 -3.66666,-0.035 v 1.6997 1.6996 l 11.25812,31.216 11.25813,31.2161 -0.67014,1.0843 -0.67015,1.0843 h -42.98694 -42.98693 l -14.50304,33 -14.50306,33 -1.69774,1.8855 -1.69775,1.8854 -2.18213,-1.811 -2.18214,-1.811 -8.05138,-10.4078 -8.05139,-10.4078 h -1.50032 -1.50032 l -27.99975,39.9608 -27.99974,39.9607 -2.04788,0.039 -2.04788,0.039 -12.45549,-14.3333 -12.45546,-14.3333 -1.59535,-0.935 -1.59535,-0.9349 -34.92437,34.0687 -34.92437,34.0687 -1.93095,-0.7409 -1.93095,-0.741 -8.37931,-12.6946 -8.37932,-12.6946 -1.50205,-0.032 -1.50205,-0.032 -15.28362,33.5952 -15.28362,33.5953 -1.45739,0.4857 -1.45739,0.4858 -1.2566,-2.4143 z m -149.28459,-142.376 4.36064,-53.295 3.70079,-3.7859 3.7008,-3.7859 13.43491,-26.8442 13.4349,-26.8442 1.04712,1.9251 1.04712,1.9251 2.97239,18 2.97239,18 1.22504,2.3333 1.22504,2.3333 h 2.50105 2.50105 l 22.45203,-8.753 22.45204,-8.753 3.33334,-2.247 3.33333,-2.247 20.66667,-10.6965 20.66666,-10.6965 v -1.8846 -1.8845 L 476.50851,1024.7522 456.35034,1010 l -15.17517,-14.15805 -15.17516,-14.15803 -4.66574,-4.06512 -4.66575,-4.0651 0.81737,-0.81738 0.81738,-0.81737 19.84837,8.19349 19.84838,8.1935 21.78053,-1.31648 21.78055,-1.31648 21.08794,1.39872 21.08795,1.39872 20.28454,-8.30443 20.28452,-8.30444 0.76384,0.76385 0.76385,0.76384 -9.91687,8.93188 -9.91685,8.93187 -10.66667,10.14281 -10.66667,10.1428 -18.79813,13.5175 -18.79813,13.5175 -1.56264,1.8829 -1.56264,1.8828 21.6941,11.054 21.69411,11.0539 3.33333,2.4377 3.33334,2.4377 22.66667,8.6687 22.66666,8.6687 h 2.25464 2.25466 l 0.81913,-1.3254 0.81913,-1.3254 3.77952,-20.0835 3.77952,-20.0834 0.71615,-0.7162 0.71613,-0.7161 13.62738,27.0491 13.62737,27.049 3.37013,3.3702 3.37014,3.3701 4.37405,50.0391 4.37407,50.0391 0.0589,7.9524 0.0589,7.9524 1.87298,-1.9524 1.87299,-1.9524 26.21276,-37.3333 26.21276,-37.3333 2.40705,-0.4033 2.40704,-0.4033 9.6253,12.07 9.6253,12.0699 h 0.94752 0.94754 l 14.5182,-33 14.51821,-33 1.41618,-1.874 1.41617,-1.8741 41.45344,0.8651 41.45344,0.865 0.69579,-0.6958 0.69577,-0.6957 -11.63811,-32.2953 -11.63809,-32.2952 0.63153,-1.6667 0.63154,-1.6666 4.19068,0.015 4.19068,0.015 16.61004,2.5592 16.61005,2.5592 0.90315,-0.5581 0.90315,-0.5582 -5.88968,-22.3495 -5.88968,-22.3495 -2.21635,-9.00718 -2.21635,-9.00716 1.25951,-1.22778 1.25949,-1.22778 30,-2.98302 30,-2.98302 1.08019,-0.92889 1.08019,-0.92888 -31.46842,-39.68848 -31.46841,-39.68847 0.47156,-1.41466 0.47156,-1.41468 1.25,-0.37946 1.25,-0.37945 44.64653,23.8718 44.64655,23.87181 0.54596,-0.54596 0.54595,-0.54596 -2.35977,-6.179 -2.35979,-6.179 -26.49926,-49.98253 -26.49938,-49.98381 v -2.48009 -2.4801 l 7.87184,-31.72014 7.87184,-31.72016 -0.31362,-8.66667 -0.31362,-8.66666 -7.03434,-24.66667 -7.03434,-24.66667 -1.85722,-2.95309 -1.85721,-2.95308 v -1.96823 -1.96822 l 1.63583,-1.01099 1.63582,-1.011 35.17663,-10.06769 35.17663,-10.0677 0.18755,-1.13984 0.18754,-1.13984 -33.95677,-15.21693 -33.95676,-15.21692 -1.36543,-1.36543 -1.36541,-1.36541 1.98885,-1.2574 1.98885,-1.25739 30.53999,-0.0204 30.53999,-0.0204 -2.44501,-2.7017 -2.44502,-2.70171 -31.76164,-26.88134 -31.76164,-26.88131 v -1.75032 -1.75032 h 1.08391 1.0839 l 20.42382,6.06419 20.42381,6.06417 1.89019,-0.39751 1.89018,-0.39752 -27.63725,-24 -27.63725,-24 -0.48794,-1.51516 -0.48792,-1.51516 22.39394,-16.39888 22.39394,-16.39886 0.62806,-0.4918 0.62805,-0.4918 -1.64757,-1.01826 -1.64756,-1.01823 -36.9805,-1.70983 -36.98048,-1.70981 -1.06474,-0.65147 -1.06475,-0.65148 1.45049,-1.74773 1.4505,-1.74774 29.94762,-17.06686 29.94762,-17.06686 -1.00004,-0.96661 -1.00003,-0.96661 -35.7066,-2.71275 -35.70659,-2.71273 -1.31516,-0.81282 -1.31515,-0.81281 0.78259,-1.26625 0.78259,-1.26626 29.66393,-19.88018 29.66392,-19.8802 1.61327,-1.94387 1.61327,-1.94385 -16.03804,-18.47871 -16.03803,-18.47869 v -2.03795 -2.03794 l 13,-6.49232 13,-6.49232 -1.45389,-0.51544 -1.45388,-0.51546 -30.34198,4.04019 -30.34197,4.04019 h -5.1734 -5.1734 l -1.97494,3.01412 -1.97492,3.01412 -6.85392,16.65254 -6.85392,16.65255 -1.20189,1.26666 -1.20189,1.26667 v -1.3048 -1.3048 l -5.07406,-28.62853 -5.07405,-28.62853 0.52513,-40.25071 0.52514,-40.25071 12.88225,-2.83312 12.88225,-2.83312 5.18214,-1.58284 5.18214,-1.58284 16.48452,-49.25031 16.48454,-49.25033 v -3.77708 -3.77709 L 858.49786,85.959735 852.99568,63.97429 827.07807,38.653812 801.16045,13.333333 h -1.99598 -1.99598 l -12.2509,3.470137 -12.2509,3.470137 -2.81816,1.774791 -2.81817,1.774791 -11.63055,20.137634 -11.63056,20.137634 -55.34017,59.617433 -55.34017,59.61744 -6.95745,6.86892 -6.95745,6.86892 -26.587,-6.48125 -26.58699,-6.48127 -0.92333,-0.0543 -0.92334,-0.0544 -12.19202,22.66667 -12.19203,22.66666 h -1.23531 -1.23529 l -2.66616,-5.66666 -2.66616,-5.66667 -5.67228,-14 -5.67228,-14 -1.31091,0.40316 -1.31089,0.40315 -7.51354,21.59685 -7.51352,21.59684 h -1.65428 -1.65428 L 492.00002,211.99999 484.33563,190 l -1.1678,0.18609 -1.16781,0.18609 -8,19.04733 -8,19.04732 -1.50546,0.49063 -1.50545,0.49061 -11.49568,-21.22838 -11.49568,-21.2284 -1.68704,-1.40011 -1.68703,-1.4001 -26.57519,6.43073 -26.57517,6.43073 -6.94801,-6.8596 -6.94802,-6.85961 -55.31649,-59.57687 -55.31648,-59.576867 -11.65399,-20.178202 -11.65399,-20.178202 -2.81817,-1.774791 -2.81816,-1.774791 -12.2509,-3.470137 -12.2509,-3.470137 h -1.96094 -1.96093 l -26.104,25.666666 -26.104,25.666666 -6.00554,23.717711 -6.00554,23.717714 17.12489,50.94895 17.12491,50.94895 5.19648,1.58284 5.19647,1.58284 12.89642,2.83635 12.89642,2.83635 0.50157,40.24748 0.50159,40.24748 -4.4616,25.33333 -4.4616,25.33333 -0.77323,4.30685 -0.77323,4.30687 -0.96914,-0.59897 -0.96915,-0.59896 -7.72968,-18.76927 -7.72968,-18.76925 -2.13101,-1.09416 -2.13102,-1.09416 -10.66666,-0.92652 -10.66667,-0.92653 -23.8161,-3.31259 -23.81609,-3.31257 -1.51724,0.53656 -1.51724,0.53656 13,6.49232 13,6.49232 v 2.03794 2.03795 l -16.03803,18.47869 -16.038033,18.47871 1.704693,2.056 1.7047,2.05601 29.54794,19.72831 29.54793,19.7283 0.80715,1.306 0.80715,1.30599 -1.31515,0.81281 -1.31516,0.81282 -35.70659,2.71273 -35.7066,2.71275 -1.000034,0.96661 -1.000032,0.96661 30.133856,17.173 30.13386,17.17299 0.69756,1.81781 0.69756,1.81782 -0.49805,0.47968 -0.49805,0.47969 -36.98049,1.70539 -36.980486,1.7054 -1.647567,1.01823 -1.647567,1.01826 0.628052,0.49894 0.628054,0.49896 L 93.66667,485.22707 116,501.60124 v 1.14797 1.14798 l -28.049558,24.38473 -28.049563,24.38473 1.716228,0.36308 1.716228,0.36308 20.57873,-6.02974 20.578735,-6.02975 h 1.08793 1.08794 v 1.68631 1.6863 L 74.873885,571.68567 43.0811,598.6654 l -2.413867,2.66729 -2.413865,2.66729 30.539984,0.0204 30.539985,0.0204 1.988853,1.25739 1.98886,1.2574 -1.36542,1.36541 -1.36542,1.36543 -33.524984,15.02343 -33.524984,15.02344 -0.19767,1.33333 -0.19767,1.33333 35.130056,10.0677 35.130062,10.06769 1.63582,1.011 1.63583,1.01099 v 1.96822 1.96823 l -1.86335,2.95308 -1.86335,2.95309 -7.307517,26 -7.307518,26 -0.08983,7.12916 -0.08983,7.12916 7.927359,31.92433 L 104,804.10691 v 2.37408 2.37407 l -27.129944,51.23911 -27.129944,51.2391 -1.669609,5.08933 -1.669609,5.08934 0.486348,0.48636 0.486349,0.48634 44.646539,-23.87181 44.64654,-23.8718 1.25,0.37945 1.25,0.37946 0.47156,1.41468 0.47156,1.41466 -31.46842,39.68847 -31.468415,39.68848 1.080189,0.92888 1.080189,0.92889 29.999997,2.98302 30.00001,2.98302 1.23606,1.20435 1.23606,1.20433 -1.52663,6.36395 -1.52661,6.36393 -6.57332,25.0054 -6.57332,25.0055 0.9205,0.5689 0.9205,0.5689 16.61005,-2.5592 16.61004,-2.5592 4.33333,-0.015 4.33334,-0.015 v 2.9874 2.9873 l -10.57933,29.346 -10.57934,29.346 -0.42067,2 -0.42066,2 h 42.66493 42.66494 l 15.29494,34.3333 15.29494,34.3334 h 0.89515 0.89513 l 9.47867,-12 9.47866,-12 h 2.34266 2.34265 l 16.59029,23.6666 16.5903,23.6667 11.40004,16 11.40004,16 0.30602,-4.6667 0.30604,-4.6666 z M 239.04878,994.29568 217.4309,976.66664 l -0.87553,-3.06194 -0.87555,-3.06194 4.85045,-38.93806 4.85044,-38.93806 -0.0237,-1 -0.0236,-1 h -1.37141 -1.37142 l -12.29525,7.69527 -12.29525,7.69527 -9.65622,5.78473 -9.65622,5.78472 -1.85694,-0.71257 -1.85694,-0.71258 -14.88572,-19.10074 -14.88574,-19.10076 2.06048,-0.43012 2.06048,-0.43012 34.33842,4.83873 34.3384,4.83875 3.65841,1.18581 3.65841,1.18581 1.16664,-2.2611 1.16664,-2.2611 2.89651,-27.99999 2.89651,-28 1.38549,-5.17867 1.38549,-5.17867 -1.80121,-1.80121 -1.80121,-1.80121 -37.81846,-20.02012 -37.81844,-20.02012 h -1.07537 -1.07537 l -0.87524,-1.41618 -0.87524,-1.41617 0.1906,-32.25017 0.1906,-32.25017 3.14793,-6.66699 3.14793,-6.66699 3.44923,-7.81269 3.44923,-7.81269 1.76785,0.67838 1.76785,0.67839 25.39591,8.13431 25.39591,8.1343 h 3.36905 3.36904 l 0.80932,-2.10905 0.80932,-2.10904 0.0327,-7.55763 0.0325,-7.55761 1.41277,-6 1.41278,-6 0.0436,-14.66667 0.0436,-14.66666 1.16366,-1.45306 1.16367,-1.45304 6.56147,-15.84054 6.56146,-15.84055 1.11923,-0.35419 1.11923,-0.35418 17.98852,29.36285 17.98851,29.36285 2.67816,3.28238 2.67814,3.28237 13.33334,3.98735 13.33333,3.98736 2.33333,0.0152 2.33334,0.0152 v -1.57076 -1.57076 l -12.28398,-30.09591 -12.28396,-30.09591 -15.8015,-29.05545 -15.8015,-29.05544 0.4188,-2.8356 0.4188,-2.8356 15.96642,-6.54305 15.9664,-6.54307 0.40746,1.22239 0.40747,1.22239 6.52284,10.54505 6.52284,10.54505 6.67721,7.44296 6.67723,7.44298 8.13903,3.65257 8.13902,3.65259 8.59121,1.33752 8.5912,1.33752 23.02917,10.56376 23.02917,10.56375 2.05894,-2.47233 2.05892,-2.47232 3.03728,-20.36162 3.03728,-20.36163 -1.18582,-1.18581 -1.18581,-1.18582 -10.83176,-0.83529 -10.83177,-0.83528 -7.413,-16.80844 -7.413,-16.80844 -8.5954,-25.75151 -8.5954,-25.75149 7.59644,-7.06825 7.59644,-7.06825 17.95276,-16.18026 17.95276,-16.18024 h 1.60873 1.60872 l 18.10519,24.93631 18.10517,24.9363 0.0247,6.73036 0.0247,6.73036 -1.52273,30 -1.52275,30 3.50018,60.66667 3.50017,60.66666 -1.25518,7.33334 -1.25518,7.33333 -14.74687,59.5584 -14.74697,59.55841 v 1.44159 1.4416 h 1.85161 1.85162 l 20.81226,-8.66667 20.81227,-8.66667 h 2.09044 2.09044 l 2.85523,1.52807 2.85523,1.52807 9.72378,7.19108 9.72379,7.19109 v 0.79971 0.79972 l -21.1482,-0.9475 -21.14819,-0.94749 -3.41648,3.09529 -3.41647,3.0953 -11.35018,12.92854 -11.35018,12.92855 -1.26672,2.40479 -1.26672,2.40478 2.43308,24.45084 2.4331,24.45083 1.98504,8.21584 1.98504,8.21582 0.85306,10.66667 0.85307,10.66667 -2.96873,1.81064 -2.96874,1.81062 -30.78756,3.17095 -30.78756,3.17093 -20.66667,4.49306 -20.66666,4.49304 -24.90958,5.05746 -24.90956,5.05747 -1.61677,0.99923 -1.61677,0.99921 -4.14032,27.03043 -4.14034,27.03048 -1.33333,0.4006 -1.33333,0.4006 z m 124.95123,-65.73765 v -2.10863 l -8.66366,-31.97342 -8.66367,-31.97343 -1.54484,-2.91796 -1.54484,-2.91794 -7.96608,-9.77551 -7.96608,-9.77551 -1.84239,-0.707 -1.8424,-0.70698 -1.64968,1.35944 -1.64969,1.35944 -30.66667,-6.50682 -30.66667,-6.50681 -1.26212,0.38392 -1.26212,0.38391 17.92879,9.42932 17.92879,9.4293 10.97376,5.485 10.97377,5.485 2.81221,5.51242 2.81223,5.51241 18.06053,28.15257 18.06053,28.15256 2.57761,3.66667 2.57761,3.66666 h 1.24254 1.24254 z m -26.59669,-117.53512 10.70169,-22.31038 0.76271,-3.03887 0.7627,-3.03885 -40.89336,-20.12815 -40.89336,-20.12815 -0.75902,0.75903 -0.75903,0.75901 19.09437,29.71839 19.09438,29.71837 9.73454,15 9.73455,15 h 1.35907 1.35906 z m 63.4066,-85.5877 37.19009,-40.56477 5.16431,-5.82648 5.16429,-5.82648 -0.55252,-0.55252 -0.55252,-0.55252 -47.9451,7.45866 -47.94512,7.45867 -1.08309,0.96819 -1.08309,0.9682 1.53676,41.85024 1.53678,41.85025 0.60308,1.92362 0.60308,1.92364 5.08648,-5.25697 5.08648,-5.25696 z M 238.66667,687.99998 v -1.33333 h -1.33333 -1.33333 v 1.33333 1.33334 h 1.33333 1.33333 z m 496.39731,295.81457 -4.17328,-26.85208 -1.49477,-0.92383 -1.49477,-0.92381 -37.61723,-7.66344 -37.61724,-7.66344 -7.67351,-1.93227 -7.67352,-1.93226 -31.18813,-3.1741 -31.18814,-3.1741 -2.80502,-1.5012 -2.80502,-1.5012 0.0237,-2.95308 0.0237,-2.9531 1.22933,-11.68324 1.22935,-11.68325 1.49911,-4.31675 1.49912,-4.31676 2.38649,-24.66666 2.38648,-24.66667 -1.22377,-2.40478 -1.22379,-2.40479 -11.35017,-12.92855 -11.35019,-12.92854 -3.38395,-3.06732 -3.38395,-3.06731 -21.18072,0.93081 -21.18072,0.93083 0.0584,-1.19684 0.0584,-1.19684 11.86254,-8.33333 11.86252,-8.33334 h 2.74856 2.74856 l 20.81227,8.66667 20.81226,8.66667 h 1.85162 1.85161 v -1.33596 -1.33598 l -15.16637,-61.66402 -15.16638,-61.66404 -0.85191,-6 -0.85189,-6 2.71132,-46.66667 2.71132,-46.66666 0.69938,-19.33333 0.69937,-19.33334 -1.74239,-29.0346 -1.74237,-29.0346 0.92905,-2.5115 0.92907,-2.5115 17.49405,-24.12055 17.49388,-24.12058 h 1.62296 1.62296 l 17.97056,16.19743 17.97056,16.19741 7.59644,7.05108 7.59644,7.05108 -8.5954,25.75149 -8.5954,25.75151 -7.413,16.80844 -7.413,16.80844 -10.83177,0.83528 -10.83176,0.83529 -1.25325,1.25326 -1.25327,1.25326 3.09303,20.27974 3.09302,20.27972 2.07063,2.49061 2.07063,2.49061 22.7652,-10.48956 22.76518,-10.48957 9.23482,-1.59789 9.2348,-1.5979 7.7594,-3.47024 7.7594,-3.47022 6.66332,-7.44298 6.66333,-7.44296 6.79522,-11.33333 6.79521,-11.33333 0.29879,-0.40562 0.29878,-0.40561 15.8166,6.60099 15.81662,6.601 0.4188,2.74917 0.4188,2.74917 -16.00496,29.4134 -16.00498,29.4134 -12.0805,29.68096 -12.0805,29.68096 v 1.62776 1.62775 h 2.28364 2.28363 l 13.92277,-4.27495 13.92278,-4.27495 6.12692,-9.42305 6.12693,-9.42307 14,-22.95509 14,-22.95508 1.11923,0.35949 1.11923,0.35951 6.56146,15.84055 6.56147,15.84054 1.50036,1.80782 1.50036,1.80782 -0.85333,7.26058 -0.85334,7.26056 2.67212,21.05133 2.67212,21.05132 1.6e-4,1.66667 1.6e-4,1.66666 3.66667,-0.0241 3.66667,-0.0241 26.21289,-8.46232 26.21288,-8.46231 1.33904,0.82756 1.33903,0.82757 4.93042,11.32556 4.93043,11.32556 1.18432,1.26667 1.18432,1.26667 v 33.77517 33.77518 l -2.31721,0.8892 -2.31722,0.8892 -37.34945,19.78891 -37.34945,19.78891 -1.73948,1.73381 -1.73947,1.7338 1.37339,5.87957 1.3734,5.87958 2.85105,27.33333 2.85105,27.33333 1.16463,2.21377 1.16461,2.21378 4.3504,-1.2054 4.35042,-1.20542 33.09241,-4.75565 33.09241,-4.75567 2.61094,0.41396 2.61093,0.41396 -15.42225,19.66667 -15.42226,19.66667 h -1.56105 -1.56107 l -22.3954,-13.54686 -22.3954,-13.54685 -0.78141,0.78141 -0.78141,0.78142 5.00873,39.90081 5.00872,39.90083 -0.82703,2.1552 -0.82702,2.15518 -20.9853,17.3761 -20.98529,17.37606 h -2.121 -2.12102 z m -73.33522,-84.59183 19.72873,-30.55608 3.19361,-6.13575 3.19362,-6.13576 28.82752,-15.00327 28.82752,-15.00325 -0.5715,-0.5715 -0.57148,-0.57149 -31.08956,6.62657 -31.08956,6.62656 -2.4497,-1.31104 -2.44971,-1.31105 -1.26265,0.78036 -1.26266,0.78036 -7.83461,9.61464 -7.83463,9.61463 -1.53328,2.89634 -1.53328,2.89636 -8.67523,31.76401 -8.67522,31.76402 v 2.45074 2.45075 l 1.66666,-0.55503 1.66667,-0.55504 z m 25.31282,-78.88941 8.42531,-13 20.44287,-31.71258 20.44288,-31.71259 -0.78106,-0.78104 -0.78105,-0.78105 -38.39525,18.81764 -38.39526,18.81764 -2,1.19697 -2,1.19697 0.22318,3.1457 0.22316,3.14568 10.70606,22.33333 10.70607,22.33333 h 1.37889 1.37891 z m -35.19689,-88.72741 1.57096,-42.39406 -0.66887,-1.08227 -0.66888,-1.08225 -6.37227,-0.805 -6.37228,-0.805 -41.92134,-6.68622 -41.92134,-6.68621 -0.60362,0.60363 -0.60363,0.60362 10.52497,11.6274 10.52496,11.6274 24.66667,26.79276 24.66667,26.79277 11.8799,12.99718 11.87991,12.99718 0.92361,-1.05342 0.92362,-1.05343 z m 103.43172,-22.18045 0.76711,-1.2412 -1.35508,-0.83749 -1.35508,-0.83748 v 2.07868 2.07869 h 0.58797 0.58799 z m 15.39028,-14.09213 -1.65985,-2 h -1.33333 -1.33334 l 1.65986,2 1.65985,2 h 1.33333 1.33334 z m -473.58292,-168.30089 -2.05492,-2.36578 -10.82909,-16.26617 -10.82908,-16.26619 1.12605,-0.69594 1.12605,-0.69594 38.40124,-10.04748 38.40125,-10.04746 0.63368,0.63368 0.63369,0.63368 -9.84632,10.93304 -9.84631,10.93304 -16,17.34002 -16,17.34004 -1.43065,0.46862 -1.43067,0.46861 z m 384.24959,-19.23772 -19.33334,-21.38766 -6.49445,-7.26464 -6.49444,-7.26464 0.57656,-0.57656 0.57656,-0.57657 38.58456,10.05684 38.58455,10.05684 0.89072,0.91416 0.89073,0.91417 -12.26365,17.98936 -12.26364,17.98938 -1.96042,0.26848 -1.96041,0.26848 z m -432.40581,-176.72997 -0.64318,-1.06475 -16.14094,-49.33333 -16.14093,-49.33333 -2.17068,-4.92667 -2.17068,-4.92667 22.27103,-24.07333 22.27101,-24.07333 13.56508,0.16339 13.56508,0.16337 13.51419,0.83663 13.51419,0.83661 11.48581,14.50201 11.48581,14.50201 -0.0887,0.83132 -0.0887,0.83132 -12.9114,36.03755 -12.9114,36.03755 -26.66667,25.30466 -26.66666,25.30467 -2.21463,1.72253 -2.21463,1.72254 -0.6432,-1.06475 z m 474.87865,-25.88139 -28.47284,-27.07093 -0.96592,-2.05621 -0.96592,-2.05622 -11.50679,-32.66666 -11.5068,-32.66667 -0.62627,-2.11717 -0.62626,-2.11716 11.52372,-14.54951 11.52372,-14.54949 13.57526,-0.83661 13.57526,-0.83663 13.55916,-0.16337 13.55916,-0.16339 22.20753,24.11107 22.20755,24.11106 -1.03136,2.22227 -1.03136,2.22226 -17.20159,52 -17.20158,52 -1.06091,1.12716 -1.06091,1.12715 z m -566.91209,-16.50202 -0.44901,-1.348 -21.62555,-12.9364 -21.62554,-12.93642 0.64765,2.26975 0.64765,2.26973 3.70013,18.18902 3.70013,18.18902 17.72677,-6.17434 17.72677,-6.17436 z m 727.74464,-5.73798 3.54575,-17.7233 -0.42558,-1.24604 -0.42556,-1.24604 -20.61636,12.48509 -20.61636,12.48509 -0.40665,1.21998 -0.40667,1.21997 17.02303,6.06724 17.02301,6.06723 0.87983,-0.80295 0.87981,-0.80296 z"
         id="path1507275" />
      <path
         style="fill:#4e7070;stroke-width:1.33333"
         d="m 333.26664,1203.3333 -11.40004,-16 -16.5903,-23.6667 L 288.68601,1140 h -2.34265 -2.34266 l -9.47866,12 -9.47867,12 h -0.89513 -0.89515 l -15.29494,-34.3334 -15.29494,-34.3333 h -42.66494 -42.66493 l 0.42066,-2 0.42067,-2 10.57934,-29.346 10.57933,-29.346 v -2.9873 -2.9874 l -4.33333,0.015 -4.33334,0.015 -16.61004,2.5592 -16.61005,2.5592 -0.9205,-0.5689 -0.92049,-0.5689 6.57331,-25.0054 6.57332,-25.00547 1.52661,-6.36393 1.52663,-6.36395 -1.23606,-1.20433 -1.23606,-1.20435 -30,-2.98303 -30.000004,-2.98301 -1.080189,-0.92889 -1.08019,-0.92888 31.468413,-39.68848 31.46842,-39.68847 -0.47156,-1.41467 -0.47156,-1.41468 -1.25,-0.37945 -1.25,-0.37945 -44.646538,23.8718 -44.646538,23.87181 -0.48635,-0.48635 -0.486348,-0.48636 1.66961,-5.08933 1.669609,-5.08932 27.129944,-51.2391 L 104,808.8551 v -2.37407 -2.37408 l -7.927357,-31.92432 -7.927359,-31.92433 0.08983,-7.12916 0.08983,-7.12916 7.307517,-26 7.307519,-26 1.86335,-2.95309 1.86335,-2.95308 v -1.96823 -1.96822 l -1.63583,-1.01099 -1.63582,-1.011 -35.130066,-10.06769 -35.130056,-10.0677 0.19767,-1.33333 0.19767,-1.33333 33.524984,-15.02344 33.524988,-15.02343 1.36542,-1.36543 1.36542,-1.36541 -1.98886,-1.2574 -1.988857,-1.25739 2.333337,-0.0204 2.33333,-0.0204 0.0543,1.66667 0.0543,1.66667 -0.10559,24.2301 -0.10557,24.23011 0.8383,3.34008 0.83831,3.34008 1.74442,0.6694 1.74443,0.6694 59.80191,-14.7214 59.80192,-14.72141 2.1422,-2.18484 2.14219,-2.18486 5.72137,-14.66666 5.72137,-14.66667 2.456,-4.1351 2.456,-4.1351 7.41128,-20.41613 7.41128,-20.41615 -0.39752,-2.66038 -0.3975,-2.66039 -4,-0.31901 -4,-0.31902 -70.66667,-3.01066 L 114,539.58404 l -1.20079,-1.05948 -1.20078,-1.05948 2.20895,-14.27993 2.20895,-14.27995 -0.57483,-0.57483 -0.57483,-0.57482 -1.97448,1.12222 -1.97448,1.12222 -23.486551,20.41585 -23.486546,20.41584 0.773048,1.25083 0.773048,1.25081 h -3.041652 -3.041652 l 2.629629,-2.46681 2.629635,-2.46682 L 90.333336,526.11301 116,503.82633 v -1.11254 -1.11255 l -22.33333,-16.37417 -22.333334,-16.37418 -0.628054,-0.49896 -0.628052,-0.49894 1.647567,-1.01826 1.647567,-1.01823 36.980486,-1.7054 36.98049,-1.70539 0.6162,-0.59783 0.61618,-0.59784 -1.75718,-2.8137 -1.7572,-2.81371 3.65245,2.87301 3.65244,2.87302 4.15523,-2.5118 4.15521,-2.51179 31.80826,-18.15355 31.80825,-18.15353 h 1.73047 1.73048 l 21.56328,34 21.56327,34 h 1.86793 1.86792 l 40.72681,-10.66667 40.72682,-10.66667 h 0.63659 0.6366 v -1.73042 -1.73043 l -23.3133,-31.93624 -23.31329,-31.93624 -0.02,-1.08985 -0.02,-1.08985 2.33333,0.67421 2.33333,0.6742 47.33334,10.2302 47.33333,10.2302 2.66667,0.49907 2.66667,0.49906 18,24.90507 18,24.90505 1.59073,2.88844 1.59072,2.88845 -2.11862,37.5872 -2.11863,37.58719 0.95832,0.95832 0.95831,0.95831 6.87616,-7.3193 6.87617,-7.3193 17.71683,-18.57316 17.71684,-18.57318 16.2836,17.23984 16.28361,17.23983 8.26951,8.64569 8.2695,8.6457 0.94412,-0.94412 0.94413,-0.94412 -2.12585,-37.57076 -2.12584,-37.57078 1.41691,-2.6475 1.41691,-2.64751 17.91023,-24.81662 17.91024,-24.81664 2.94472,-0.88591 2.94472,-0.88589 49.31022,-10.69278 49.31022,-10.69276 0.50236,0.50236 0.50236,0.50236 -8.45099,11.74298 -8.45098,11.74297 -15.02827,20.46413 -15.02834,20.46414 v 1.8692 1.86919 h 0.66988 0.6699 l 40.92421,10.71422 40.92423,10.71421 1.93123,-0.38088 1.93122,-0.38088 20.92413,-33.33333 20.92412,-33.33333 1.98149,-0.38571 1.98149,-0.38569 35.90239,20.55714 35.90239,20.55715 4,-2.75687 4,-2.75685 -2.42019,2.78637 -2.4202,2.78639 1.08687,0.66513 1.08685,0.66514 36.98048,1.70981 36.9805,1.70983 1.64756,1.01823 1.64757,1.01826 -0.62805,0.4918 -0.62806,0.4918 -22.39394,16.39886 -22.39394,16.39888 0.48792,1.51516 0.48794,1.51516 27.63725,24 27.63725,24 -1.89018,0.39752 -1.89019,0.39751 -20.42381,-6.06417 -20.42382,-6.06419 h -1.0839 -1.08391 v 1.56168 1.56168 l 2.3238,2.77165 2.32379,2.77166 -3.65712,-3.23242 -3.65714,-3.23242 v -1.76758 -1.76758 h 2.41946 2.41945 l 19.89396,5.90881 19.89396,5.9088 0.44089,-0.44089 0.4409,-0.44088 -23.5465,-20.46792 -23.54649,-20.46792 -1.97448,-1.12222 -1.97449,-1.12222 -0.58599,0.58598 -0.58599,0.58599 2.28482,14.20408 2.2848,14.20409 -1.26548,1.1233 -1.26548,1.12329 -70.66667,2.98299 -70.66667,2.98298 -4,0.33623 -4,0.33624 -0.41824,2.82988 -0.41824,2.82988 7.51637,20.39308 7.51638,20.39309 2.37164,4 2.37162,4 5.72138,14.66667 5.72137,14.66666 2.14219,2.18486 2.1422,2.18484 59.99773,14.7698 59.99772,14.76981 2.00228,-2.00097 2.00227,-2.00098 0.31543,-26.95368 0.31544,-26.95368 0.0179,-1 0.0179,-1 2.33333,0.0204 2.33333,0.0204 -1.98885,1.25739 -1.98885,1.2574 1.36541,1.36541 1.36543,1.36543 33.95676,15.21692 33.95677,15.21693 -0.18754,1.13984 -0.18755,1.13984 -35.17663,10.0677 -35.17663,10.06769 -1.63582,1.011 -1.63583,1.01099 v 1.96822 1.96823 l 1.85721,2.95308 1.85722,2.95309 7.03434,24.66667 7.03434,24.66667 0.31362,8.66666 0.31362,8.66667 -7.87184,31.72016 -7.87184,31.72014 v 2.4801 2.48009 l 26.49938,49.98381 26.49938,49.98381 2.35979,6.179 2.35977,6.179 -0.54595,0.54596 -0.54596,0.54596 -44.64655,-23.87181 -44.64653,-23.8718 -1.25,0.37945 -1.25,0.37946 -0.47156,1.41468 -0.47156,1.41466 31.46841,39.68847 31.46842,39.68848 -1.08019,0.92888 -1.08019,0.92889 -30,2.98302 -30,2.98302 -1.25949,1.22778 -1.25951,1.22778 2.21635,9.00716 2.21635,9.00718 5.88968,22.34946 5.88968,22.3495 -0.90315,0.5582 -0.90315,0.5582 -16.61005,-2.5592 -16.61004,-2.5592 -4.19068,-0.015 -4.19068,-0.015 -0.63154,1.6667 -0.63153,1.6666 11.63809,32.2953 11.63811,32.2952 -0.69577,0.6958 -0.69579,0.6957 -41.45344,-0.865 -41.45344,-0.865 -1.41617,1.874 -1.41618,1.874 -14.51821,33 -14.5182,33 h -0.94754 -0.94752 l -9.6253,-12.0699 -9.6253,-12.0699 -2.40704,0.4032 -2.40705,0.4033 -26.21276,37.3333 -26.21276,37.3334 -1.87299,1.9524 -1.87298,1.9523 -0.0589,-7.9523 -0.0589,-7.9524 -4.37407,-50.0391 -4.37405,-50.0391 -3.37014,-3.3702 -3.37013,-3.3701 -13.62737,-27.0491 -13.62738,-27.0491 -0.71613,0.7162 -0.71615,0.7161 -3.77952,20.0835 -3.77952,20.0834 -0.81913,1.3254 -0.81913,1.3254 h -2.25466 -2.25464 l -22.66666,-8.6688 -22.66667,-8.6687 -3.33334,-2.4377 -3.33333,-2.4377 -21.69411,-11.0539 -21.6941,-11.0539 1.56264,-1.8829 1.56264,-1.8828 18.79813,-13.5176 18.79813,-13.5174 10.66667,-10.1429 10.66667,-10.14277 9.91685,-8.93187 9.91687,-8.93188 -0.77021,-0.7702 -0.7702,-0.77021 -19.66072,8.07557 -19.66085,8.07434 -10.1526,-0.22559 -10.1526,-0.2256 10.66667,-0.77875 10.66667,-0.77874 2.66666,-1.69914 2.66667,-1.69914 17.25519,-7.0621 17.2552,-7.0621 0.41632,-1.24895 0.41631,-1.24895 -11.43299,-3.9631 -11.433,-3.96311 -1.26792,-1.52775 -1.26792,-1.52774 4.02941,-10.46422 4.0294,-10.4642 v -2.36374 -2.36375 h -1.2506 -1.25058 l -9.08275,2.02313 -9.08274,2.02314 -3,0.66893 -3,0.66893 0.0133,-1.69206 0.0133,-1.69207 15.16747,-20.50472 15.16745,-20.50471 0.77688,-7.49529 0.77688,-7.49528 1.64398,-16.66666 1.64397,-16.66667 0.49353,2.31839 0.49354,2.31837 -2.1957,22.29097 -2.19569,22.29097 -1.23477,2.3072 -1.23478,2.30719 -1.30798,12.41679 -1.30798,12.41678 -0.0231,2.9531 -0.0231,2.95308 2.80501,1.5012 2.80503,1.5012 31.18813,3.1741 31.18814,3.1741 7.67352,1.93226 7.67351,1.93227 37.61724,7.66344 37.61722,7.66344 1.49478,0.92381 1.49477,0.92383 4.17328,26.85208 4.17328,26.85205 h 2.12101 2.121 l 20.9853,-17.37605 20.98529,-17.37609 0.82703,-2.15519 0.82703,-2.1552 -5.00872,-39.90083 -5.00874,-39.90081 0.78142,-0.78141 0.78141,-0.78142 22.3954,13.54686 22.3954,13.54685 h 1.56107 1.56105 l 15.42225,-19.66667 15.42226,-19.66666 -2.61093,-0.41396 -2.61094,-0.41396 -33.09241,4.75566 -33.09242,4.75566 -4.35041,1.20541 -4.3504,1.2054 -1.16461,-2.21377 -1.16463,-2.21378 -2.85105,-27.33333 -2.85106,-27.33333 -1.3734,-5.87957 -1.37338,-5.87958 1.73946,-1.7338 1.73948,-1.73381 37.34946,-19.78891 37.34945,-19.7889 2.31721,-0.8892 2.31722,-0.8892 v -33.77519 -33.77517 l -1.18432,-1.26667 -1.18432,-1.26666 -4.93043,-11.32556 -4.93043,-11.32556 -1.33902,-0.82758 -1.33904,-0.82756 -26.21288,8.46231 -26.2129,8.46232 -3.66666,0.0241 -3.66734,0.0242 -1.6e-4,-1.66666 -1.6e-4,-1.66667 -2.67212,-21.05132 -2.67212,-21.05133 0.85334,-7.26056 0.85333,-7.26058 -1.50036,-1.80782 -1.50036,-1.80782 -6.56147,-15.84054 -6.56146,-15.84055 -1.11923,-0.35951 -1.11923,-0.35949 -14,22.95508 -14,22.95509 -6.12693,9.42307 -6.12692,9.42305 -13.92278,4.27495 -13.92277,4.27495 h -2.28363 -2.28364 v -1.62775 -1.62776 l 12.0805,-29.68096 12.0805,-29.68096 16.00498,-29.4134 16.00496,-29.4134 -0.4188,-2.74917 -0.4188,-2.74917 -15.81662,-6.601 -15.8166,-6.60099 -0.29878,0.40561 -0.29879,0.40562 -6.79521,11.33333 -6.79522,11.33333 -6.66333,7.44296 -6.66332,7.44298 -7.7594,3.47022 -7.7594,3.47024 -9.2348,1.5979 -9.23482,1.59789 -22.76518,10.48957 -22.7652,10.48956 -2.07063,-2.49061 -2.07063,-2.49061 -3.09302,-20.27972 -3.09303,-20.27974 1.25327,-1.25326 1.25325,-1.25326 10.83176,-0.83529 10.83177,-0.83528 7.413,-16.80844 7.413,-16.80844 8.5954,-25.75151 8.5954,-25.75149 -7.59644,-7.05108 -7.59644,-7.05108 -17.97056,-16.19741 -17.97056,-16.19743 h -1.62296 -1.62296 l -17.49404,24.12058 -17.49405,24.12055 -0.92907,2.5115 -0.92905,2.5115 1.74237,29.0346 1.74239,29.0346 -0.69937,19.33334 -0.69938,19.33333 -2.71132,46.66666 -2.71132,46.66667 0.85189,6 0.85191,6 15.16638,61.66404 15.16637,61.66402 v 1.33598 1.33596 h -1.85161 -1.85162 l -20.81226,-8.66667 -20.81227,-8.66667 h -2.74856 -2.74856 l -11.86252,8.33334 -11.86254,8.33333 -0.0584,1.19684 -0.0584,1.19684 21.23432,-0.93317 21.23432,-0.93319 3.89957,3.73635 3.89954,3.73633 9.96698,11.33333 9.96696,11.33334 2.23249,3.29668 2.23249,3.29666 -0.005,1.37 -0.005,1.36999 -2.49664,-4 -2.49664,-4 -12.9005,-14.33333 -12.90049,-14.33334 -2.26455,-0.0355 -2.26455,-0.0355 -45.33333,-0.0175 -45.33333,-0.0175 -6.8817,7.32133 -6.88168,7.32133 -8.19672,9.52362 -8.19673,9.52361 0.72168,3.54132 0.72168,3.54133 2.01902,20.66667 2.01902,20.66666 0.004,1.36914 0.004,1.36913 15.31,20.63087 15.31001,20.63086 0.0233,1.66667 0.0233,1.66667 h -0.61503 -0.61504 l -11.4366,-2.66667 -11.4366,-2.66667 h -1.28171 -1.28169 v 2.36375 2.36375 l 4.05583,10.53281 4.05581,10.53281 -1.72248,1.58367 -1.72249,1.58367 -11.00682,3.83265 -11.00682,3.83265 0.41829,1.25488 0.41829,1.25487 17.2552,7.06211 17.25519,7.06209 2.66667,1.69915 2.66667,1.69913 10.66666,0.77875 10.66667,0.77874 -10.14137,0.2256 -10.14138,0.22559 -19.707,-8.04052 -19.707,-8.04051 -0.81737,0.81738 -0.81738,0.81737 4.66575,4.06511 4.66575,4.06512 15.17516,14.15802 15.17516,14.15807 20.15817,14.7522 20.15818,14.7523 v 1.8845 1.8846 l -20.66667,10.6965 -20.66667,10.6966 -3.33333,2.2469 -3.33334,2.247 -22.45204,8.753 -22.45202,8.7531 h -2.50106 -2.50105 l -1.22504,-2.3334 -1.22504,-2.3333 -2.97239,-18 -2.97238,-18 -1.04712,-1.9251 -1.04712,-1.9251 -13.43491,26.8442 -13.43491,26.8442 -3.7008,3.7859 -3.70078,3.7859 -4.36065,53.295 -4.36062,53.295 -0.30604,4.6666 -0.30603,4.6667 -11.40004,-16 z m -59.87496,-54.0742 8.44364,-10.7409 1.6096,-0.9258 1.6096,-0.9258 16.18612,-32.5088 16.18612,-32.5089 -0.62994,-0.6299 -0.62994,-0.6299 -39.08344,12.9853 -39.08343,12.9853 -0.87686,0.4894 -0.87685,0.4894 12.55713,28.3307 12.55714,28.3308 1.29113,3 1.29114,3 h 0.5026 0.5026 z m 472.63373,-5.9258 6.39732,-14.6667 6.97876,-15.3333 6.97876,-15.3333 -0.85677,-0.8593 -0.85679,-0.8593 -39.09628,-12.9333 -39.09629,-12.9333 -0.64804,0.648 -0.64806,0.6481 16.23066,32.4778 16.23065,32.4779 1.14803,0.4337 1.14802,0.4337 8.85655,11.3421 8.85656,11.3421 0.9898,-1.1091 0.98979,-1.1091 z m -509.82548,-68 6.47604,-17.3333 6.02684,-17.1908 6.02684,-17.1907 -0.45668,-0.4567 -0.45668,-0.4567 -14.5748,10.3584 -14.57482,10.3583 -24,17.0327 -24,17.0327 -11.18164,7.9441 -11.18164,7.9442 37.71024,-0.3545 37.71026,-0.3544 z m 607.57724,14.9579 -3.55618,-2.9579 -15.77715,-11.1098 -15.77715,-11.1097 -18.66666,-13.2656 -18.66667,-13.2657 -5.33333,-3.5026 -5.33334,-3.5026 -5.97126,-4.5415 -5.97129,-4.5415 -0.36245,1.0874 -0.36247,1.0873 6.08829,16.6655 6.08828,16.6655 4.66078,12.6666 4.66079,12.6667 1.22697,3.9063 1.22698,3.9062 1.69102,1.0733 1.69103,1.0734 36,-0.022 36,-0.022 -3.55619,-2.9579 z m -671.36271,-86.6653 41.08111,-25.33036 -1.08111,-1.03371 -1.08112,-1.03369 -32,-3.45276 -32,-3.45276 -2.13102,0.005 -2.131,0.005 -7.54793,29 -7.54792,28.99998 0.0123,1.7453 0.0123,1.7454 1.66666,-0.9339 1.66667,-0.9339 41.08112,-25.3304 z m 694.82834,-4.96122 -7.64742,-29.33137 -2.131,-0.005 -2.13102,-0.005 -32,3.45276 -32,3.45276 -1.08949,1.04208 -1.0895,1.04208 21.0895,13.08266 21.08949,13.08265 21.31274,13.1563 21.31273,13.1564 0.46569,-1.3971 0.46571,-1.3971 -7.64743,-29.33142 z m -599.76912,-14.57166 4.14032,-27.03043 1.61677,-0.99921 1.61677,-0.99923 24.90956,-5.05747 24.90958,-5.05746 20.66666,-4.49304 20.66667,-4.49306 30.78756,-3.17093 30.78756,-3.17095 2.96874,-1.81062 2.96873,-1.81064 -0.85307,-10.66667 -0.85306,-10.66667 -1.98504,-8.21582 -1.98504,-8.21584 -2.4331,-24.45083 -2.43308,-24.45084 1.26672,-2.40478 1.26672,-2.40479 11.35018,-12.92855 11.35018,-12.92854 3.41647,-3.0953 3.41648,-3.09529 21.14819,0.94749 21.1482,0.9475 v -0.79972 -0.79971 l -9.72379,-7.19109 -9.72378,-7.19108 -2.85523,-1.52807 -2.85523,-1.52807 h -2.09044 -2.09044 l -20.81227,8.66667 -20.81226,8.66667 h -1.85162 -1.85161 v -1.4416 -1.44159 l 14.74688,-59.55841 14.74687,-59.5584 1.25517,-7.33333 1.25519,-7.33334 -3.50018,-60.66666 -3.50017,-60.66667 1.52275,-30 1.52273,-30 -0.0247,-6.73036 -0.0246,-6.73036 -18.10517,-24.9363 -18.10519,-24.93631 h -1.60872 -1.60873 l -17.95276,16.18024 -17.95276,16.18026 -7.59644,7.06825 -7.59644,7.06825 8.5954,25.75149 8.5954,25.75151 7.413,16.80844 7.413,16.80844 10.83177,0.83528 10.83176,0.83529 1.18581,1.18582 1.18582,1.18581 -3.03728,20.36163 -3.03728,20.36162 -2.05892,2.47232 -2.05894,2.47233 -23.02917,-10.56375 -23.02917,-10.56376 -8.5912,-1.33752 -8.59121,-1.33752 -8.13902,-3.65259 -8.13903,-3.65257 -6.67723,-7.44298 -6.67721,-7.44296 -6.52284,-10.54505 -6.52284,-10.54505 -0.40747,-1.22239 -0.40746,-1.22239 -15.9664,6.54307 -15.96642,6.54305 -0.4188,2.8356 -0.4188,2.8356 15.8015,29.05544 15.8015,29.05545 12.28396,30.09591 12.28398,30.09591 v 1.57076 1.57076 l -2.33334,-0.0152 -2.33333,-0.0152 -13.33333,-3.98736 -13.33334,-3.98735 -2.67814,-3.28237 -2.67816,-3.28238 -17.98851,-29.36285 -17.98852,-29.36285 -1.11923,0.35418 -1.11923,0.35419 -6.56146,15.84055 -6.56147,15.84054 -1.16367,1.45304 -1.16366,1.45306 -0.0436,14.66666 -0.0436,14.66667 -1.41278,6 -1.41277,6 -0.0325,7.55761 -0.0327,7.55763 -0.80932,2.10904 -0.80932,2.10905 h -3.36904 -3.36905 l -25.39591,-8.1343 -25.39591,-8.13431 -1.76785,-0.67839 -1.76785,-0.67838 -3.44923,7.81269 -3.44923,7.81269 -3.14793,6.66699 -3.14793,6.66699 -0.1906,32.25017 -0.1906,32.25017 0.87524,1.41617 0.87524,1.41618 h 1.07537 1.07537 l 37.81844,20.02012 37.81846,20.02012 1.80121,1.80121 1.80121,1.80121 -1.38549,5.17867 -1.38549,5.17867 -2.89651,28 -2.89651,27.99999 -1.16664,2.2611 -1.16664,2.2611 -3.65841,-1.18581 -3.65841,-1.18581 -34.3384,-4.83875 -34.33842,-4.83873 -2.06048,0.43012 -2.06048,0.43012 14.88574,19.10076 14.88572,19.10074 1.85694,0.71258 1.85694,0.71257 9.65622,-5.78472 9.65622,-5.78473 12.29525,-7.69527 12.29525,-7.69527 h 1.37142 1.37141 l 0.0237,1 0.0237,1 -4.85044,38.93806 -4.85046,38.93806 0.87555,3.06194 0.87553,3.06194 21.61788,17.62904 21.6179,17.62902 1.33333,-0.4006 1.33334,-0.4006 4.14033,-27.03048 z m 91.46364,-57.09304 -2.57761,-3.66667 -18.06053,-28.15256 -18.06053,-28.15257 -2.81223,-5.51241 -2.81221,-5.51242 -10.97377,-5.485 -10.97376,-5.485 -17.92879,-9.4293 -17.92879,-9.42932 1.26212,-0.38391 1.26212,-0.38392 30.66667,6.50681 30.66667,6.50682 1.64969,-1.35944 1.64968,-1.35944 1.8424,0.70698 1.84239,0.707 7.96608,9.77551 7.96608,9.77551 1.54484,2.91794 1.54484,2.91796 8.66367,31.97343 8.66366,31.97342 v 2.10863 2.10861 h -1.24254 -1.24254 z m -5.64812,-34.57723 -8.20675,-30.42277 -9.35447,-11.80579 -9.35448,-11.8058 -1.64928,1.8058 -1.64928,1.80579 -2.31822,8.87448 -2.31822,8.87448 1.66895,3.12552 1.66893,3.12552 17.94504,28 17.94505,28 1.45137,1.81286 1.45137,1.81288 0.46336,-1.3901 0.46338,-1.3901 z m -39.04026,-74.08944 -9.73454,-15 -19.09438,-29.71837 -19.09437,-29.71839 0.75903,-0.75901 0.75902,-0.75903 40.89336,20.12815 40.89336,20.12815 -0.7627,3.03885 -0.76271,3.03887 -10.70169,22.31038 -10.7017,22.3104 h -1.35906 -1.35907 z m 38.59485,-43.74304 -0.60308,-1.92362 -1.53678,-41.85025 -1.53676,-41.85024 1.08309,-0.9682 1.08309,-0.96819 47.94512,-7.45867 47.9451,-7.45866 0.55252,0.55252 0.55252,0.55252 -5.16429,5.82648 -5.16431,5.82648 -37.19009,40.56477 -37.19009,40.56477 -5.08648,5.25696 -5.08648,5.25697 z M 236.00001,687.99998 v -1.33333 h 1.33333 1.33333 v 1.33333 1.33334 h -1.33333 -1.33333 z m -46.89846,157.97783 44.28316,-26.49039 -0.4408,-1.32239 -0.44078,-1.32237 -39.91823,-20.89801 -39.91823,-20.89802 -29.80838,-19.60382 -29.808382,-19.60384 -0.698009,0.698 -0.698009,0.69801 8.124816,33.04917 8.124814,33.04916 -0.11842,3.61819 -0.11843,3.61819 15.63654,31.51114 15.63655,31.51115 2.93931,-0.56188 2.93932,-0.5619 z m 689.91167,-3.98519 15.65348,-31.34071 v -4.01173 -4.01173 l 8.17732,-32.69247 8.1773,-32.69248 -0.69198,-0.692 -0.692,-0.692 -29.81866,19.57192 -29.81865,19.57191 -40,20.96285 -40,20.96287 v 1.55622 1.55624 l 44.50172,26.64591 44.50171,26.64589 h 2.17814 2.17814 z m -470.97555,-242.99263 0.0376,-1 3.17901,-20 3.17901,-20 -0.89514,-0.94515 -0.89516,-0.94516 -10.59119,-1.05484 -10.59117,-1.05485 -9.00595,-19.78154 -9.00593,-19.78152 -7.02654,-21.21848 -7.02653,-21.21846 -1.36453,0.11413 -1.36452,0.11413 -27.90062,30.77671 -27.90061,30.77671 3.09304,5.44244 3.09304,5.44244 4.62698,7.0348 4.62699,7.03478 5.8868,6.05708 5.8868,6.05708 6.96045,3.18175 6.96046,3.18176 9.58271,1.48271 9.5827,1.4827 21.08396,9.8187 21.08396,9.81868 2.33334,0.0916 2.33333,0.0916 0.0376,-1 z m 211.81416,-8.8909 21.39876,-9.89088 9.55344,-1.48226 9.55345,-1.48227 6.47681,-2.78625 6.4768,-2.78626 8.41844,-8.92397 8.41843,-8.92399 5.71334,-9.90965 5.71334,-9.90965 -1.12064,-1.5531 -1.12064,-1.55309 -26.66667,-29.34821 -26.66667,-29.34823 -1.36185,-0.1056 -1.36187,-0.1056 -7.76792,23 -7.76793,23 -8.24911,18 -8.24911,18 -10.51112,0.95668 -10.51112,0.95668 -1.05817,1.05817 -1.05816,1.05816 2.60088,16.65183 2.60089,16.65181 0.74104,4.33334 0.74106,4.33333 h 1.83277 1.83277 l 21.39876,-9.89089 z m -353.89042,-49.1091 0.67887,-3 1.4348,-14 1.4348,-14 0.69468,-7.33334 0.69468,-7.33333 -1.78295,-2.17317 -1.78295,-2.17318 -52.51671,-12.86566 -52.51672,-12.86568 -0.59034,0.59035 -0.59034,0.59034 23.77372,18.03597 23.77372,18.03599 27.33334,20.69208 27.33333,20.69207 0.9746,0.0537 0.9746,0.0537 0.67887,-3 z m 524.73508,-36.13399 50.81335,-38.4673 -0.54928,-0.54928 -0.54928,-0.54928 -52.99893,13.00754 -52.99894,13.00756 -1.32699,2.47948 -1.32698,2.47949 2.18977,20.86288 2.18977,20.8629 0.64636,3.09472 0.64636,3.09472 1.22572,-0.42806 1.22574,-0.42805 z m -472.69648,6.25493 16,-17.34002 9.84631,-10.93304 9.84632,-10.93304 -0.63369,-0.63368 -0.63368,-0.63368 -38.40125,10.04746 -38.40124,10.04748 -1.12605,0.69594 -1.12605,0.69594 10.82908,16.26619 10.82909,16.26617 2.05492,2.36578 2.05492,2.36577 1.43067,-0.46861 1.43065,-0.46862 z m 398.85115,-0.46492 12.26365,-17.98936 -0.89073,-0.91417 -0.89072,-0.91416 -38.58455,-10.05684 -38.58456,-10.05684 -0.57656,0.57657 -0.57656,0.57656 6.49444,7.26464 6.49445,7.26464 19.33334,21.38766 19.33333,21.38764 1.96041,-0.26848 1.96042,-0.26848 z m -584.9028,-28.22638 14.68871,-17.57036 -0.53609,-0.53608 -0.53608,-0.53609 -36.14381,1.68904 -36.143808,1.68902 0.36136,0.9888 0.36136,0.9888 21.154084,15.42861 21.154084,15.42862 h 0.47574 0.47574 z m 779.13191,-0.54964 18.68347,-13.79855 -1.88186,-0.59611 -1.88185,-0.59609 -34.42375,-1.57644 -34.42376,-1.57642 -0.59222,0.59224 -0.59224,0.59222 11.5153,13.87291 11.51531,13.8729 3.41085,3.66047 3.41086,3.66045 3.28822,-2.15452 3.28822,-2.15452 z m -427.41359,503.82212 4.33334,-0.53776 4.33333,0.53776 4.33333,0.53777 h -8.66666 -8.66667 z m 26.66667,0 4.33333,-0.53776 4.33334,0.53776 4.33333,0.53777 h -8.66667 -8.66666 z m -11.33333,-1.28791 2.33333,-0.60976 2.33333,0.60976 2.33334,0.60978 h -4.66667 -4.66667 z m 139.66667,-55.97608 v -2.45074 l 8.67522,-31.76402 8.67523,-31.76401 1.53328,-2.89636 1.53328,-2.89634 7.83463,-9.61463 7.83461,-9.61464 1.26266,-0.78036 1.26265,-0.78036 2.44971,1.31105 2.4497,1.31104 31.08956,-6.62656 31.08956,-6.62657 0.57148,0.57149 0.5715,0.5715 -28.82752,15.00325 -28.82752,15.00327 -3.19362,6.13576 -3.19361,6.13575 -19.72873,30.55608 -19.72874,30.55608 -1.66667,0.55504 -1.66666,0.55503 z m 25.83396,-36.96588 19.49937,-30.52773 v -1.32852 -1.3285 l -2.70714,-9.09008 -2.70714,-9.09008 -1.22648,-0.758 -1.22648,-0.758 -9.28461,11.70432 -9.28463,11.70433 -8.11509,30.07812 -8.1151,30.07813 v 1.87425 1.87426 l 1.83396,-1.95238 1.83395,-1.95238 z m 0.65177,-80.47226 -10.70606,-22.33333 -0.22316,-3.14568 -0.22318,-3.1457 2,-1.19697 2,-1.19697 38.39526,-18.81764 38.39525,-18.81764 0.78105,0.78105 0.78106,0.78104 -20.44288,31.71259 -20.44287,31.71258 -8.42531,13 -8.42529,13 h -1.37891 -1.37889 z m -28.60583,-47.89033 -11.8799,-12.99718 -24.66667,-26.79277 -24.66667,-26.79276 -10.52496,-11.6274 -10.52497,-11.6274 0.60363,-0.60362 0.60362,-0.60363 41.92134,6.68621 41.92134,6.68622 6.37228,0.805 6.37227,0.805 0.66888,1.08225 0.66887,1.08227 -1.57096,42.39406 -1.57096,42.39408 -0.92362,1.05343 -0.92361,1.05342 z m 116.78677,-54.52169 v -2.07868 l 1.35508,0.83748 1.35508,0.83749 -0.76711,1.2412 -0.76709,1.2412 h -0.58799 -0.58797 z m 14.66667,-13.25464 -1.65986,-2 h 1.33334 1.33333 l 1.65985,2 1.65986,2 h -1.33334 -1.33333 z m -727.971949,-93.36718 1.687934,-2.03382 8.141993,-6.78491 8.141994,-6.7849 -8.666667,8.04796 -8.666667,8.04797 6,0.53782 6,0.53784 -7.16326,0.23294 -7.163259,0.23294 z m 917.305289,1.03915 4.66666,-0.56793 -8.66666,-8.03743 -8.66667,-8.03742 8.14199,6.7849 8.142,6.78491 1.68793,2.03382 1.68793,2.03384 -5.82993,-0.21338 -5.82992,-0.21338 z M 58.666669,586.24944 v -0.41721 l 4.333333,-3.91612 4.333334,-3.91612 -3.916122,4.33333 -3.916121,4.33333 h -0.417212 -0.417212 z m 880.582811,-3.91612 -3.91612,-4.33333 4.33334,3.91612 4.33333,3.91612 v 0.41721 0.41721 h -0.41721 -0.41722 z M 68.000002,578.26384 v -0.66667 l 8.000001,-6.93052 8,-6.93052 v 0.66667 0.66667 l -8,6.93052 -8.000001,6.93052 z m 862.565778,-3.26385 -3.23242,-3.66667 3.66667,3.23241 3.66667,3.23243 v 0.43424 0.43425 h -0.43426 -0.43424 z m -8.64963,-7.33334 -3.91612,-4.33333 4.33333,3.91612 4.33334,3.91612 v 0.41721 0.41722 h -0.41722 -0.41721 z M 85.333336,563.58277 v -0.41721 l 4.333334,-3.91612 4.333333,-3.91612 -3.916121,4.33333 -3.916122,4.33334 h -0.417212 -0.417212 z m 823.333364,-7.08932 -8,-7.44182 8.33333,6.93944 8.33333,6.93944 v 0.53473 0.53475 l -0.33333,-0.0324 -0.33333,-0.0324 -8,-7.44183 z m -808.33336,-6.1177 6.33333,-5.85338 v -1.59453 -1.59452 h -1.09133 -1.09133 l -7.040185,2.09071 -7.040182,2.0907 -0.571481,-0.57148 -0.571483,-0.57148 7.790468,-2.18589 7.790463,-2.18589 h 2.24587 2.24586 v 1.83804 1.83802 l -7.66667,6.27654 -7.666667,6.27653 z m -24.333337,-1.83374 10,-3.19362 1.333333,0.12466 1.333334,0.12467 -10.000001,3.19361 -10,3.19363 -1.333333,-0.12467 -1.333334,-0.12466 z m 61.921507,-95.94891 -2.58817,-2.07355 3,1.4538 3,1.4538 v 0.61975 0.61976 h -0.41183 -0.41183 z m 723.41185,1.50072 v -0.66667 l 2.66667,-1.42716 2.66667,-1.42716 v 0.66667 0.66666 l -2.66667,1.42716 -2.66667,1.42716 z M 128.58818,447.25976 126,445.18622 l 3,1.4538 3,1.4538 v 0.61974 0.61976 h -0.41182 -0.41183 z m 742.07852,1.50072 v -0.66666 l 2.66666,-1.42716 2.66667,-1.42716 v 0.66666 0.66667 l -2.66667,1.42716 -2.66666,1.42716 z m -751.41186,-6.83405 -2.58817,-2.07355 3,1.4538 3,1.4538 v 0.61975 0.61976 h -0.41183 -0.41182 z m 760.74519,1.50072 v -0.66667 l 2.66667,-1.42716 2.66666,-1.42716 v 0.66667 0.66667 l -2.66666,1.42716 -2.66667,1.42716 z m -770.07852,-6.83405 -2.58817,-2.07355 3,1.4538 3,1.4538 v 0.61975 0.61976 h -0.41183 -0.41183 z m 779.41185,1.50072 v -0.66667 l 2.66667,-1.42716 2.66667,-1.42716 v 0.66667 0.66666 l -2.66667,1.42716 -2.66667,1.42716 z m -788.74518,-6.83406 -2.588177,-2.07354 2.999997,1.4538 3,1.4538 v 0.61974 0.61976 h -0.41182 -0.41183 z m 798.07852,1.50072 v -0.66666 l 2.66666,-1.42716 2.66667,-1.42716 v 0.66666 0.66667 l -2.66667,1.42716 -2.66666,1.42716 z m -808.604456,-7.37376 -3.937758,-2.5957 2.193208,-0.84162 2.193206,-0.84161 2.411219,0.62477 2.411218,0.62476 -3.333334,0.18431 -3.333333,0.18432 3.333333,2.60737 3.333334,2.60738 -0.666667,0.0208 -0.666667,0.0209 -3.937759,-2.59569 z m 820.536396,0.1853 3.26528,-2.65036 -3.26528,-0.61259 -3.26528,-0.6126 3.58798,-0.18157 3.58798,-0.18158 0.67284,1.0887 0.67286,1.08868 -4.26083,2.35585 -4.26083,2.35584 z m -807.5803,-5.19547 3.685,-0.55723 2.98166,0.57543 2.98167,0.57543 -6.66667,-0.0181 -6.666663,-0.0183 z m 790.66669,0 3.685,-0.55723 2.98167,0.57543 2.98166,0.57543 -6.66666,-0.0181 -6.66667,-0.0183 z m -773.33336,-1.33333 3.685,-0.55723 2.98167,0.57543 2.98166,0.57542 -6.66666,-0.0181 -6.66667,-0.0183 z m 756.00003,0 3.685,-0.55723 2.98166,0.57543 2.98167,0.57542 -6.66667,-0.0181 -6.66666,-0.0183 z m -738.01836,-1.31754 3,-0.57782 3,0.57782 3,0.57783 h -6 -6 z m 720.00002,0 3,-0.57782 3,0.57782 3,0.57783 h -6 -6 z m -702.33335,-1.30598 3.33333,-0.55047 1.84816,-0.62908 1.84816,-0.62909 -2.46533,-2.9722 -2.46534,-2.9722 3.28384,3.04389 3.28384,3.04389 -2,1.26903 -2,1.26901 -4,-0.16114 -4,-0.16116 z m 684.00002,-0.39623 -2,-1.26903 3.28384,-3.04389 3.28384,-3.04389 -2.46534,2.9722 -2.46533,2.9722 1.84816,0.62909 1.84816,0.62908 3.33333,0.55047 3.33334,0.55048 -4,0.16116 -4,0.16114 z m 25.33333,-20.63749 v -0.66667 l 16,-10.71932 16,-10.71932 v 0.66667 0.66666 l -16,10.71932 -16,10.71932 z M 114.08258,380.632 l -10.58409,-7.2076 -2.50383,-2.50384 -2.503834,-2.50382 16.087924,-18.53619 16.08792,-18.53617 v -2.03795 -2.03794 l -13,-6.49232 -13,-6.49232 1.51724,-0.53656 1.51724,-0.53656 23.81609,3.31257 23.8161,3.31259 10.66667,0.92653 10.66666,0.92652 2.13102,1.09416 2.13101,1.09416 7.72968,18.76925 7.72968,18.76927 0.96915,0.59896 0.96914,0.59897 0.77323,-4.30687 0.77323,-4.30685 4.4616,-25.33333 4.4616,-25.33333 -0.50159,-40.24748 -0.50157,-40.24748 -12.89642,-2.83635 -12.89642,-2.83635 -5.23783,-1.58284 -5.23783,-1.58284 -0.5831,-1.79614 -0.58311,-1.79614 2.4876,1.31003 2.4876,1.31001 15.6178,3.48612 15.6178,3.48612 h 2.39348 2.39349 L 233.29635,196 255.23678,172 h 26.79344 26.79344 l 2.05106,1.66666 2.05104,1.66667 10.87046,13.58576 10.87046,13.58574 2.4e-4,2.41426 2.4e-4,2.41424 -12.33358,35.14898 -12.33357,35.14899 -28.23807,26.9948 -28.23808,26.99481 -27.23788,20.0084 -27.23789,20.00841 -13.19071,-1.03674 -13.19071,-1.03675 L 137,368.65999 101.33334,367.75575 v 1.42105 1.42107 l 12,8.06879 12,8.06878 v 0.63227 0.63228 L 125,387.91986 l -0.33333,-0.0803 -10.58409,-7.2076 z m 132.58409,-49.64559 v -1.0136 l -16.33333,-48.97975 -16.33333,-48.97976 -1.33334,-0.33999 -1.33333,-0.33998 -0.38796,32.66666 -0.38796,32.66667 0.78997,4.37735 0.78996,4.37733 16.04662,13.28933 16.0466,13.28932 h 1.21805 1.21805 z m 34.00001,-27.60666 26.66666,-25.30466 12.9114,-36.03755 12.9114,-36.03755 0.0887,-0.83132 0.0885,-0.83132 -11.48581,-14.50201 -11.48581,-14.50201 -13.51419,-0.83661 -13.51419,-0.83663 -13.56508,-0.16337 -13.56508,-0.16339 -22.27101,24.07333 -22.27103,24.07333 2.17068,4.92667 2.17068,4.92667 16.14093,49.33333 16.14094,49.33333 0.64318,1.06475 0.6432,1.06475 2.21463,-1.72254 2.21463,-1.72253 z m 619.06668,68.35357 1.6,-1.6 v -1.18878 -1.18879 l -35.66666,0.90424 -35.66667,0.90424 -13.23488,1.04048 -13.23488,1.04048 -26.98198,-19.86095 -26.98197,-19.86095 -28.44982,-27.13032 -28.44981,-27.13032 -12.35687,-35.16467 -12.35686,-35.16465 0.0236,-2.41424 0.0236,-2.41426 10.87045,-13.58574 10.87047,-13.58576 2.05104,-1.66667 L 693.84317,172 h 26.81345 26.81346 l 21.86341,24 21.86342,23.99999 h 2.45049 2.45049 l 15.6178,-3.48612 15.6178,-3.48612 2.4876,-1.31001 2.4876,-1.31003 -0.5831,1.79614 -0.58311,1.79614 -5.23783,1.58284 -5.23782,1.58284 -12.88226,2.83312 -12.88225,2.83312 -0.52513,40.25071 -0.52514,40.25071 5.07406,28.62853 5.07405,28.62853 v 1.3048 1.3048 l 1.20189,-1.26667 1.2019,-1.26666 6.85392,-16.65255 6.85392,-16.65254 1.97492,-3.01412 1.97493,-3.01412 h 5.1734 5.1734 l 30.34198,-4.04019 30.34197,-4.04019 1.45388,0.51546 1.45389,0.51544 -13,6.49232 -13,6.49232 v 2.03794 2.03795 l 16.05374,18.49678 16.05372,18.49678 -2.26038,2.49769 -2.26038,2.49769 h -0.72668 -0.72668 l 1.6,-1.6 z m -128.13091,-93.73333 17.20159,-52 1.03136,-2.22226 1.03136,-2.22227 -22.20755,-24.11106 -22.20753,-24.11107 -13.55916,0.16339 -13.55916,0.16337 -13.57526,0.83663 -13.57526,0.83661 -11.52372,14.54949 -11.52372,14.54951 0.62626,2.11716 0.62627,2.11717 11.5068,32.66667 11.50679,32.66666 0.96592,2.05622 0.96592,2.05621 28.47284,27.07093 28.47285,27.07095 1.06091,-1.12715 1.06091,-1.12716 z m 2.41616,40.98238 15.86951,-13.01762 0.92305,-3.31572 0.92304,-3.3157 0.11254,-32.66667 0.11253,-32.66667 -1.24119,-1.96262 -1.24118,-1.96264 -0.74212,1.96264 -0.7422,1.96262 -15.99628,47.97918 -15.99628,47.97916 v 1.02084 1.02082 h 1.07454 1.07455 z m -655.82917,-34.79336 -3.70013,-18.18902 -0.64765,-2.26973 -0.64765,-2.26975 21.62554,12.93642 21.62555,12.9364 0.44901,1.348 0.449,1.348 -17.72677,6.17436 -17.72677,6.17434 z m 744.12091,12.01633 -17.02303,-6.06724 0.40667,-1.21997 0.40665,-1.21998 20.61636,-12.48509 20.61636,-12.48509 0.42556,1.24604 0.42558,1.24604 -3.54575,17.7233 -3.54575,17.72331 -0.87981,0.80296 -0.87983,0.80295 z m -362.80041,-61.25296 -0.64747,-1.04763 h 2.47088 2.47088 l -0.64747,1.04763 -0.64745,1.04761 h -1.17596 -1.17596 z m -37.63724,-5.82507 -0.95138,-1.53934 1.74163,1.07638 1.74161,1.07638 1.79772,-2.45854 1.79774,-2.45854 v 1.3215 1.32151 l -1.6,1.6 -1.6,1.6 h -0.98798 -0.98798 z m 74.10057,-0.49288 -1.68659,-2.03221 0.5738,-0.57381 0.57382,-0.5738 1.62749,2.60602 1.62749,2.60603 h -0.5147 -0.51471 z m -81.30659,-12.63444 -1.42716,-2.66666 h 0.66667 0.66667 l 1.42716,2.66666 1.42716,2.66667 h -0.66667 -0.66667 z m -290.35295,-23.64705 -5.58195,-16.86249 0.49573,-0.49575 0.49575,-0.49573 5.61008,16.83436 5.61008,16.83436 -0.52387,0.52386 -0.52386,0.52387 z m 667.79156,14.86928 0.1052,-2.55556 0.7003,1.75 0.70029,1.75 -0.80555,0.80556 -0.80556,0.80555 0.1052,-2.55555 z M 556.00002,198.66666 557.42718,196 h 0.66667 0.66666 l -1.42716,2.66666 -1.42716,2.66667 h -0.66666 -0.66667 z m 278.92495,0 0.68316,-2 5.00084,-15.084 5.00084,-15.08398 0.5162,0.5162 0.5162,0.5162 -5.29646,15.7654 -5.29648,15.7654 -0.90374,0.80238 -0.90372,0.8024 z M 375.94429,191 l -5.94428,-6.33334 6.64186,6 6.64186,6 0.58036,0.33334 0.58036,0.33333 h -1.27794 -1.27794 z m 242.85398,6 0.57603,-0.33334 5.97952,-5.33333 5.97953,-5.33333 -5.2706,5.66666 -5.2706,5.66667 h -1.28494 -1.28496 z m -221.71492,-3.24415 1.75,-0.70029 0.80556,0.80554 0.80554,0.80556 -2.55554,-0.1052 -2.55556,-0.1052 1.75,-0.70029 z m 206.66667,0 1.75,-0.70029 0.80556,0.80554 0.80555,0.80556 -2.55555,-0.1052 -2.55556,-0.1052 1.75,-0.70029 z m -201.33334,-1.33333 1.75,-0.7003 0.80556,0.80555 0.80555,0.80556 -2.55555,-0.1052 -2.55556,-0.1052 1.75,-0.70029 z m 81.58334,-0.27899 v -1.63424 l -1.53935,0.95136 -1.53935,0.95137 1.02318,-1.65552 1.02317,-1.65552 1.42728,1.42728 1.42729,1.4273 -0.91112,0.9111 -0.9111,0.91111 z m 33.4386,0.26849 -0.10534,-1.58798 1.2412,-0.7671 1.2412,-0.7671 0.96482,1.56109 0.96481,1.56109 -1.42547,-0.88098 -1.42546,-0.88099 -0.67528,1.67497 -0.6753,1.67498 -0.1052,-1.58798 z m 80.97807,0.0107 1.75,-0.70029 0.80556,0.80554 0.80554,0.80556 -2.55554,-0.1052 -2.55556,-0.1052 1.75,-0.70029 z m -190.66668,-1.33333 1.75,-0.7003 0.80556,0.80555 0.80555,0.80556 -2.55555,-0.1052 -2.55556,-0.1052 1.75,-0.70029 z m 185.33334,0 1.75,-0.7003 0.80556,0.80555 0.80555,0.80556 -2.55555,-0.1052 -2.55556,-0.1052 1.75,-0.70029 z m -180,-1.33334 1.75,-0.70029 0.80556,0.80555 0.80554,0.80556 -2.55554,-0.1052 -2.55556,-0.1052 1.75,-0.7003 z m 150.60794,-4.64712 1.40873,-1.40873 1.74895,0.58299 1.74894,0.58297 -3.15768,0.82576 -3.15768,0.82575 z M 359.95447,173.66666 352.66668,166 l 7.66667,7.28778 7.66666,7.28779 v 0.37888 0.37888 h -0.37888 -0.37888 z M 641.33335,174 l 7.24224,-7.33334 h 0.66667 0.66667 L 642.66669,174 l -7.24224,7.33333 h -0.66667 -0.66667 z m -298.71222,-19 -7.28779,-7.66667 7.66667,7.28779 7.66667,7.28778 v 0.37888 0.37888 h -0.37888 -0.37888 z M 658.66669,155.33333 665.90893,148 h 0.66667 0.66666 l -7.24224,7.33333 -7.24224,7.33333 h -0.66666 -0.66667 z M 323.95446,135 l -7.28778,-7.66667 7.66666,7.28779 7.66667,7.28778 v 0.37888 0.37888 h -0.37888 -0.37888 z m 352.71223,1 6.56643,-6.66667 h 0.66666 0.66667 L 678.00002,136 l -6.56642,6.66666 h -0.66667 -0.66667 z m -535.93942,-13.39394 -3.46759,-10.97686 0.52771,-0.5277 0.52771,-0.52771 3.44248,11.00196 3.44248,11.00197 -0.50259,0.50259 -0.5026,0.50261 z m 165.89386,-6.27273 -7.28779,-7.66667 7.66667,7.28779 7.66667,7.28779 V 123.62112 124 h -0.37888 -0.37888 z m 388.04556,0.33333 7.24224,-7.33333 h 0.66667 0.66666 l -7.24224,7.33333 L 688.75778,124 h -0.66666 -0.66667 z m 168.10527,-1.44444 0.1052,-2.55556 0.7003,1.75 0.70029,1.75 -0.80555,0.80556 -0.80556,0.80555 0.1052,-2.55555 z m -724.00002,-9.33333 0.1052,-2.55556 0.70029,1.75 0.70029,1.75 -0.80554,0.80556 -0.80556,0.80555 0.10533,-2.55555 z m 573.22808,-7.888892 7.24224,-7.333334 h 0.66667 0.66667 l -7.24224,7.333334 -7.24224,7.333332 h -0.66667 -0.66667 z m -424.04556,-1.666667 -7.28778,-7.666667 7.66666,7.287787 7.66667,7.287789 V 103.62112 104 h -0.37888 -0.37888 z m -147.84919,4.222219 0.1052,-2.555552 0.70029,1.75 0.7003,1.750002 -0.80555,0.80555 -0.80556,0.80556 0.10533,-2.55556 z m 1.33333,-5.33333 0.1052,-2.555556 0.7003,1.75 0.70029,1.75 -0.80555,0.805556 -0.80556,0.805555 0.10534,-2.555555 z m 129.18253,-17.555555 -7.28779,-7.666667 7.66667,7.287787 7.66667,7.287786 v 0.37888 0.37888 h -0.37888 -0.37888 z m 459.37889,1 6.56643,-6.666667 h 0.66667 0.66666 l -6.56642,6.666667 -6.56643,6.666666 h -0.66667 -0.66666 z M 149.33334,65.872754 v -1.238356 l 21,-20.650532 21,-20.650533 L 170.66667,44.6194 150,65.905468 l -0.33333,0.602821 -0.33333,0.60282 z m 109.16326,-1.539422 -1.82992,-2.333334 2.33333,1.829927 2.33333,1.829925 v 0.503408 0.503407 h -0.50341 -0.5034 z m 482.83676,1.829926 V 65.65985 l 2.33333,-1.829925 2.33333,-1.829927 -1.82992,2.333334 -1.82993,2.333333 h -0.5034 -0.50341 z m 90.02008,-22.163259 -21.31325,-22 21.9218,21.613675 21.9218,21.613675 -0.60855,0.386324 -0.60854,0.386325 z m -576.68676,14.666666 -1.42716,-2.666666 h 0.66666 0.66667 l 1.42716,2.666666 1.42716,2.666667 h -0.66667 -0.66666 z m 492.00001,0 1.42716,-2.666666 h 0.66667 0.66666 l -1.42716,2.666666 -1.42716,2.666667 h -0.66666 -0.66667 z M 240.00001,33.333333 238.57285,30.666666 h 0.66666 0.66667 l 1.42716,2.666667 1.42716,2.666666 h -0.66667 -0.66666 z m 521.33335,0 1.42716,-2.666667 h 0.66667 0.66666 l -1.42716,2.666667 -1.42716,2.666666 h -0.66666 -0.66667 z"
         id="path1507273" />
      <path
         style="fill:#345050;stroke-width:1.33333"
         d="m 262.6517,1157 -1.29113,-3 -12.55714,-28.3308 -12.55713,-28.3307 0.87685,-0.4894 0.87686,-0.4894 39.08343,-12.9853 39.08344,-12.9853 0.62994,0.6299 0.62994,0.6299 -16.18612,32.5089 -16.18612,32.5088 -1.6096,0.9258 -1.6096,0.9258 -8.44364,10.7409 -8.44364,10.7409 h -0.5026 -0.5026 z m 466.14023,-8.1239 -8.85655,-11.3421 -1.14802,-0.4337 -1.14803,-0.4337 -16.23065,-32.4779 -16.23066,-32.4778 0.64806,-0.6481 0.64804,-0.648 39.09629,12.9333 39.09628,12.9333 0.85679,0.8593 0.85677,0.8593 -6.97876,15.3333 -6.97876,15.3333 -6.39732,14.6667 -6.39733,14.6667 -0.98979,1.1091 -0.9898,1.1091 z m -563.3069,-63.4448 11.18164,-7.9441 24,-17.0327 24,-17.0327 14.57482,-10.3583 14.5748,-10.3584 0.45668,0.4567 0.45668,0.4567 -6.02684,17.1907 -6.02684,17.1908 -6.47604,17.3333 -6.47604,17.3333 -37.71026,0.3544 -37.71024,0.3545 z m 608.1573,6.7878 -1.69102,-1.0733 -1.22698,-3.9062 -1.22697,-3.9063 -4.66079,-12.6667 -4.66078,-12.6666 -6.08828,-16.6655 -6.08829,-16.6655 0.36247,-1.0873 0.36245,-1.0874 5.97129,4.5415 5.97126,4.5415 5.33334,3.5026 5.33333,3.5026 18.66667,13.2657 18.66666,13.2656 15.77715,11.1097 15.77715,11.1098 3.55618,2.9579 3.55619,2.9578 -36,0.022 -36,0.022 -1.69103,-1.0733 z m -645.65459,-63.1404 -0.0123,-1.7454 7.54792,-28.99999 7.54793,-29 2.131,-0.005 2.13102,-0.005 32,3.45276 32,3.45276 1.08112,1.0337 1.08111,1.0337 -41.08111,25.33037 -41.08112,25.3303 -1.66667,0.9339 -1.66667,0.9339 -0.0123,-1.7453 z m 724.65836,-11.4448 -21.31274,-13.1563 -21.08949,-13.08265 -21.0895,-13.08265 1.0895,-1.04208 1.08949,-1.04208 32,-3.45276 32,-3.45276 2.13102,0.005 2.131,0.005 7.64742,29.33138 7.64743,29.3313 -0.46571,1.3971 -0.46569,1.3971 -21.31273,-13.1563 z m -397.31275,-32.67042 -2.66667,-1.62208 -17.91588,-7.41836 -17.91588,-7.41836 -0.42428,-1.27281 -0.42427,-1.2728 11.00683,-3.83265 11.00681,-3.83266 1.7225,-1.58366 1.72248,-1.58367 -4.05582,-10.53281 -4.05582,-10.53282 v -2.36374 -2.36375 h 1.28169 1.28171 l 11.4366,2.66667 11.4366,2.66666 h 0.61504 0.61503 l -0.0233,-1.66666 -0.0233,-1.66667 -15.31,-20.63087 -15.31,-20.63086 -0.004,-1.36914 -0.004,-1.36913 -2.01902,-20.66666 -2.01902,-20.66667 -0.71986,-3.53304 -0.71986,-3.53304 4.37436,-5.13363 4.37434,-5.13362 10.51319,-11.66667 10.51319,-11.66667 h 1.21009 1.21008 l -3.9236,3.66667 -3.9236,3.66667 -11.43077,13.02437 -11.43076,13.02437 v 1.22216 1.22216 l 1.24025,3.26212 1.24025,3.26211 1.47312,16.49136 1.47314,16.49134 0.59336,5.09015 0.59334,5.09016 2.96387,4.24317 2.96387,4.24319 11.77205,15.66876 11.77206,15.66877 0.70504,1.83732 0.70505,1.83732 -9.41437,9.21136 -9.41437,9.21135 v 3.32051 3.3205 l 6.8135,12.89256 6.81351,12.89258 2.18649,0.58148 2.18651,0.58149 -2,0.11413 -2,0.11414 -2.66667,-1.62207 z m 12.33333,0.73863 4.33334,-0.53776 4.33333,0.53776 4.33333,0.53777 h -8.66666 -8.66667 z m 58.69055,-10e-4 4.35721,-0.53955 3.64279,0.55315 3.64279,0.55316 -8,-0.0136 -8,-0.0136 4.35721,-0.53955 z m 17.29297,-1.07208 2.9102,-2.03839 6.0459,-11.62828 6.04589,-11.62828 0.007,-3.28256 0.007,-3.28256 -9.41437,-9.21135 -9.41437,-9.21136 0.62312,-1.62381 0.62312,-1.62381 14.74402,-19.96174 14.74402,-19.96173 2.08054,-21.25387 2.08053,-21.25387 1.30003,-3.86563 1.30002,-3.86564 v -1.07169 -1.07171 l -11.44972,-13.06267 -11.44973,-13.06266 -3.90464,-3.66667 -3.90464,-3.66667 h 1.28557 1.28559 l 12.8798,14.33334 12.8798,14.33333 1.74391,2.66667 1.74392,2.66666 -1.75215,15.33334 -1.75213,15.33333 -0.89248,10.07648 -0.89248,10.07648 -15.2306,20.59018 -15.23061,20.59019 -0.0133,1.69207 -0.0133,1.69206 3,-0.66893 3,-0.66893 9.08273,-2.02314 9.08275,-2.02313 h 1.25059 1.2506 v 2.36375 2.36374 l -4.0294,10.4642 -4.02942,10.46422 1.26792,1.52774 1.26792,1.52775 11.433,3.96311 11.43299,3.9631 -0.41631,1.24895 -0.41632,1.24895 -17.2552,7.07128 -17.25519,7.07128 -3.53905,2.02762 -3.53905,2.02764 h -1.75763 -1.75761 l 2.9102,-2.03838 z m -57.29297,-0.26126 4.35721,-0.53954 3.64279,0.55314 3.64279,0.55316 -8,-0.0136 -8,-0.0136 4.35721,-0.53954 z m 22.66667,0 4.35721,-0.53954 3.64279,0.55314 3.64278,0.55316 -8,-0.0136 -8,-0.0136 4.35722,-0.53954 z m -149.90606,-60.5546 -1.45137,-1.81286 -17.94505,-28 -17.94504,-28 -1.66893,-3.12552 -1.66895,-3.12552 2.31822,-8.87448 2.31822,-8.87448 1.64928,-1.80579 1.64928,-1.8058 9.35448,11.8058 9.35447,11.80579 8.20675,30.42277 8.20675,30.42277 -0.46338,1.3901 -0.46336,1.3901 z m -8.49671,-34.65105 -7.13267,-26.86218 -8.59818,-10.6494 -8.59818,-10.64942 -1.02116,1.83294 -1.02116,1.83292 -1.99021,7.63564 -1.9902,7.63565 18.19865,28.56293 18.19866,28.56293 0.54356,-0.51992 0.54357,-0.51992 z m 290.71222,34.86869 v -1.87425 l 8.1151,-30.07813 8.11509,-30.07812 9.28463,-11.70433 9.28461,-11.70432 1.22648,0.758 1.22648,0.758 2.70714,9.09008 2.70714,9.09008 v 1.3285 1.32852 l -19.49937,30.52773 -19.49939,30.52774 -1.83395,1.95238 -1.83396,1.95238 z m 23.7407,-37.0447 17.33208,-27.01419 -1.9946,-7.65248 -1.99461,-7.65246 -1.00726,-1.80808 -1.00725,-1.80807 -8.45901,10.35212 -8.45903,10.35211 -6.23567,22.81654 -6.23568,22.81655 -0.98031,4.63941 -0.9803,4.63941 1.34478,-1.33333 1.34479,-1.33333 z m -541.77084,-44.90495 -15.63654,-31.51114 0.11843,-3.61819 0.11842,-3.61819 -8.124814,-33.04916 -8.124816,-33.04917 0.698009,-0.69801 0.698009,-0.698 29.808382,19.60384 29.80838,19.60382 39.91823,20.89802 39.91823,20.89801 0.44078,1.32237 0.4408,1.32239 -44.28316,26.49039 -44.28316,26.49039 -2.93932,0.5619 -2.93931,0.56188 z m 63.32485,1.06232 41.43608,-24.85681 -0.3654,-0.28975 -0.3654,-0.28973 -35.75765,-18.98468 -35.75766,-18.98468 -0.56078,0.5608 -0.56079,0.56079 -2.05051,16.57044 -2.05052,16.57045 -3.30437,25.33333 -3.30436,25.33334 0.007,1.66666 0.007,1.66667 h 0.59599 0.59597 l 41.4361,-24.85683 z m 627.87369,3.54427 -44.50172,-26.64591 v -1.55624 -1.55622 l 40,-20.96287 40,-20.96285 29.81865,-19.57191 29.81866,-19.57192 0.692,0.692 0.69198,0.692 -8.1773,32.69248 -8.17732,32.69247 v 4.01173 4.01173 l -15.65348,31.34071 -15.65348,31.34069 h -2.17814 -2.17814 z m 43.68255,14.97923 -0.82595,-6.33334 -1.99895,-16.66666 -1.99894,-16.66667 -2.70499,-20.58033 -2.705,-20.58034 -0.55008,-0.55008 -0.55008,-0.55009 -36.02298,19.08815 -36.02296,19.08814 0.70348,0.70894 0.7035,0.70894 40.22768,24.23632 40.22767,24.23633 1.17177,0.0969 1.17177,0.0971 -0.82594,-6.33333 z m -377.18428,-55.99731 20.33333,-0.40548 20.33333,0.40548 20.33334,0.40547 h -40.66667 -40.66667 z m -374.33335,-142.93585 -2,-1.30117 -0.31587,-27.71618 -0.31588,-27.71616 -0.0175,-1 -0.0175,-1 -24.999997,-0.1168 -25.000001,-0.1168 -6.666667,-0.8832 -6.666667,-0.8832 34.333334,-29.19457 34.333338,-29.19457 v -1.80543 -1.80542 h -2.41946 -2.41945 l -19.893963,5.90881 -19.893962,5.9088 -0.440888,-0.44089 -0.440888,-0.44088 23.54649,-20.46792 23.546491,-20.46792 1.97448,-1.12222 1.97449,-1.12222 0.57482,0.57482 0.57483,0.57483 -2.20895,14.27995 -2.20894,14.27993 1.20078,1.05948 1.20078,1.05948 70.66667,3.01067 70.66667,3.01066 4,0.31902 4,0.31901 0.39751,2.66039 0.39752,2.66038 -7.41128,20.41615 -7.41128,20.41613 -2.456,4.1351 -2.456,4.1351 -5.72138,14.66667 -5.72137,14.66666 -2.14219,2.19343 -2.1422,2.19341 -57.33333,14.12747 L 114,662.64176 l -2.66666,0.69645 -2.66667,0.69645 z m 30.61108,-22.51111 20.72226,-15.35216 12,-8.84808 12,-8.84809 20.66666,-15.33622 20.66667,-15.33624 14.53711,-10.51622 14.53709,-10.51621 -1.29177,-0.43059 -1.29179,-0.4306 -20.57865,7.47952 -20.57866,7.47952 -12.66666,4.64011 -12.66667,4.64011 -12.66667,4.44748 -12.66666,4.44748 -14.66667,5.28006 -14.66667,5.28006 -10.33333,3.76174 -10.33334,3.76173 0.005,8.08711 0.005,8.08709 0.86996,19.01695 0.86997,19.01695 3.40291,-2.22968 3.40291,-2.22967 20.72224,-15.35215 z m 695.07844,8.6029 -58.97719,-14.8253 -1.82779,-2 -1.8278,-2 -5.72525,-14.66666 -5.72527,-14.66667 -2.37162,-4 -2.37164,-4 -7.51638,-20.39309 -7.51637,-20.39308 0.41824,-2.82988 0.41824,-2.82988 4,-0.33624 4,-0.33623 70.66667,-2.98298 70.66667,-2.98299 1.26548,-1.12329 1.26548,-1.1233 -2.2848,-14.20409 -2.28482,-14.20408 0.58599,-0.58599 0.58599,-0.58598 1.97449,1.12222 1.97448,1.12222 23.54649,20.46792 23.5465,20.46792 -0.4409,0.44088 -0.44089,0.44089 -19.89396,-5.9088 -19.89396,-5.90881 h -2.41945 -2.41946 v 1.83962 1.83963 l 34.3176,29.14031 34.31761,29.14031 -5.3176,0.94322 -5.31761,0.94322 -26.33333,0.0768 -26.33333,0.0769 -0.0532,1.66667 -0.0532,1.66667 0.0607,24.66666 0.0607,24.66667 -1.70767,3.32152 -1.70765,3.32152 -1.96652,0.17045 -1.96651,0.17044 -58.97717,-14.8253 z m 61.55376,-16.19072 0.91284,-26.69876 -11.74471,-4.18748 -11.74472,-4.18748 -17.33333,-6.26333 -17.33334,-6.26335 -10,-3.63415 -10,-3.63416 -13.33333,-4.75716 -13.33333,-4.75717 -11.33334,-4.21243 -11.33333,-4.21242 -7.27005,-2.60111 -7.27004,-2.60109 -1.11745,0.37248 -1.11744,0.37248 6.38749,4.79668 6.38749,4.79668 21.33333,15.73193 21.33334,15.73195 10.66666,7.83901 10.66667,7.83901 8,6.04423 8,6.04424 24.55376,17.90521 24.55375,17.90521 0.27812,-0.33513 0.27812,-0.33513 z m -511.66056,-42.63655 -21.08396,-9.81869 -9.58271,-1.48271 -9.58271,-1.4827 -6.96045,-3.18176 -6.96046,-3.18175 -5.8868,-6.05708 -5.8868,-6.05708 -4.62698,-7.03479 -4.62699,-7.0348 -3.09304,-5.44244 -3.09304,-5.44244 27.90061,-30.7767 27.90062,-30.77671 1.36452,-0.11413 1.36453,-0.11414 7.02654,21.21847 7.02653,21.21848 9.00593,19.78152 9.00595,19.78153 10.59117,1.05486 10.59119,1.05484 0.89516,0.94516 0.89515,0.94514 -3.17902,20 -3.17901,20 -0.0376,1 -0.0377,0.9999 -2.33333,-0.0916 -2.33333,-0.0916 -21.08396,-9.81868 z m 25.04138,4.33531 0.74492,-4.33333 2.43324,-15.72122 2.43324,-15.72122 -1.16224,-0.7183 -1.16222,-0.7183 -9.81734,-0.74248 -9.81734,-0.74248 -7.6762,-16.50243 -7.67622,-16.50244 -4.58873,-2.836 -4.58875,-2.836 -8.87322,-0.62501 -8.87323,-0.62502 -14,3.50816 -14,3.50816 -8.19699,3.98706 -8.19699,3.98704 -0.70693,1.84225 -0.70693,1.84224 5.81957,9.9416 5.81959,9.94159 6.94536,7.59933 6.94534,7.59932 3.97658,2.05636 3.97656,2.05636 6.16241,1.7662 6.16243,1.7662 6.66667,0.91609 6.66666,0.91608 20.66667,9.72928 20.66667,9.72927 1.60625,0.13253 1.60624,0.13254 0.74493,-4.33334 z m 186.7557,1.33333 -0.74104,-4.33333 -2.60089,-16.65181 -2.60088,-16.65183 1.05816,-1.05816 1.05817,-1.05817 10.51112,-0.95668 10.51112,-0.95668 8.24911,-18 8.24911,-18 7.76793,-23 7.76792,-23 1.36187,0.1056 1.36185,0.1056 26.66667,29.34822 26.66667,29.34822 1.12064,1.55309 1.12064,1.55309 -5.71334,9.90966 -5.71334,9.90965 -8.41843,8.92399 -8.41844,8.92397 -6.4768,2.78625 -6.47681,2.78626 -9.55345,1.48226 -9.55344,1.48227 -21.39876,9.89088 -21.39876,9.89089 h -1.83277 -1.83277 l -0.74106,-4.33333 z m 25.37038,-6.84738 21.24984,-9.84739 8.66666,-1.36191 8.66667,-1.36192 7.6286,-2.87225 7.6286,-2.87225 7.5057,-8.25179 7.5057,-8.25177 5.76963,-9.80799 5.76961,-9.808 -0.59985,-1.52533 -0.59987,-1.52535 -4.48013,-2.90917 -4.48015,-2.90918 -11.15725,-3.30561 -11.15725,-3.3056 -7.15479,-1.62201 -7.1548,-1.622 -8.42859,0.67656 -8.42857,0.67657 -4.54956,2.81177 -4.54956,2.81179 -5.68355,12.34844 -5.68355,12.34844 -1.92106,4.16253 -1.92106,4.16255 -10.0001,0.64176 -10.0001,0.64177 -1.06022,1.1957 -1.06022,1.19569 3.05474,18.66667 3.05473,18.66666 0.0764,1 0.0764,1 h 1.08349 1.0835 l 21.24984,-9.84738 z m -168.72881,-42.48595 0.0213,-5.66667 1.92687,-32.51341 1.92687,-32.51343 -1.61489,-2.93456 -1.6149,-2.93457 -18,-24.90505 -18,-24.90507 -2.66667,-0.49906 -2.66666,-0.49907 -47.33334,-10.2302 -47.33333,-10.2302 -2.33334,-0.6742 -2.33333,-0.67421 0.02,1.08985 0.02,1.08985 23.31329,31.93624 23.3133,31.93624 v 1.73043 1.73042 h -0.6366 -0.63659 l -40.72681,10.66667 -40.72682,10.66667 h -1.86792 -1.86793 l -21.56327,-34 -21.56328,-34 h -1.72787 -1.72785 l -35.81087,20.54723 -35.81086,20.54724 -2.66667,-1.85331 -2.66667,-1.85331 -26.87318,-15.4542 -26.873176,-15.4542 -2.432691,-1.77882 -2.432689,-1.77883 5.972534,-0.77735 5.972532,-0.77733 28.66667,-2.05577 28.66667,-2.05578 3.09472,-0.67696 3.09472,-0.67696 -0.51353,-1.61749 -0.51355,-1.61749 -30.50303,-20.76554 -30.50303,-20.76554 -0.56471,-1.69414 -0.56471,-1.69414 35.81989,0.90846 35.8199,0.90847 13.1907,1.03675 13.19071,1.03674 27.23789,-20.00841 27.23789,-20.0084 28.23808,-26.99481 28.23806,-26.9948 12.33358,-35.14899 12.33357,-35.14898 -2.4e-4,-2.41424 -1.3e-4,-2.41426 -10.87046,-13.58574 -10.87046,-13.58576 -2.05104,-1.66667 L 308.82366,172 h -26.79344 -26.79344 l -21.94043,24 -21.94044,23.99999 h -2.39349 -2.39348 l -15.6178,-3.48133 -15.6178,-3.48135 -1.73547,-0.94349 -1.73546,-0.94351 -16.73134,-49.57086 -16.73133,-49.57087 1.329,-5.00429 1.329,-5.00429 0.1378,3.10982 0.1378,3.10982 14.33333,-12.962798 14.33334,-12.962796 1.43262,-1.74846 1.43263,-1.74846 13.79991,-10.731897 13.7999,-10.731897 h 1.17371 1.17371 l 25.59376,23.525847 25.59376,23.525851 1.61941,2.80748 1.61943,2.80749 0.0472,29.66666 0.0473,29.66667 23,0.15775 23,0.15776 3.93795,0.84458 3.93795,0.8446 7.67613,9.13967 7.67615,9.13967 5.52533,7.16186 5.52535,7.16187 -13.72543,38.59364 -13.72541,38.59362 -28.41402,26.89451 -28.414,26.89452 0.0217,0.87464 0.0217,0.87464 62.97821,31.94808 62.97823,31.94806 18.63495,9.38527 18.63496,9.38525 18.03171,24.96675 18.03172,24.96676 1.54205,0.0332 1.54206,0.0332 22.24922,-36 22.24923,-36 h 1.04879 1.0488 l 22.2708,36 22.27081,36 1.55579,-0.0336 1.55578,-0.0336 18.00001,-24.96644 18,-24.96644 9.33333,-4.70872 9.33333,-4.70873 72.32365,-36.6246 72.32365,-36.62462 0.009,-0.90268 0.0101,-0.9025 -28.4156,-26.87095 -28.41559,-26.87094 -13.58931,-38.22638 -13.58929,-38.22637 0.005,-0.83411 0.005,-0.8341 12.12293,-15.16589 12.12292,-15.1659 2.21041,-1.33309 2.2104,-1.33309 25.66667,-0.45627 25.66667,-0.45628 0.0472,-29.54396 0.0464,-29.54397 1.61943,-2.80749 1.61941,-2.80748 25.59376,-23.525851 25.59376,-23.525847 h 1.3189 1.31889 l 10.42068,8.229552 10.42068,8.22955 19,17.188818 19,17.188818 0.1378,-3.08504 0.1378,-3.08503 1.32627,4.99269 1.32625,4.9927 -16.7644,49.6025 -16.7644,49.6025 -1.69965,0.92346 -1.69967,0.92346 -15.6178,3.48135 -15.6178,3.48133 h -2.45049 -2.4505 L 769.33336,196 747.46994,172 h -26.81345 -26.81345 l -2.05106,1.66666 -2.05104,1.66667 -10.87046,13.58576 -10.87046,13.58574 -0.0236,2.41426 -0.0236,2.41424 12.35687,35.16465 12.35687,35.16467 28.44981,27.13032 28.44981,27.13032 26.98198,19.86095 26.98197,19.86095 13.23488,-1.04048 13.23488,-1.04048 35.8199,-0.90847 35.81989,-0.90846 -0.54121,1.62362 -0.5412,1.62362 -30.53865,20.83606 -30.53866,20.83606 -0.50143,1.61749 -0.50141,1.61749 3.09472,0.67696 3.09472,0.67696 28.66667,2.05578 28.66667,2.05577 5.82752,0.75559 5.8275,0.7556 -1.16084,1.13341 -1.16085,1.13341 -27.33333,15.60804 -27.33334,15.60804 -3.33333,2.32418 -3.33334,2.32417 -35.90238,-20.55715 -35.90239,-20.55714 -1.98149,0.38569 -1.9815,0.38571 -20.92412,33.33333 -20.92412,33.33333 -1.93123,0.38088 -1.93122,0.38088 -40.92423,-10.71421 -40.92408,-10.71422 h -0.6699 -0.66988 v -1.86919 -1.8692 l 15.02826,-20.46414 15.02827,-20.46413 8.45098,-11.74297 8.45099,-11.74298 -0.50236,-0.50236 -0.50236,-0.50236 -49.31022,10.69276 -49.31022,10.69278 -2.94472,0.88589 -2.94472,0.88591 -17.91024,24.81664 -17.91023,24.81662 -1.43832,2.68752 -1.43832,2.68753 1.93138,32.49584 1.93139,32.49584 0.0285,5.66667 0.0285,5.66667 h -1.16456 -1.16455 l -23.83545,-25.32983 -23.83544,-25.32983 -0.66667,0.007 -0.66667,0.007 -23.95804,25.32378 -23.95798,25.32254 h -1.04198 -1.04196 l 0.0213,-5.66667 z m -297.24481,-100 2.88948,-9.66666 2.40839,-8.64748 2.40837,-8.6475 -0.35278,-0.3528 -0.3528,-0.3528 -29.22195,2.06074 -29.22194,2.06073 -3.912095,0.96425 -3.912098,0.96424 27.245433,15.59928 27.24543,15.5993 0.94353,0.0427 0.94355,0.0427 2.88948,-9.66667 z m 727.34467,-6 27.41712,-15.66666 -3.76916,-0.94539 -3.76916,-0.94539 -29.20411,-2.07273 -29.20411,-2.07272 -0.55872,0.55872 -0.55872,0.55871 4.18,13.79273 4.18,13.79273 1.35289,4.33334 1.3529,4.33333 h 0.58199 0.58197 z m -709.98713,-38.50114 5.8659,-7.50114 5.09219,-6.0198 5.09219,-6.0198 2.08842,-3.18733 2.08843,-3.18735 -0.51395,-0.46648 -0.51394,-0.46649 L 150,374.14076 l -40,-0.84304 2.66667,1.96204 2.66667,1.96204 23.33333,15.92314 23.33334,15.92312 1.46742,0.13266 1.46743,0.13267 5.86591,-7.50115 z m 694.20035,-9.37627 24.99891,-16.87743 1.33333,-1.2692 1.33334,-1.2692 -40.66667,0.94536 -40.66667,0.94536 -0.57553,0.55456 -0.57552,0.55458 3.98914,4.31336 3.98915,4.31336 9.80632,12.33333 9.80632,12.33333 h 1.11448 1.11448 z M 225.4483,202.33333 240.53027,186 l 3.97707,-4.31336 3.97705,-4.31336 -0.9068,-0.9068 -0.9068,-0.90682 -36.03508,16.45447 -36.03506,16.45446 0.47585,1.42754 0.47584,1.42753 15.22383,3.52299 15.22384,3.523 2.18316,0.1485 2.18317,0.14851 z m 585.78039,12.5852 15.89534,-3.62387 0.46078,-1.38237 0.4608,-1.38238 -34.79138,-15.93162 -34.79139,-15.93163 -1.89808,-0.43109 -1.89807,-0.43111 v 1.15715 1.15713 l 18.71798,20.27396 18.71798,20.27396 1.61535,-0.0621 1.61536,-0.0621 z m -575.22868,308.28183 -27.33334,-20.69208 -23.77372,-18.03599 -23.77372,-18.03597 0.59034,-0.59034 0.59034,-0.59035 52.51672,12.86568 52.51671,12.86566 1.78295,2.17318 1.78295,2.17317 -0.69468,7.33333 -0.69468,7.33334 -1.4348,14 -1.4348,14 -0.67887,3 -0.67887,3 -0.9746,-0.0537 -0.9746,-0.0538 z m 500.78533,17.89435 -0.64636,-3.09472 -2.18977,-20.8629 -2.18977,-20.86288 1.32698,-2.47949 1.32699,-2.47948 52.99894,-13.00756 52.99893,-13.00754 0.54928,0.54928 0.54928,0.54928 -50.81335,38.4673 -50.81333,38.46732 -1.22574,0.42805 -1.22572,0.42806 z M 95.154086,484.57137 74.000002,469.14276 l -0.36136,-0.9888 -0.36136,-0.9888 36.143808,-1.68902 36.14381,-1.68904 0.53608,0.53609 0.53609,0.53608 -14.68871,17.57036 -14.68871,17.57036 h -0.47574 -0.47574 z m 787.255434,11.75575 -3.41085,-3.66047 -11.51531,-13.8729 -11.5153,-13.87291 0.59224,-0.59222 0.59222,-0.59224 34.42376,1.57642 34.42375,1.57644 1.88185,0.59609 1.88186,0.59611 -18.68347,13.79855 -18.68345,13.79854 -3.28822,2.15452 -3.28822,2.15452 z m -654.22555,-177.61645 -16.04662,-13.28933 -0.78996,-4.37733 -0.78997,-4.37735 0.38796,-32.66667 0.38796,-32.66666 1.33333,0.33998 1.33334,0.33999 16.33333,48.97976 16.33333,48.97975 v 1.0136 1.01358 h -1.21805 -1.21805 z m 0.28818,-36.29393 -14.47214,-43.08341 -0.37646,30 -0.37644,30 0.76147,2.66666 0.76147,2.66667 13.55029,10.95357 13.55031,10.95358 0.53681,-0.53683 0.53683,-0.53683 z m 527.52788,48.56243 v -1.02084 l 15.99628,-47.97916 15.99628,-47.97918 0.7421,-1.96262 0.74212,-1.96264 1.24119,1.96264 1.24119,1.96262 -0.11254,32.66667 -0.11253,32.66667 -0.92304,3.3157 -0.92305,3.31572 -15.86951,13.01762 -15.86949,13.01762 h -1.07455 -1.07455 v -1.02082 z m 24.34042,-20.31251 7.58612,-6 0.74651,-2.66667 0.74651,-2.66666 -0.37644,-30 -0.37646,-30 -14.33333,42.66698 -14.33333,42.66699 v 1.11309 1.11311 l 6.37716,-5.11341 6.37716,-5.11343 z m -282.19778,-75.44239 -0.80932,-2.10904 v -0.81246 -0.81246 l 2,2.58818 2,2.58817 2.17937,-2.66667 2.17939,-2.66666 -0.84605,2.44238 -0.84604,2.44238 v 0.55762 0.55762 h -2.52402 -2.52401 z m -36.26997,-4.76362 -0.95138,-1.53935 1.59776,0.98747 1.59775,0.98746 1.97212,-1.6367 1.97211,-1.63672 -0.83984,2.1886 -0.83984,2.18858 h -1.77866 -1.77866 z m 74.02154,-0.79399 -1.76561,-2.33333 1.76483,1.56248 1.76484,1.56246 2.05625,-0.78905 2.05625,-0.78907 -0.96408,1.55992 -0.96408,1.55992 h -1.09138 -1.09139 z m -67.85338,-3.66667 v -1.33333 l 1.29249,-2 1.29249,-2 v 1.33333 1.33334 l -1.29249,2 -1.29249,2 z m 64.79054,-1.38488 -0.83138,-2.16654 0.0405,-0.89096 0.0405,-0.89095 1.415,2.43333 1.41502,2.43335 -0.62418,0.62416 -0.62416,0.62417 -0.83138,-2.16656 z m -76.16472,-3.28178 -2.06848,-4 h 0.66667 0.66667 l 2.06848,4 2.06848,4 h -0.66667 -0.66667 z m 88.66667,-1.33334 2.72087,-5.33333 h 0.66666 0.66667 l -2.72087,5.33333 -2.72086,5.33334 h -0.66667 -0.66667 z m -74.62583,-0.66666 v -1.33334 l 1.2925,-2 1.29249,-2 v 1.33334 1.33333 l -1.29249,2 -1.2925,2 z m -22.70751,-14 L 445.27915,200 h 0.66666 0.66667 l 2.72087,5.33333 2.72087,5.33333 h -0.66667 -0.66667 z m 78.16473,3.28178 -0.83139,-2.16654 0.0405,-0.89096 0.0405,-0.89095 1.415,2.43333 1.41501,2.43335 -0.62417,0.62416 -0.62416,0.62417 -0.83139,-2.16656 z M 553.33335,205.33333 556.05422,200 h 0.66667 0.66666 l -2.72086,5.33333 -2.72087,5.33333 h -0.66667 -0.66667 z m -66.51852,-2.81482 -1.49351,-4.28427 0.51852,-0.51851 0.51852,-0.51852 1.49351,4.28426 1.49351,4.28428 -0.51852,0.51851 -0.51852,0.51852 z m -9.44064,0.81482 v -1.33334 L 478.66668,200 l 1.2925,-2 v 1.33333 1.33333 l -1.2925,2 -1.29249,2 z m 46.12388,-1.38488 -0.83139,-2.16655 0.0405,-0.89096 0.0405,-0.89094 1.415,2.43333 1.41501,2.43334 -0.62417,0.62416 -0.62416,0.62418 -0.83139,-2.16656 z m -8.73251,0.41186 -0.0989,-0.97302 2.21779,-5.54279 2.21778,-5.5428 1.78222,2.43732 1.78221,2.43732 -0.0405,1.41183 -0.0405,1.41183 -1.52406,-2.62822 -1.52407,-2.62822 -2.33651,5.29489 -2.33649,5.29488 -0.0989,-0.97302 z m -191.80075,-66.69365 -58.62213,-62.999995 -4.838,-5.792819 -4.838,-5.792817 v -0.844307 -0.844307 l 4.33333,5.276063 4.33333,5.276063 59.1945,63.627149 59.19449,63.62715 2.80551,0.55233 2.80551,0.55235 -2.8732,0.18157 -2.87322,0.18157 z m 295.15701,62.08675 2.78847,-0.55011 58.54487,-62.96526 58.54486,-62.965263 5,-5.876388 5,-5.876386 v 0.825571 0.825572 l -5.5071,6.414426 -5.50711,6.414426 -57.93933,62.333332 -57.93935,62.33333 -2.88688,-0.18157 -2.8869,-0.18157 z m -229.03847,-1.33089 1.75,-0.7003 0.80556,0.80555 0.80554,0.80556 -2.55554,-0.1052 -2.55556,-0.1052 1.75,-0.70029 z m 90.91667,0.0872 v -1.33334 l 1.78556,-2.4419 1.78557,-2.44191 0.91248,2.37791 0.91249,2.3779 -0.69805,0.69804 -0.69805,0.69806 -0.0424,-1.88888 -0.0424,-1.8889 -1.95759,2.58818 -1.9576,2.58817 v -1.33333 z m 131.75,-0.0872 1.75,-0.7003 0.80556,0.80555 0.80555,0.80556 -2.55555,-0.1052 -2.55556,-0.1052 1.75,-0.70029 z m -217.41667,-1.30556 1.66666,-0.67252 1.66667,0.67252 1.66667,0.67252 h -3.33334 -3.33333 z m 46.09717,-3.71578 -2.19303,-4.59881 -3.45206,-0.53475 -3.45208,-0.53474 3.63957,-0.19978 3.63956,-0.19977 2.72087,5.33333 2.72086,5.33334 h -0.71533 -0.71535 z m 164.5695,3.71578 1.66667,-0.67252 1.66666,0.67252 1.66667,0.67252 h -3.33333 -3.33334 z m -203.91667,-1.36111 1.75,-0.70029 0.80556,0.80554 0.80554,0.80556 -2.55554,-0.1052 -2.55556,-0.1052 1.75,-0.70029 z m 198.66667,0 1.75,-0.70029 0.80556,0.80554 0.80555,0.80556 -2.55555,-0.1052 -2.55556,-0.1052 1.75,-0.70029 z m -193.33334,-1.33333 1.75,-0.7003 0.80556,0.80555 0.80555,0.80556 -2.55555,-0.1052 -2.55556,-0.1052 1.75,-0.70029 z m 155.55303,-2.75586 2.09879,-4.33333 3.63243,0.19977 3.63242,0.19978 -3.66666,0.55545 -3.66667,0.55545 v 0.98994 0.98993 l -2.06455,2.58817 L 559.87093,194 Z m 32.44698,2.75586 1.75,-0.7003 0.80556,0.80555 0.80554,0.80556 -2.55554,-0.1052 -2.55556,-0.1052 1.75,-0.70029 z m -182.66668,-1.33334 1.75,-0.70029 0.80556,0.80555 0.80555,0.80556 -2.55555,-0.1052 -2.55556,-0.1052 1.75,-0.7003 z m 177.33334,0 1.75,-0.70029 0.80556,0.80555 0.80555,0.80556 -2.55555,-0.1052 -2.55556,-0.1052 1.75,-0.7003 z m -172,-1.33333 1.75,-0.70029 0.80556,0.80554 0.80554,0.80556 -2.55554,-0.1052 -2.55556,-0.1052 1.75,-0.70029 z m 166.66667,0 1.75,-0.70029 0.80556,0.80554 0.80555,0.80556 -2.55555,-0.1052 -2.55556,-0.1052 1.75,-0.70029 z m -161.33334,-1.33333 1.75,-0.7003 0.80556,0.80555 0.80555,0.80556 -2.55555,-0.1052 -2.55556,-0.1052 1.75,-0.70029 z m 156.00001,0 1.75,-0.7003 0.80556,0.80555 0.80554,0.80556 -2.55554,-0.1052 -2.55556,-0.1052 1.75,-0.70029 z m -150.66668,-1.33334 1.75,-0.70029 0.80556,0.80555 0.80555,0.80556 -2.55555,-0.1052 -2.55556,-0.1052 1.75,-0.7003 z m 145.33334,0 1.75,-0.70029 0.80556,0.80555 0.80555,0.80556 -2.55555,-0.1052 -2.55556,-0.1052 1.75,-0.7003 z M 141.4386,99.22222 l 0.10526,-2.555556 0.70029,1.75 0.70029,1.749996 -0.80554,0.80556 -0.80556,0.80555 0.10533,-2.55555 z m 718.6667,0 0.1052,-2.555556 0.70029,1.75 0.70029,1.749996 -0.80554,0.80556 -0.80556,0.80555 0.1052,-2.55555 z m -717.33336,-5.333333 0.1052,-2.555556 0.70029,1.75 0.70029,1.75 -0.80554,0.805556 -0.80556,0.805555 0.10533,-2.555555 z m 716.00002,0 0.1052,-2.555556 0.7003,1.75 0.70029,1.75 -0.80555,0.805556 -0.80556,0.805555 0.1052,-2.555555 z m -714.66669,-5.333333 0.1052,-2.555556 0.70029,1.75 0.7003,1.75 -0.80555,0.805556 -0.80556,0.805554 0.10533,-2.555554 z m 713.33336,0 0.1052,-2.555556 0.70029,1.75 0.7003,1.75 -0.80555,0.805556 -0.80556,0.805554 0.1052,-2.555554 z m -712.00003,-5.333333 0.1052,-2.555556 0.7003,1.75 0.70029,1.75 -0.80555,0.805556 -0.80556,0.805554 0.10534,-2.555554 z m 708.67908,-6.673203 -2.23069,-8.880421 0.54901,-0.54902 0.54903,-0.549019 2.23068,8.88042 2.23069,8.880421 -0.54901,0.54902 -0.54903,0.549019 z m -706.61794,-0.54902 0.84621,-4.666666 1.16693,-2.666667 1.16694,-2.666667 -0.84622,4.666667 -0.84621,4.666666 -1.16693,2.666667 -1.16694,2.666667 z m 29.21443,-36.999999 25.4233,-25.666666 h 1.48254 1.48252 l -8.88459,8.279188 -8.8846,8.279186 -18.02124,17.38748 -18.02124,17.387478 z M 841.29999,55.210975 831.33336,45.088619 814.39289,29.210975 797.45244,13.333333 h 1.53839 1.5384 l 26.06873,25.990778 26.06874,25.990778 -0.70005,0.0092 -0.70004,0.0092 z m -589.96665,-0.54431 -2.06848,-4 h 0.66667 0.66666 l 2.06849,4 2.06848,4 h -0.66667 -0.66667 z m 498.66668,0 2.06849,-4 h 0.66666 0.66667 l -2.06848,4 -2.06848,4 h -0.66667 -0.66667 z m -502.39768,-6.333333 -0.55504,-1 -3.74308,-6.666666 -3.74307,-6.666667 1.3755,1.333333 1.3755,1.333334 3.6373,6.333333 3.63728,6.333333 h -0.71467 -0.71468 z m 507.73102,-3 2.06848,-4 h 0.66667 0.66666 l -2.06848,4 -2.06848,4 h -0.66666 -0.66667 z m 4.66667,-8 1.42716,-2.666666 h 0.66666 0.66667 l -1.42716,2.666666 -1.42716,2.666667 h -0.66667 -0.66666 z m -523.33336,-7.999999 -2.06848,-4 h 0.66667 0.66667 l 2.06848,4 2.06848,4 h -0.66667 -0.66667 z m 528.00002,0 2.06848,-4 h 0.66667 0.66667 l -2.06848,4 -2.06848,4 h -0.66667 -0.66667 z m 12,-9.333333 2.66667,-1.145906 h 2 2 L 780.66669,20 l -2.66666,1.145905 h -2 -2 z m -555.58335,-0.910819 1.75,-0.700292 0.80556,0.805555 0.80555,0.805556 -2.55555,-0.105267 -2.55556,-0.105267 1.75,-0.700292 z m -9.33333,-2.666667 1.75,-0.700292 0.80556,0.805555 0.80554,0.805556 -2.55554,-0.105263 -2.55556,-0.105264 z M 790.00003,16 l 2.66666,-1.145906 h 2 2 L 794.00003,16 l -2.66667,1.145905 h -2 -2 z"
         id="path1507271" />
      <path
         style="fill:#1e3030;stroke-width:1.33333"
         d="m 459.81351,985.772 -2.18649,-0.57766 -6.81351,-12.89258 -6.8135,-12.89256 v -3.3205 -3.32051 l 9.41437,-9.21135 9.41437,-9.21136 -0.70505,-1.83732 -0.70504,-1.83732 -11.77206,-15.66877 -11.77205,-15.66876 -2.96387,-4.24319 -2.96387,-4.24317 -0.59334,-5.09016 -0.59336,-5.09015 -1.47314,-16.49134 -1.47312,-16.49136 -1.24025,-3.26211 -1.24025,-3.26212 v -1.19605 -1.19604 l 14.17374,-16.05049 14.17375,-16.05048 1.15959,-0.0457 1.15959,-0.0456 h 45.33333 45.33333 l 1.12547,0.0456 1.12545,0.0457 13.26786,15 13.26785,15 1.03483,1.69273 1.03481,1.69273 -1.38514,4.30727 -1.38515,4.30727 -2.09021,21.25387 -2.09022,21.25387 -14.74402,19.96173 -14.74402,19.96174 -0.62312,1.62381 -0.62312,1.62381 9.41437,9.21136 9.41437,9.21135 -0.007,3.28256 -0.007,3.28256 -6.0793,11.69264 -6.07931,11.69264 -2.91344,1.84795 -2.91346,1.84794 -14,-1.3151 -14,-1.31512 -23.62134,0.79898 -23.62135,0.79898 -1.71199,0.48373 -1.71198,0.48372 -2.18651,-0.57767 z m -121.34549,-97.27113 -18.19865,-28.56293 1.9902,-7.63565 1.99021,-7.63564 1.02116,-1.83292 1.02116,-1.83294 8.59818,10.64942 8.59818,10.6494 7.13267,26.86218 7.13268,26.86217 -0.54357,0.51992 -0.54356,0.51992 z m 307.56469,23.52636 0.98031,-4.63941 6.23568,-22.81655 6.23567,-22.81654 8.45903,-10.35211 8.45901,-10.35212 1.00725,1.80807 1.00726,1.80808 1.99461,7.65246 1.9946,7.65248 -17.33208,27.01419 -17.33207,27.0142 -1.34479,1.33333 -1.34478,1.33333 z m -502.03936,-45.69392 -0.007,-1.66666 3.30436,-25.33334 3.30438,-25.33333 2.05052,-16.57045 2.05051,-16.57044 0.56078,-0.56079 0.56079,-0.5608 35.75765,18.98468 35.75766,18.98468 0.3654,0.28973 0.3654,0.28975 -41.43608,24.85681 -41.43609,24.85683 H 144.59599 144 l -0.007,-1.66667 z m 672.44568,-22.76368 -40.22768,-24.23632 -0.7035,-0.70894 -0.70348,-0.70894 36.02296,-19.08814 36.02298,-19.08815 0.55008,0.55009 0.55008,0.55008 2.705,20.58034 2.70499,20.58033 1.99894,16.66667 1.99895,16.66666 0.82595,6.33334 0.82594,6.33333 -1.17177,-0.0971 -1.17177,-0.0969 -40.22767,-24.23633 z m -707.55931,-202.5527 -0.86996,-19.01695 -0.005,-8.08709 -0.005,-8.08711 10.33334,-3.76173 10.33333,-3.76174 14.66667,-5.28006 14.66667,-5.28006 12.66666,-4.44748 12.66667,-4.44748 12.66667,-4.64011 12.66666,-4.64011 20.57866,-7.47952 20.57865,-7.47952 1.29179,0.4306 1.29177,0.43059 -14.53709,10.51621 -14.53711,10.51622 -20.66667,15.33624 -20.66666,15.33622 -12,8.84809 -12,8.84808 -20.72226,15.35216 -20.72225,15.35215 -3.40291,2.22967 -3.40291,2.22968 z m 759.0074,1.08144 -24.55376,-17.90521 -8,-6.04424 -8,-6.04423 -10.66667,-7.83901 -10.66666,-7.83901 -21.33334,-15.73195 -21.33333,-15.73193 -6.38749,-4.79668 -6.38749,-4.79668 1.11744,-0.37248 1.11745,-0.37248 7.27004,2.60109 7.27005,2.60111 11.33333,4.21242 11.33334,4.21243 13.33333,4.75717 13.33333,4.75716 10,3.63416 10,3.63415 17.33334,6.26335 17.33333,6.26333 11.74472,4.18748 11.74471,4.18748 -0.91284,26.69876 -0.91284,26.69876 -0.27812,0.33513 -0.27812,0.33513 z m -485.22044,-53.42596 -20.66667,-9.72928 -6.66666,-0.91608 -6.66667,-0.91609 -6.16243,-1.7662 -6.16241,-1.7662 -3.97656,-2.05636 -3.97658,-2.05636 -6.94534,-7.59932 -6.94536,-7.59933 -5.81959,-9.94159 -5.81957,-9.9416 0.70693,-1.84224 0.70693,-1.84225 8.19699,-3.98704 8.19699,-3.98706 14,-3.50816 14,-3.50816 8.87323,0.62502 8.87322,0.62501 4.58875,2.836 4.58873,2.836 7.67622,16.50244 7.6762,16.50243 9.81734,0.74248 9.81734,0.74248 1.16222,0.7183 1.16224,0.7183 -2.43324,15.72122 -2.43324,15.72122 -0.74492,4.33333 -0.74493,4.33333 -1.60624,-0.13253 -1.60625,-0.13253 -20.66667,-9.72927 z m 213.25687,8.99424 -0.0764,-1 -3.05473,-18.66666 -3.05473,-18.66667 1.06021,-1.19569 1.06023,-1.1957 10.00009,-0.64177 10.00011,-0.64176 1.92105,-4.16255 1.92107,-4.16253 5.68354,-12.34844 5.68355,-12.34844 4.54956,-2.81179 4.54956,-2.81177 8.42857,-0.67657 8.42859,-0.67656 7.1548,1.622 7.15479,1.62201 11.15725,3.3056 11.15726,3.30561 4.48014,2.90918 4.48014,2.90917 0.59986,1.52535 0.59986,1.52533 -5.76962,9.808 -5.76962,9.80799 -7.50571,8.25177 -7.50569,8.25179 -7.6286,2.87225 -7.6286,2.87225 -8.66667,1.36192 -8.66667,1.36191 -21.24984,9.84739 -21.24984,9.84738 h -1.08349 -1.0835 l -0.0764,-1 z m -161.28859,-153.36658 -18.03171,-24.96675 -18.63496,-9.38525 -18.63494,-9.38527 -62.97823,-31.94806 -62.97822,-31.94808 -0.0217,-0.87464 -0.0217,-0.87464 28.414,-26.89452 28.41401,-26.89451 13.72541,-38.59362 13.72543,-38.59364 -5.52535,-7.16187 -5.52533,-7.16186 -7.67615,-9.13967 -7.67613,-9.13967 -3.93795,-0.8446 -3.93804,-0.84458 -23,-0.15776 -23,-0.15775 -0.0473,-29.66667 L 257.2389,110 255.61947,107.19251 254.00006,104.38503 228.4063,80.859179 202.81254,57.333332 h -1.17371 -1.17371 l -13.7999,10.731897 -13.79991,10.731897 -1.43263,1.74846 -1.43262,1.74846 -14.33334,12.962796 -14.33333,12.962798 v -2.34428 -2.34427 l 4.83377,-18.765545 4.83379,-18.765547 10.83288,-11.097918 10.83289,-11.09792 15.56372,-14.622613 15.56372,-14.622613 14.67544,4.228607 14.67543,4.228608 11.615,20.158591 11.61499,20.158592 4.02427,4.666666 4.02426,4.666667 58.58171,62.999995 58.58172,63 1.53988,-0.012 1.53987,-0.012 24.47217,-5.98804 24.47218,-5.98804 2.19449,0.008 2.19449,0.008 12,22.1396 12.00001,22.13959 1.72417,0.6833 1.72417,0.6833 0.70102,-0.70103 0.70101,-0.70101 7.35519,-17.79703 7.35518,-17.79704 1.04739,-1.09442 1.04737,-1.09442 5.32195,15.09441 5.32195,15.09443 2.29078,7 2.29079,7 h 2.45001 2.45003 l 3.62632,-11 3.62633,-11 3.97995,-11.10321 3.97995,-11.10323 1.03844,1.10323 1.03845,1.10321 6.85457,16.66667 6.85459,16.66666 2.02501,2 2.02503,2 1.6688,-2.24669 1.66881,-2.24668 11.20485,-20.75332 11.20482,-20.75224 h 2.23936 2.23936 l 24.47218,5.98804 24.47217,5.98804 1.55356,0.012 1.55355,0.012 57.9,-62.33333 57.89999,-62.333332 4.68692,-5.333333 4.68692,-5.333333 11.54053,-20.069656 11.54055,-20.069655 14.75008,-4.322401 14.75008,-4.322402 15.56892,14.627472 15.56891,14.62747 10.80601,11.09792 10.80601,11.097918 4.86066,18.790589 4.86065,18.790593 v 2.29444 2.29445 l -19,-17.188898 -19,-17.188818 -10.42068,-8.22955 -10.42068,-8.229552 h -1.31889 -1.3189 l -25.59376,23.525847 -25.59376,23.525851 -1.61941,2.80748 -1.61943,2.80749 -0.0472,29.54397 -0.0472,29.54396 -25.66667,0.45628 -25.66666,0.45627 -2.2104,1.33309 -2.21042,1.33309 -12.12292,15.1659 -12.12293,15.16589 -0.005,0.8341 -0.005,0.83411 13.5893,38.22637 13.5893,38.22638 28.41559,26.87094 28.4156,26.87095 -0.009,0.90268 -0.009,0.90268 -72.32365,36.62461 -72.32364,36.6246 -9.33334,4.70873 -9.33333,4.70872 -18,24.96644 -18,24.96644 -1.55579,0.0336 -1.55579,0.0336 -22.27081,-36 -22.2708,-36 h -1.0488 -1.04879 l -22.24922,36 -22.24923,36 -1.54205,-0.0332 -1.54206,-0.0332 -18.03172,-24.96676 z M 121.42124,440.31532 94.175807,424.71604 98.087905,423.7518 102,422.78755 l 29.22194,-2.06073 29.22195,-2.06074 0.3528,0.3528 0.35278,0.3528 -2.40837,8.6475 -2.40839,8.64748 -2.88948,9.66666 -2.88948,9.66667 -0.94355,-0.0427 -0.94353,-0.0427 -27.24543,-15.5993 z m 729.43269,11.35134 -1.35289,-4.33334 -4.18,-13.79273 -4.18,-13.79273 0.55872,-0.55871 0.55872,-0.55872 29.20411,2.07272 29.20411,2.07273 3.76916,0.94539 3.76916,0.94539 -27.41712,15.66666 -27.41711,15.66667 h -0.58197 -0.58199 z M 138.66667,393.14494 115.33334,377.2218 112.66667,375.25976 110,373.29772 l 40,0.84304 40.00001,0.84303 0.51394,0.46649 0.51395,0.46648 -2.08843,3.18735 -2.08842,3.18733 -5.09219,6.0198 -5.09219,6.0198 -5.8659,7.50114 -5.86591,7.50114 -1.46743,-0.13262 -1.46742,-0.13264 z m 689.30025,3.85505 -9.80632,-12.33333 -3.98915,-4.31336 -3.98914,-4.31336 0.57552,-0.55458 0.57553,-0.55456 40.66667,-0.94536 40.66667,-0.94536 -1.33334,1.2692 -1.33333,1.2692 -24.99891,16.87743 -24.99892,16.87741 h -1.11448 -1.11448 z m -599.64658,-81.37976 -13.55029,-10.95357 -0.76147,-2.66667 -0.76147,-2.66666 0.37644,-30 0.37646,-30 14.47214,43.08341 14.47214,43.08341 -0.53683,0.53683 -0.53681,0.53683 z m 531.67969,10.16016 v -1.11309 l 14.33333,-42.66699 14.33333,-42.66698 0.37646,30 0.37644,30 -0.74651,2.66666 -0.74651,2.66667 -7.58612,6 -7.5861,6 -6.37716,5.11343 -6.37716,5.11341 z m -569.22386,-110.93374 -15.22383,-3.52299 -0.47584,-1.42753 -0.47585,-1.42754 36.03506,-16.45446 36.03508,-16.45447 0.9068,0.90682 0.9068,0.9068 -3.97705,4.31336 -3.97707,4.31336 -15.08197,16.33333 -15.08196,16.33333 -2.18317,-0.14851 -2.18316,-0.1485 z m 582.6085,-16.45395 -18.71798,-20.27396 v -1.15713 -1.15715 l 1.89807,0.43111 1.89808,0.43109 34.79139,15.93163 34.79138,15.93162 -0.4608,1.38238 -0.46078,1.38237 -15.89534,3.62387 -15.89533,3.62386 -1.61536,0.0621 -1.61535,0.0621 z"
         id="path1507269" />
    </g>
  </g>
</svg>
