ML1G038500.1																																						
ML1G047500.1																																						
ML1G080700.1																																						
ML1G162300.1																																						
ML1G237800.1																																						
ML1G294600.1																																						
ML1G301100.1																																						
ML1G341800.1																																						
ML2G105200.1																																						
ML2G179200.1																																						
ML2G206400.1																																						
ML2G222200.1																																						
ML2G233700.1																																						
ML2G253700.1																																						
ML2G292700.1																																						
ML2G396300.1																																						
ML2G424700.1																																						
ML3G097300.1																																						
ML3G108200.1																																						
ML3G141800.1																																						
ML3G142100.1																																						
ML3G166100.1																																						
ML3G166400.1																																						
ML3G170000.1																																						
ML3G179000.1																																						
ML3G199200.1																																						
ML3G235200.1																																						
ML3G241900.1																																						
ML3G255300.3																																						
ML3G260000.1																																						
ML3G266000.1																																						
ML3G287700.1																																						
ML3G291500.1																																						
ML3G296800.1																																						
ML3G343400.1																																						
ML4G092100.1																																						
ML4G118900.1																																						
ML4G119200.1																																						
ML4G136400.1																																						
ML4G156300.1																																						
ML4G168800.1																																						
ML4G188500.1																																						
ML4G193100.1																																						
ML4G202400.1																																						
ML4G203600.1																																						
ML4G229300.1																																						
ML4G229300.3																																						
ML4G269100.2																																						
ML4G273400.1																																						
ML4G291700.2																																						
ML4G293500.1																																						
ML4G312800.1																																						
ML4G314500.1																																						
ML5G034300.1																																						
ML5G043900.1																																						
ML5G080300.1																																						
ML5G084000.1																																						
ML5G107300.1																																						
ML5G120100.1																																						
ML5G124500.1																																						
ML5G149900.1																																						
ML5G149900.2																																						
ML5G158900.1																																						
ML5G163800.1																																						
ML5G177100.1																																						
ML5G197200.1																																						
ML5G199700.1																																						
ML5G204700.1																																						
ML5G209000.1																																						
ML5G214900.1																																						
ML5G219700.1																																						
ML5G222200.1																																						
ML5G233500.1																																						
ML5G253600.1																																						
ML5G257900.1																																						
ML5G267800.1																																						
ML6G030700.1																																						
ML6G073400.1																																						
ML6G073400.2																																						
ML6G149000.1																																						
ML6G151900.1																																						
ML6G153600.1																																						
ML6G173000.1																																						
ML6G176100.1																																						
ML6G177000.1																																						
ML6G187600.1																																						
ML6G191900.1																																						
ML6G204500.1																																						
ML6G229200.1																																						
ML6G229300.1																																						
ML6G234000.1																																						
ML6G269900.1																																						
ML6G270200.1																																						
ML6G270200.2																																						
ML6G295200.1																																						
ML6G301200.1																																						
ML6G364800.2																																						
ML6G376000.1																																						
ML6G385000.1																																						
ML6G386300.1																																						
ML6G426600.1																																						
ML6G474900.1																																						
ML6G481600.1																																						
ML6G486100.1																																						
ML6G489400.1																																						
ML6G504000.1																																						
ML6G517100.1																																						
ML6G604400.1																																						
ML6G605400.1																																						
ML7G029300.1																																						
ML7G059700.1																																						
ML7G077300.1																																						
ML7G104000.1																																						
ML7G134200.1																																						
ML7G140700.1																																						
ML7G142800.1																																						
ML7G160600.1																																						
ML7G165200.1																																						
ML7G165900.1																																						
ML7G186700.1																																						
ML7G225000.1																																						
ML8G033400.1																																						
ML8G034500.1																																						
ML8G116900.1																																						
ML8G134000.1																																						
ML8G140000.1																																						
ML8G147100.1																																						
ML8G153800.1																																						
ML8G167300.1																																						
ML8G173100.1																																						
ML8G176700.1																																						
MLNG015500.1																																						
