ML2G105200.1
ML2G233700.1
ML2G248200.1
ML2G396300.1
ML2G424700.1
ML2G424900.1
ML3G097300.1
ML3G108200.1
ML3G141800.1
ML3G142100.1
ML3G166100.1
ML3G170000.1
ML3G199200.1
ML3G287700.1
ML3G338700.1
ML4G118900.1
ML4G119200.1
ML4G202400.1
ML4G273400.1
ML4G293500.1
ML4G312800.1
ML4G314500.1
ML5G043900.1
ML5G222200.1
ML5G257900.1
ML5G301000.1
ML6G030700.1
ML6G149000.1
ML6G151900.1
ML6G173000.1
ML6G193800.1
ML6G295200.1
ML6G301200.1
ML6G385000.1
ML6G386300.1
ML6G474900.1
ML6G481600.1
ML6G504000.1
ML6G517100.1
ML6G604400.1
ML7G140700.1
ML7G142800.1
ML7G160600.1
ML7G165900.1
ML8G034500.1
ML8G064700.1
ML8G147100.1
ML8G153800.1
ML8G173100.1
