OG0016999
OG0017005
OG0017012
OG0017015
OG0017018
OG0017024
OG0017055
OG0017058
OG0017060
OG0017072
OG0017076
OG0017082
OG0017083
OG0017088
OG0017089
OG0017091
OG0017102
OG0017112
OG0017117
OG0017119
OG0017122
OG0017130
OG0017137
OG0017138
OG0017154
OG0017164
OG0017171
OG0017182
OG0017185
OG0017187
OG0017190
OG0017195
OG0017197
OG0017198
OG0017201
OG0017216
OG0017217
OG0017224
OG0017225
OG0017241
OG0017242
OG0017243
OG0017245
OG0017248
OG0017249
OG0017250
OG0017251
OG0017258
OG0017275
OG0017276
OG0017279
OG0017284
OG0017288
OG0017292
OG0017294
OG0017297
OG0017302
OG0017305
OG0017312
OG0017327
OG0017333
OG0017341
OG0017348
OG0017350
OG0017352
OG0017355
OG0017356
OG0017357
OG0017360
OG0017373
OG0017375
OG0017376
OG0017380
OG0017381
OG0017382
OG0017386
OG0017391
OG0017405
OG0017408
OG0017409
OG0017412
OG0017415
OG0017422
OG0017436
OG0017449
OG0017458
OG0017460
OG0017465
OG0017466
OG0017474
OG0017477
OG0017479
OG0017481
OG0017483
OG0017484
OG0017485
OG0017488
OG0017492
OG0017494
OG0017501
OG0017508
OG0017515
OG0017516
OG0017517
OG0017518
OG0017520
OG0017522
OG0017539
OG0017542
OG0017562
OG0017563
OG0017565
OG0017579
OG0017581
OG0017582
OG0017584
OG0017590
OG0017593
OG0017601
OG0017607
OG0017610
OG0017613
OG0017618
OG0017619
OG0017623
OG0017629
OG0017633
OG0017651
OG0017662
OG0017667
OG0017679
OG0017684
OG0017686
OG0017688
OG0017694
OG0017724
OG0017727
OG0017735
OG0017737
OG0017740
OG0017741
OG0017744
OG0017746
OG0017760
OG0017771
OG0017783
OG0017787
OG0017788
OG0017792
OG0017799
OG0017801
OG0017803
OG0017805
OG0017810
OG0017812
OG0017816
OG0017817
OG0017821
OG0017832
OG0017837
OG0017839
OG0017843
OG0017848
OG0017854
OG0017867
OG0017868
OG0017874
OG0017888
OG0017892
OG0017901
OG0017911
OG0017918
OG0017919
OG0017920
OG0017921
OG0017924
OG0017933
OG0017934
