MV1G003200.1
MV1G004000.1
MV1G004900.2
MV1G005300.1
MV1G005600.1
MV1G005800.1
MV1G007600.1
MV1G007900.1
MV1G009900.1
MV1G011300.2
MV1G011700.1
MV1G013100.1
MV1G013600.1
MV1G013800.1
MV1G014500.1
MV1G014800.1
MV1G018900.1
MV1G018900.2
MV1G019200.1
MV1G019300.1
MV1G020400.1
MV1G021400.1
MV1G023200.1
MV1G023500.1
MV1G023700.1
MV1G026100.1
MV1G026600.1
MV1G026900.1
MV1G027000.1
MV1G027100.1
MV1G027500.1
MV1G029000.1
MV1G029400.1
MV1G031800.1
MV1G032400.1
MV1G033100.1
MV1G034700.1
MV1G036100.1
MV1G036500.1
MV1G038100.1
MV1G038400.1
MV1G038500.1
MV1G040000.1
MV1G044500.1
MV1G044900.2
MV1G046500.1
MV1G047200.1
MV1G047300.1
MV1G048700.1
MV1G049300.1
MV1G049400.1
MV1G050000.1
MV1G050100.1
MV1G051900.1
MV1G052300.1
MV1G052400.1
MV1G052600.1
MV1G055800.1
MV1G056100.1
MV1G057000.1
MV1G057300.1
MV1G058900.2
MV1G060600.1
MV1G061800.1
MV1G061900.1
MV1G062600.2
MV1G064600.1
MV1G066200.1
MV1G068100.1
MV1G068400.1
MV1G068800.1
MV1G069800.1
MV1G070600.1
MV1G074700.1
MV1G075400.1
MV1G077700.1
MV1G077900.1
MV1G078000.1
MV1G078100.1
MV1G078300.1
MV1G081100.1
MV1G082900.1
MV1G088200.1
MV1G088500.1
MV1G088700.1
MV1G090100.1
MV1G090500.1
MV1G091400.1
MV1G093400.1
MV1G096300.2
MV1G097300.1
MV1G097600.1
MV1G097800.1
MV1G099400.1
MV1G099700.1
MV1G102000.1
MV1G102200.1
MV1G102700.1
MV1G102900.1
MV1G103100.1
MV1G104000.1
MV1G107100.1
MV1G107100.2
MV1G108000.1
MV1G108100.1
MV1G108300.1
MV1G109300.1
MV1G109600.1
MV1G109800.1
MV1G110000.1
MV1G112000.1
MV1G112400.1
MV1G112700.1
MV1G113200.1
MV1G113300.1
MV1G114600.1
MV1G115600.1
MV1G119100.1
MV1G119600.1
MV1G119800.1
MV1G121000.1
MV1G121200.1
MV1G122600.1
MV1G123200.2
MV1G132500.1
MV1G133400.1
MV1G133600.1
MV1G134100.1
MV1G134900.1
MV1G136600.1
MV1G136700.2
MV1G136900.1
MV1G137400.1
MV1G137600.1
MV1G138500.1
MV1G138600.1
MV1G139600.2
MV1G140700.1
MV1G141200.1
MV1G142500.1
MV1G146200.1
MV1G147000.1
MV1G147700.2
MV1G147800.1
MV1G148500.1
MV1G152000.1
MV1G152300.1
MV1G153100.1
MV1G153300.1
MV1G154600.1
MV1G155600.1
MV1G157600.1
MV1G158200.1
MV1G158300.1
MV1G158800.1
MV1G161000.1
MV1G161100.1
MV1G161200.1
MV1G161300.1
MV1G161800.1
MV1G164000.1
MV1G164000.2
MV1G165100.1
MV1G165200.1
MV1G165300.1
MV1G165400.1
MV1G166000.1
MV1G169800.1
MV1G172700.1
MV1G178200.1
MV1G178500.1
MV1G179300.1
MV1G179900.1
MV1G180800.1
MV1G181100.1
MV1G183100.1
MV1G184200.1
MV1G184800.1
MV1G185400.1
MV1G185500.1
MV1G186600.1
MV1G187000.1
MV1G187400.1
MV1G189200.1
MV1G190000.1
MV1G191300.1
MV1G196100.1
MV1G199700.1
MV1G204000.1
MV1G204100.1
MV1G205500.1
MV1G206000.1
MV1G207500.1
MV1G210500.1
MV1G210700.1
MV1G211700.1
MV1G211900.1
MV1G212900.1
MV1G215300.1
MV1G218300.1
MV1G222400.1
MV1G224600.1
MV1G225000.1
MV1G225200.1
MV1G225500.1
MV1G225700.1
MV1G226300.1
MV1G227100.1
MV1G228700.1
MV1G229800.1
MV1G231700.1
MV1G232500.1
MV1G232800.1
MV1G233000.1
MV1G233100.1
MV1G233300.1
MV1G234500.1
MV1G235000.1
MV1G235200.1
MV1G236200.1
MV1G237400.1
MV1G238500.1
MV1G238700.1
MV1G240100.1
MV1G240300.1
MV1G241700.1
MV1G242500.1
MV1G242500.2
MV1G243300.1
MV1G243300.2
MV1G243400.1
MV1G243500.1
MV1G243800.1
MV1G244000.1
MV1G244200.1
MV1G244800.1
MV1G245700.1
MV1G249100.1
MV1G249700.1
MV1G249900.1
MV1G251200.1
MV1G254800.1
MV1G258000.1
MV1G259500.1
MV1G259600.1
MV1G259900.1
MV1G261100.1
MV1G262200.1
MV1G263600.1
MV1G264000.1
MV1G265200.1
MV1G265400.2
MV1G266400.1
MV1G267800.2
MV1G269200.1
MV1G269600.1
MV1G269900.1
MV1G271400.1
MV1G271500.1
MV1G272300.1
MV1G273400.1
MV1G274000.1
MV1G275000.1
MV1G275800.1
MV1G277600.1
MV1G278000.1
MV1G278100.1
MV1G279200.1
MV1G279600.1
MV1G281500.1
MV1G284400.1
MV1G286000.1
MV1G286300.1
MV1G286700.1
MV1G288000.1
MV1G288300.1
MV1G290100.1
MV1G291800.1
MV1G291900.1
MV1G292100.1
MV1G294100.1
MV1G294900.1
MV1G296200.1
MV1G299800.1
MV1G299900.1
MV1G300500.1
MV1G300600.1
MV1G301300.1
MV1G301500.1
MV1G301800.1
MV1G302200.1
MV1G303300.1
MV1G304400.1
MV1G305000.1
MV1G306100.2
MV1G307700.1
MV1G308000.1
MV1G310400.1
MV1G310500.1
MV1G310600.1
MV1G310900.1
MV1G310900.2
MV1G311000.1
MV1G311100.1
MV1G311900.1
MV1G312700.1
MV1G316400.1
MV1G317700.1
MV1G319100.2
MV1G320200.1
MV1G320600.1
MV1G321200.1
MV1G321300.1
MV1G322500.1
MV1G322700.1
MV1G322800.1
MV1G323000.1
MV1G323100.1
MV1G323400.1
MV1G323500.1
MV1G324100.1
MV1G324500.1
MV1G331600.1
MV1G332600.1
MV1G333800.1
MV1G335300.1
MV1G335400.1
MV1G336200.2
MV1G340100.1
MV1G340500.1
MV1G341100.1
MV1G341900.1
MV1G342000.1
MV1G342800.1
MV1G347100.1
MV1G347400.1
MV1G347600.1
MV1G349300.1
MV1G349700.1
MV1G349800.1
MV1G350100.1
MV1G351200.1
MV1G354000.1
MV1G354500.1
MV1G355600.1
MV1G356000.1
MV1G357200.1
MV1G357700.1
MV1G357800.1
MV1G360300.1
MV2G003300.1
MV2G004500.1
MV2G004500.2
MV2G004900.1
MV2G006000.1
MV2G006100.1
MV2G007200.1
MV2G007200.2
MV2G009000.1
MV2G010100.1
MV2G012400.1
MV2G013300.1
MV2G013400.1
MV2G013500.1
MV2G016700.1
MV2G016900.1
MV2G017600.1
MV2G018000.1
MV2G018000.2
MV2G019400.1
MV2G019500.1
MV2G021900.1
MV2G021900.2
MV2G022600.1
MV2G026000.1
MV2G026100.1
MV2G026300.1
MV2G026300.2
MV2G026700.2
MV2G027400.1
MV2G027600.1
MV2G027900.1
MV2G028100.1
MV2G028200.1
MV2G028300.1
MV2G028500.1
MV2G028600.1
MV2G028700.1
MV2G028800.1
MV2G028900.1
MV2G029000.1
MV2G029100.1
MV2G029200.1
MV2G030800.1
MV2G031300.1
MV2G031500.1
MV2G033300.1
MV2G033400.1
MV2G033900.1
MV2G034400.2
MV2G034900.1
MV2G035900.1
MV2G036000.1
MV2G037800.1
MV2G038100.1
MV2G038600.1
MV2G040400.1
MV2G040700.1
MV2G040800.1
MV2G041700.1
MV2G042100.1
MV2G043000.1
MV2G043700.1
MV2G046200.2
MV2G046400.1
MV2G046400.2
MV2G046500.2
MV2G046600.1
MV2G046800.1
MV2G047700.1
MV2G048900.1
MV2G049100.1
MV2G049800.1
MV2G050700.1
MV2G052400.1
MV2G053000.1
MV2G053100.1
MV2G053300.1
MV2G053500.1
MV2G054700.1
MV2G055300.1
MV2G055400.1
MV2G055500.1
MV2G055700.1
MV2G056200.1
MV2G056300.1
MV2G056700.2
MV2G057800.1
MV2G058200.1
MV2G060600.1
MV2G061800.1
MV2G062600.1
MV2G064100.1
MV2G064400.1
MV2G066700.1
MV2G068300.1
MV2G068400.1
MV2G068500.1
MV2G068600.1
MV2G069800.1
MV2G070000.1
MV2G072100.1
MV2G073400.1
MV2G074200.1
MV2G074300.1
MV2G074800.1
MV2G076100.1
MV2G076300.1
MV2G076400.1
MV2G076500.1
MV2G076600.1
MV2G076700.1
MV2G077100.1
MV2G078600.1
MV2G079100.1
MV2G079600.1
MV2G082400.1
MV2G084000.1
MV2G084100.1
MV2G084200.2
MV2G085000.1
MV2G085100.1
MV2G086500.1
MV2G088200.1
MV2G088600.1
MV2G091300.1
MV2G091500.1
MV2G091600.1
MV2G092800.1
MV2G093500.1
MV2G093600.1
MV2G095300.2
MV2G098400.1
MV2G098500.1
MV2G102100.1
MV2G102200.1
MV2G102300.1
MV2G102700.1
MV2G102800.1
MV2G103400.1
MV2G109500.1
MV2G110400.1
MV2G111000.1
MV2G111100.1
MV2G111200.1
MV2G112300.1
MV2G112400.1
MV2G113500.1
MV2G113800.1
MV2G114000.1
MV2G114100.1
MV2G115100.1
MV2G115600.1
MV2G116100.1
MV2G116700.1
MV2G117700.1
MV2G117900.1
MV2G120600.1
MV2G120700.1
MV2G121000.1
MV2G121200.1
MV2G125000.1
MV2G125200.1
MV2G125300.1
MV2G126000.1
MV2G126300.1
MV2G126700.1
MV2G126900.1
MV2G127500.1
MV2G127600.1
MV2G128500.1
MV2G128600.1
MV2G129600.1
MV2G130500.1
MV2G132100.1
MV2G135100.1
MV2G136200.1
MV2G137000.1
MV2G137400.1
MV2G137700.1
MV2G137900.1
MV2G138200.1
MV2G140500.1
MV2G142200.1
MV2G142500.1
MV2G142600.1
MV2G143900.1
MV2G145500.1
MV2G146500.1
MV2G146800.1
MV2G147000.1
MV2G148400.2
MV2G149500.1
MV2G150100.1
MV2G151000.1
MV2G151700.1
MV2G154400.1
MV2G154600.1
MV2G155300.1
MV2G155400.1
MV2G156000.1
MV2G156400.1
MV2G156500.1
MV2G156900.1
MV2G158700.1
MV2G159000.1
MV2G159100.1
MV2G159600.1
MV2G159700.1
MV2G160400.1
MV2G160800.1
MV2G161300.1
MV2G162400.1
MV2G164000.1
MV2G164700.1
MV2G164800.1
MV2G165000.1
MV2G166100.1
MV2G166200.1
MV2G167000.1
MV2G167100.1
MV2G167100.2
MV2G167700.1
MV2G170300.1
MV2G171200.1
MV2G173200.1
MV2G174000.1
MV2G174700.1
MV2G175000.1
MV2G175500.1
MV2G175600.1
MV2G176100.1
MV2G176400.1
MV2G177000.1
MV2G177200.1
MV2G177300.1
MV2G177800.1
MV2G178800.1
MV2G182500.1
MV2G182900.1
MV2G183300.1
MV2G185300.1
MV2G185400.1
MV2G185700.1
MV2G186100.1
MV2G186300.1
MV2G187700.1
MV2G187900.1
MV2G188400.1
MV2G188500.1
MV2G189600.1
MV2G191200.1
MV2G197100.1
MV2G197200.1
MV2G198100.1
MV2G198400.1
MV2G199800.1
MV2G201100.1
MV2G203300.1
MV2G204200.1
MV2G204300.1
MV2G206600.1
MV2G207300.1
MV2G208900.1
MV2G210200.1
MV2G211300.1
MV2G211500.1
MV2G212000.1
MV2G212600.1
MV2G215400.1
MV2G216400.1
MV2G216500.1
MV2G217100.1
MV2G219300.1
MV2G220300.1
MV2G220800.1
MV2G221100.1
MV2G224600.1
MV2G225700.1
MV2G227600.1
MV2G227800.1
MV2G229300.1
MV2G229500.2
MV2G229800.1
MV2G229900.1
MV2G230400.1
MV2G231600.1
MV2G232500.1
MV2G232900.1
MV2G234100.1
MV2G234500.1
MV2G234600.1
MV2G236600.1
MV2G236700.1
MV2G237100.1
MV2G243100.1
MV2G243200.1
MV2G244100.1
MV2G244700.1
MV2G245600.1
MV2G246100.1
MV2G248000.2
MV2G248300.1
MV2G248400.1
MV2G249400.1
MV2G250300.1
MV2G251700.1
MV2G253600.1
MV2G254500.1
MV2G257400.2
MV2G257900.1
MV2G259300.1
MV2G261700.1
MV2G262300.1
MV2G263400.1
MV2G264000.2
MV2G265100.1
MV2G265400.1
MV2G265600.1
MV2G266300.1
MV2G266900.1
MV2G267000.1
MV2G267700.1
MV2G268300.1
MV2G268500.1
MV2G268700.1
MV2G268800.1
MV2G269500.1
MV2G270100.1
MV2G271000.1
MV2G271700.1
MV2G272300.1
MV2G273700.1
MV2G273800.1
MV2G276800.1
MV2G281100.1
MV2G281900.1
MV2G282500.1
MV2G282800.1
MV2G283500.1
MV2G283600.1
MV2G284900.1
MV2G285700.1
MV2G286200.1
MV2G286300.1
MV2G287200.1
MV2G287700.1
MV2G288300.1
MV2G290200.1
MV2G291400.3
MV2G291700.1
MV2G292200.1
MV2G292200.2
MV2G293200.1
MV2G294500.1
MV2G294600.1
MV2G294800.1
MV2G295600.2
MV2G295700.2
MV2G296000.1
MV2G296700.1
MV2G297300.1
MV2G298700.1
MV2G300000.1
MV2G300200.1
MV2G300300.1
MV2G301100.1
MV2G301700.1
MV2G301700.2
MV2G303000.1
MV2G303100.1
MV2G303500.1
MV2G303700.1
MV2G304300.1
MV2G305300.1
MV2G305400.1
MV2G306100.1
MV2G306700.1
MV2G306800.1
MV2G308300.1
MV2G308400.1
MV2G309800.1
MV2G310300.1
MV2G312400.1
MV2G312500.1
MV2G313600.1
MV2G313700.1
MV2G314300.1
MV2G317300.1
MV2G317700.1
MV2G318400.1
MV2G320600.1
MV2G321000.1
MV2G321700.1
MV2G323400.1
MV2G326600.3
MV2G326800.1
MV2G328100.1
MV2G329900.1
MV2G330200.1
MV2G330400.1
MV2G330600.1
MV2G330700.1
MV2G330800.1
MV2G330800.2
MV2G330900.1
MV2G332900.1
MV2G333100.1
MV2G336600.1
MV2G337800.2
MV2G338000.1
MV2G338100.1
MV2G338400.1
MV2G340500.1
MV2G340600.1
MV2G341000.1
MV2G342000.1
MV2G342700.1
MV2G343500.1
MV2G344400.1
MV2G345700.1
MV2G347000.1
MV2G348000.1
MV2G348400.1
MV2G349200.1
MV2G350000.1
MV2G350200.1
MV2G354000.1
MV2G354300.1
MV2G359400.1
MV2G360400.1
MV2G360800.1
MV2G361200.1
MV2G361700.1
MV2G361700.2
MV2G363700.2
MV2G364400.1
MV2G365300.1
MV2G365600.1
MV2G365800.1
MV2G366300.1
MV2G367400.2
MV2G370300.1
MV2G371000.1
MV2G372700.1
MV2G373200.1
MV2G375100.1
MV2G375200.1
MV2G377400.1
MV2G378800.1
MV2G378900.1
MV2G379400.1
MV2G380200.1
MV2G380300.1
MV2G380400.1
MV2G380700.1
MV2G380800.1
MV2G382900.1
MV2G383500.1
MV2G384800.1
MV2G386100.1
MV2G387300.1
MV2G388000.1
MV2G388200.1
MV2G388300.2
MV2G388500.1
MV2G388700.1
MV2G389100.1
MV2G389500.1
MV2G389700.1
MV2G389800.1
MV2G390100.1
MV2G391300.1
MV2G391600.1
MV2G391800.1
MV2G391900.1
MV2G392100.1
MV2G393000.1
MV2G393700.1
MV2G395100.1
MV2G395300.1
MV2G395600.1
MV2G400600.1
MV2G400700.1
MV2G401000.1
MV2G401500.1
MV2G401600.1
MV2G401600.2
MV2G403300.1
MV2G403600.1
MV2G403900.1
MV2G405100.1
MV2G406300.1
MV2G406400.1
MV2G407000.1
MV2G407600.1
MV2G409000.1
MV2G409400.1
MV2G409600.1
MV2G409700.1
MV2G410200.1
MV2G410400.1
MV2G410600.1
MV2G410700.1
MV2G411800.1
MV2G413900.1
MV2G414800.1
MV2G415100.1
MV2G415300.1
MV2G415400.1
MV2G415900.1
MV2G416200.1
MV2G416500.1
MV2G416700.1
MV2G417600.1
MV2G417700.1
MV2G417800.1
MV2G418300.1
MV2G419100.1
MV2G420700.1
MV2G420800.1
MV2G422800.1
MV2G423700.1
MV2G425300.1
MV2G425400.1
MV2G427800.1
MV2G428000.1
MV2G430100.1
MV2G432400.1
MV2G432600.1
MV2G433100.1
MV2G433900.1
MV2G436400.1
MV2G436500.1
MV2G436600.1
MV2G436700.1
MV2G436900.1
MV2G439300.1
MV2G441000.1
MV2G441400.1
MV2G441500.1
MV2G444000.1
MV2G444300.1
MV2G444400.1
MV2G444800.1
MV2G445400.1
MV2G445500.1
MV2G445800.1
MV2G445900.1
MV2G446400.1
MV2G446500.1
MV2G446600.1
MV2G446900.1
MV2G447600.1
MV2G449900.1
MV2G450000.1
MV2G450200.1
MV2G450700.1
MV2G450800.1
MV2G450900.1
MV2G451500.1
MV2G452100.1
MV2G452500.1
MV2G453200.1
MV2G453500.1
MV3G000100.1
MV3G002800.1
MV3G005500.2
MV3G006100.1
MV3G006600.1
MV3G006800.1
MV3G008300.1
MV3G011900.1
MV3G012000.1
MV3G013100.1
MV3G017800.1
MV3G018000.1
MV3G018200.1
MV3G018300.1
MV3G018700.1
MV3G018800.1
MV3G019000.1
MV3G019100.1
MV3G019500.1
MV3G020000.1
MV3G023200.1
MV3G023400.1
MV3G024900.1
MV3G025200.1
MV3G025900.1
MV3G026400.1
MV3G028200.1
MV3G028500.1
MV3G033000.1
MV3G033200.1
MV3G033600.1
MV3G039300.1
MV3G040900.1
MV3G043100.1
MV3G044700.1
MV3G045200.1
MV3G046000.1
MV3G048600.1
MV3G049300.1
MV3G050300.1
MV3G051100.1
MV3G051500.1
MV3G052400.1
MV3G053500.1
MV3G056600.1
MV3G057600.1
MV3G059500.1
MV3G060800.1
MV3G062500.1
MV3G063000.1
MV3G064300.1
MV3G065300.1
MV3G066500.1
MV3G067700.1
MV3G069900.1
MV3G070700.1
MV3G071500.1
MV3G071600.1
MV3G071800.1
MV3G072100.1
MV3G072800.1
MV3G073500.1
MV3G075200.1
MV3G077100.1
MV3G077200.1
MV3G077400.1
MV3G077500.1
MV3G078900.1
MV3G079900.1
MV3G080800.1
MV3G083800.1
MV3G084000.1
MV3G086800.1
MV3G095800.1
MV3G095900.1
MV3G096100.1
MV3G096400.1
MV3G102500.1
MV3G103400.1
MV3G106000.2
MV3G108000.1
MV3G108200.1
MV3G109500.1
MV3G109600.1
MV3G111400.1
MV3G112700.1
MV3G121500.1
MV3G122400.1
MV3G123400.1
MV3G123500.1
MV3G123600.1
MV3G124900.1
MV3G125700.1
MV3G126700.1
MV3G127400.1
MV3G129300.1
MV3G131500.1
MV3G131900.1
MV3G132000.1
MV3G132600.1
MV3G133200.1
MV3G133500.1
MV3G133900.1
MV3G134900.1
MV3G135100.1
MV3G136300.1
MV3G136400.1
MV3G137000.1
MV3G137200.1
MV3G137200.2
MV3G137200.3
MV3G138000.1
MV3G138800.1
MV3G139400.1
MV3G139700.1
MV3G139800.1
MV3G141600.1
MV3G141800.1
MV3G141900.1
MV3G142100.1
MV3G143200.1
MV3G143900.1
MV3G148700.1
MV3G149000.1
MV3G149700.2
MV3G149900.1
MV3G150500.1
MV3G150700.1
MV3G151100.1
MV3G155700.1
MV3G157400.1
MV3G157900.1
MV3G158100.1
MV3G159100.1
MV3G159300.2
MV3G161700.1
MV3G161800.1
MV3G162000.1
MV3G162600.1
MV3G162900.1
MV3G163200.1
MV3G164000.1
MV3G164100.1
MV3G164800.1
MV3G164900.1
MV3G165100.1
MV3G165900.1
MV3G166100.1
MV3G166200.1
MV3G166400.1
MV3G166600.1
MV3G167300.1
MV3G168000.2
MV3G169800.1
MV3G170500.1
MV3G172200.1
MV3G172900.1
MV3G174000.1
MV3G174500.2
MV3G174500.3
MV3G175300.1
MV3G176000.1
MV3G176300.1
MV3G177600.1
MV3G177700.2
MV3G182300.1
MV3G184900.1
MV3G185000.2
MV3G185000.3
MV3G186300.1
MV3G189500.1
MV3G190200.1
MV3G190200.2
MV3G192400.1
MV3G193000.1
MV3G195900.1
MV3G198200.1
MV3G200400.1
MV3G200600.1
MV3G203400.1
MV3G204800.1
MV3G205500.1
MV3G205700.1
MV3G208000.1
MV3G208600.1
MV3G209200.1
MV3G210000.1
MV3G210100.1
MV3G211400.1
MV3G212900.1
MV3G214900.1
MV3G217000.1
MV3G219400.1
MV3G221000.1
MV3G221600.1
MV3G221900.1
MV3G222000.1
MV3G222100.1
MV3G222300.1
MV3G223200.1
MV3G223300.1
MV3G223500.1
MV3G224500.1
MV3G227400.1
MV3G231800.1
MV3G232300.1
MV3G232600.1
MV3G232700.1
MV3G233900.1
MV3G236000.2
MV3G237000.1
MV3G238800.1
MV3G239500.1
MV3G240300.1
MV3G240600.1
MV3G241100.1
MV3G242500.1
MV3G242600.2
MV3G242600.3
MV3G243500.1
MV3G244400.1
MV3G245100.1
MV3G245300.1
MV3G246600.1
MV3G247500.1
MV3G248400.1
MV3G251200.1
MV3G251300.1
MV3G251300.2
MV3G251500.1
MV3G252000.1
MV3G252300.1
MV3G252700.1
MV3G253200.1
MV3G254900.1
MV3G255200.1
MV3G258000.1
MV3G258100.1
MV3G259300.1
MV3G259400.1
MV3G260200.1
MV3G261400.1
MV3G261600.1
MV3G261800.1
MV3G262400.2
MV3G262500.1
MV3G263200.1
MV3G263500.1
MV3G263600.1
MV3G264600.1
MV3G266000.1
MV3G266300.1
MV3G266500.1
MV3G267900.1
MV3G269300.1
MV3G269500.1
MV3G272600.1
MV3G272800.1
MV3G274100.1
MV3G274700.1
MV3G275000.1
MV3G275200.2
MV3G275400.1
MV3G275500.1
MV3G276000.1
MV3G277900.1
MV3G279100.1
MV3G280400.1
MV3G283300.1
MV3G283400.1
MV3G283500.1
MV3G284200.1
MV3G285700.1
MV3G287100.1
MV3G287200.1
MV3G291500.1
MV3G292100.1
MV3G293000.1
MV3G293200.1
MV3G295100.1
MV3G295500.1
MV3G296200.1
MV3G296400.1
MV3G296500.1
MV3G298100.1
MV3G298400.1
MV3G299500.1
MV3G299700.1
MV3G299800.1
MV3G299900.1
MV3G300000.1
MV3G300100.1
MV3G300200.1
MV3G300300.1
MV3G301300.1
MV3G301600.3
MV3G301700.1
MV3G302300.1
MV3G302400.1
MV3G302700.1
MV3G303200.1
MV3G303300.1
MV3G303800.1
MV3G305000.1
MV3G305100.1
MV3G305200.2
MV3G305400.1
MV3G305800.1
MV3G306700.1
MV3G307900.1
MV3G308800.2
MV3G310200.1
MV3G310400.1
MV3G311100.1
MV3G311200.1
MV3G311600.1
MV3G311600.2
MV3G312000.1
MV3G312100.2
MV3G314100.1
MV3G314300.1
MV3G316300.1
MV3G316700.1
MV3G316800.1
MV3G319000.1
MV3G320100.1
MV3G321600.1
MV3G322100.1
MV3G322300.1
MV3G323000.1
MV3G325800.1
MV3G325900.1
MV3G327400.1
MV3G327500.1
MV3G327600.1
MV3G328200.1
MV3G328400.1
MV3G329300.1
MV3G330000.1
MV3G330100.1
MV3G330500.1
MV3G333000.1
MV3G334400.1
MV3G335200.1
MV3G335300.1
MV3G335400.1
MV3G337600.1
MV3G337800.1
MV3G338100.1
MV3G342500.1
MV3G347100.1
MV3G347300.1
MV3G347300.2
MV3G347600.1
MV3G348200.1
MV3G348300.2
MV3G350000.1
MV3G350100.1
MV3G351300.1
MV3G352400.1
MV3G352800.1
MV3G353000.1
MV3G353100.1
MV3G354500.1
MV3G354600.1
MV3G356300.1
MV3G357100.1
MV4G000700.2
MV4G000800.1
MV4G001800.1
MV4G002300.1
MV4G004700.1
MV4G005100.1
MV4G005600.1
MV4G008600.1
MV4G008700.1
MV4G009400.1
MV4G013100.1
MV4G013900.1
MV4G014800.2
MV4G015300.1
MV4G015800.1
MV4G016000.1
MV4G016900.1
MV4G017900.1
MV4G018400.1
MV4G019100.1
MV4G021500.1
MV4G021600.1
MV4G021700.1
MV4G021700.3
MV4G021800.1
MV4G023900.1
MV4G024000.1
MV4G024600.2
MV4G025000.1
MV4G025600.1
MV4G025700.1
MV4G028300.1
MV4G028700.1
MV4G030000.1
MV4G030600.1
MV4G030900.1
MV4G032800.1
MV4G032900.1
MV4G034200.1
MV4G038800.1
MV4G039700.1
MV4G040900.1
MV4G041100.1
MV4G041300.1
MV4G044000.1
MV4G044100.1
MV4G044200.1
MV4G044700.1
MV4G045100.1
MV4G045800.1
MV4G047200.2
MV4G049000.3
MV4G050700.1
MV4G052500.1
MV4G054700.1
MV4G055400.1
MV4G055700.1
MV4G055900.1
MV4G056200.1
MV4G056300.1
MV4G056400.1
MV4G057400.1
MV4G058700.2
MV4G059500.1
MV4G060600.1
MV4G060600.2
MV4G061500.1
MV4G063600.1
MV4G064500.1
MV4G065800.1
MV4G066400.1
MV4G067000.1
MV4G067100.1
MV4G067600.1
MV4G068000.1
MV4G068800.1
MV4G070700.1
MV4G071500.1
MV4G072400.2
MV4G074400.1
MV4G074700.1
MV4G076000.1
MV4G077500.1
MV4G078000.2
MV4G078800.1
MV4G079100.1
MV4G079200.1
MV4G081000.1
MV4G081700.1
MV4G082000.1
MV4G082300.1
MV4G082600.1
MV4G084600.1
MV4G085200.1
MV4G085300.1
MV4G085700.1
MV4G086100.1
MV4G086300.1
MV4G088100.1
MV4G091700.1
MV4G094100.1
MV4G094200.1
MV4G095100.1
MV4G095700.1
MV4G095800.1
MV4G096200.1
MV4G096500.1
MV4G097500.1
MV4G098700.1
MV4G099200.1
MV4G102900.1
MV4G104600.2
MV4G104700.1
MV4G105400.1
MV4G107500.1
MV4G108200.1
MV4G109600.1
MV4G109700.1
MV4G110200.1
MV4G112200.2
MV4G112600.1
MV4G113900.1
MV4G115500.1
MV4G120000.1
MV4G123200.1
MV4G123400.1
MV4G124300.1
MV4G125000.1
MV4G125100.1
MV4G125500.1
MV4G126200.1
MV4G126600.1
MV4G127500.1
MV4G127600.1
MV4G128100.1
MV4G129400.1
MV4G129900.1
MV4G131200.1
MV4G131600.1
MV4G132500.1
MV4G132600.1
MV4G132900.1
MV4G138200.1
MV4G138400.1
MV4G138600.1
MV4G139600.1
MV4G140400.1
MV4G142200.1
MV4G142800.1
MV4G143400.1
MV4G145100.1
MV4G146000.1
MV4G147400.1
MV4G147900.1
MV4G149000.1
MV4G149100.1
MV4G151200.1
MV4G151300.1
MV4G151800.1
MV4G152000.1
MV4G152200.1
MV4G153200.1
MV4G153900.1
MV4G156700.1
MV4G158300.1
MV4G158500.1
MV4G160500.1
MV4G162700.1
MV4G162800.1
MV4G163400.1
MV4G165300.1
MV4G165400.1
MV4G165500.1
MV4G165800.1
MV4G167000.1
MV4G168200.1
MV4G169100.1
MV4G169300.1
MV4G171100.1
MV4G173800.1
MV4G175300.1
MV4G176300.2
MV4G176500.1
MV4G182000.1
MV4G183100.1
MV4G184900.2
MV4G186500.1
MV4G188500.3
MV4G189600.1
MV4G191900.1
MV4G195800.1
MV4G197100.1
MV4G198200.1
MV4G199000.1
MV4G199800.1
MV4G200000.1
MV4G200100.1
MV4G202800.1
MV4G204000.1
MV4G205000.1
MV4G205400.1
MV4G208600.1
MV4G209000.1
MV4G210000.1
MV4G210100.1
MV4G210900.1
MV4G211000.1
MV4G211400.1
MV4G212700.1
MV4G212900.1
MV4G213500.1
MV4G213600.1
MV4G214400.1
MV4G214500.1
MV4G214600.1
MV4G217300.1
MV4G217400.1
MV4G217700.1
MV4G218000.1
MV4G218200.1
MV4G219200.1
MV4G219900.1
MV4G222900.1
MV4G224400.1
MV4G224900.1
MV4G225800.1
MV4G226100.1
MV4G227400.1
MV4G227600.1
MV4G227800.1
MV4G230400.1
MV4G231900.1
MV4G232000.1
MV4G232300.1
MV4G232700.1
MV4G233400.1
MV4G234000.1
MV4G234200.1
MV4G235400.1
MV4G235600.1
MV4G236100.1
MV4G236200.1
MV4G236800.1
MV4G236900.1
MV4G237100.1
MV4G237300.1
MV4G237600.1
MV4G237700.1
MV4G238900.1
MV4G239000.1
MV4G239100.1
MV4G239700.1
MV4G240600.1
MV4G241200.1
MV4G241300.1
MV4G241400.1
MV4G243100.1
MV4G245600.1
MV4G246600.1
MV4G246900.1
MV4G247200.1
MV4G247300.1
MV4G247500.1
MV4G247700.1
MV4G250500.1
MV4G250900.2
MV4G251600.1
MV4G253400.1
MV4G253600.1
MV4G256300.1
MV4G256700.1
MV4G258100.1
MV4G258800.1
MV4G259900.1
MV4G260200.1
MV4G260600.1
MV4G261900.1
MV4G263100.1
MV4G263500.1
MV4G265100.1
MV4G265900.1
MV4G266100.1
MV4G266900.1
MV4G267000.1
MV4G267200.1
MV4G267400.1
MV4G269800.1
MV4G270600.1
MV4G271900.2
MV4G272900.1
MV4G273100.1
MV4G273500.1
MV4G273700.1
MV4G274600.1
MV4G276200.1
MV4G276700.1
MV4G276800.1
MV4G283900.1
MV4G284900.2
MV4G284900.3
MV4G285000.1
MV4G285100.1
MV4G289300.1
MV4G290900.1
MV4G292800.1
MV4G292900.1
MV4G293000.1
MV4G293600.2
MV4G293900.1
MV4G294100.1
MV4G294400.1
MV4G294500.1
MV4G295200.1
MV4G298100.1
MV4G298700.1
MV4G298800.1
MV4G299500.1
MV4G299800.1
MV4G300200.1
MV4G300900.1
MV4G301500.1
MV4G301800.1
MV4G303800.1
MV4G304200.1
MV4G304300.1
MV4G305500.1
MV4G305600.1
MV4G305800.1
MV4G307000.1
MV4G307100.1
MV4G307100.2
MV4G307300.2
MV4G307400.1
MV4G307700.1
MV4G307900.1
MV4G308200.1
MV4G312100.1
MV4G314800.1
MV4G315300.1
MV4G315600.1
MV4G315700.1
MV4G316000.1
MV4G316300.1
MV4G316400.2
MV4G316800.1
MV4G316900.1
MV4G317100.1
MV4G319500.2
MV4G320400.1
MV4G320800.1
MV4G321600.1
MV4G321700.1
MV4G322800.1
MV4G323100.1
MV4G323700.1
MV4G323900.1
MV4G324200.1
MV4G324300.1
MV4G324700.1
MV4G325700.1
MV4G327800.1
MV4G327900.1
MV4G328100.1
MV4G328200.1
MV4G331300.1
MV4G331700.1
MV4G333500.1
MV4G333900.1
MV4G334100.1
MV4G334500.1
MV4G337700.1
MV4G337800.1
MV4G338200.1
MV4G338800.1
MV4G339000.1
MV4G339100.1
MV4G339300.1
MV4G339700.1
MV5G002700.1
MV5G002800.1
MV5G005500.2
MV5G006000.1
MV5G007800.1
MV5G011700.1
MV5G011800.1
MV5G011900.1
MV5G014600.1
MV5G015000.1
MV5G016600.1
MV5G017000.1
MV5G018000.1
MV5G019400.2
MV5G019400.3
MV5G019600.1
MV5G020300.1
MV5G020400.1
MV5G021000.1
MV5G022200.1
MV5G023200.1
MV5G026200.1
MV5G027000.1
MV5G028000.2
MV5G030600.1
MV5G030700.1
MV5G031200.1
MV5G032600.3
MV5G032900.1
MV5G033500.1
MV5G033600.1
MV5G035300.1
MV5G035400.1
MV5G039400.1
MV5G040000.1
MV5G042900.1
MV5G044700.1
MV5G045800.1
MV5G045900.1
MV5G046600.2
MV5G047300.1
MV5G047800.1
MV5G047900.1
MV5G048200.1
MV5G048900.2
MV5G049600.1
MV5G050500.1
MV5G051000.1
MV5G051200.1
MV5G051800.1
MV5G054600.1
MV5G055600.1
MV5G055700.1
MV5G057100.1
MV5G058500.1
MV5G060700.1
MV5G061100.1
MV5G061400.1
MV5G061700.1
MV5G062000.1
MV5G062400.1
MV5G062900.1
MV5G063000.1
MV5G064300.1
MV5G064900.1
MV5G066300.2
MV5G066300.3
MV5G066400.1
MV5G068500.1
MV5G070900.1
MV5G071500.1
MV5G072700.1
MV5G075100.1
MV5G076300.2
MV5G076600.1
MV5G076700.1
MV5G077200.1
MV5G077900.2
MV5G079300.1
MV5G080100.1
MV5G080400.1
MV5G081600.1
MV5G082900.1
MV5G083300.1
MV5G083600.1
MV5G083900.1
MV5G085000.1
MV5G086200.1
MV5G086500.1
MV5G087000.1
MV5G088000.1
MV5G088100.1
MV5G088400.1
MV5G092500.1
MV5G092900.1
MV5G093000.1
MV5G093600.1
MV5G096900.1
MV5G097300.1
MV5G100100.1
MV5G101100.1
MV5G101200.1
MV5G103100.1
MV5G104800.1
MV5G105900.1
MV5G107000.1
MV5G107200.1
MV5G108000.1
MV5G108600.1
MV5G109200.1
MV5G109300.1
MV5G109900.1
MV5G110400.1
MV5G110800.1
MV5G111400.1
MV5G112700.1
MV5G114000.1
MV5G117200.1
MV5G117700.1
MV5G117800.1
MV5G118100.1
MV5G120100.1
MV5G120300.1
MV5G120400.1
MV5G122900.1
MV5G123600.1
MV5G124300.1
MV5G126900.1
MV5G131000.1
MV5G131200.1
MV5G131300.1
MV5G131700.1
MV5G132300.1
MV5G132700.1
MV5G133200.1
MV5G136400.2
MV5G136600.1
MV5G137300.1
MV5G137500.1
MV5G139400.1
MV5G140300.1
MV5G143300.1
MV5G143600.1
MV5G145500.1
MV5G150100.1
MV5G150700.1
MV5G153000.1
MV5G153900.1
MV5G154000.1
MV5G154100.1
MV5G154200.1
MV5G155400.1
MV5G156600.1
MV5G157600.1
MV5G158400.1
MV5G158700.1
MV5G158900.1
MV5G160600.1
MV5G160700.1
MV5G161000.1
MV5G161200.1
MV5G164300.1
MV5G164800.1
MV5G165400.2
MV5G165800.1
MV5G166400.1
MV5G167000.1
MV5G167000.2
MV5G167000.3
MV5G168800.1
MV5G170000.2
MV5G170800.1
MV5G171200.1
MV5G172900.1
MV5G173100.1
MV5G175300.1
MV5G176200.2
MV5G176800.2
MV5G176900.1
MV5G177200.1
MV5G177200.2
MV5G179500.1
MV5G179800.1
MV5G180500.2
MV5G181600.1
MV5G182300.1
MV5G185500.1
MV5G187600.1
MV5G187700.1
MV5G191500.1
MV5G191800.1
MV5G196000.1
MV5G196400.1
MV5G196500.1
MV5G197600.1
MV5G197900.1
MV5G199400.1
MV5G200300.1
MV5G207200.1
MV5G208200.1
MV5G210300.1
MV5G210700.1
MV5G210700.2
MV5G211400.1
MV5G212800.1
MV5G214000.1
MV5G216500.1
MV5G216600.1
MV5G218100.1
MV5G218600.1
MV5G220700.1
MV5G222300.1
MV5G222400.1
MV5G222500.1
MV5G227000.2
MV5G227500.1
MV5G228500.1
MV5G228500.2
MV5G229400.1
MV5G230700.1
MV5G231000.1
MV5G232100.1
MV5G232200.1
MV5G232300.1
MV5G234300.1
MV5G235800.1
MV5G237600.1
MV5G238400.1
MV5G238800.1
MV5G239700.1
MV5G239800.1
MV5G240300.1
MV5G240600.1
MV5G240800.1
MV5G242400.1
MV5G243800.1
MV5G244400.1
MV5G244500.1
MV5G244600.1
MV5G246000.1
MV5G247500.1
MV5G248200.1
MV5G249100.1
MV5G249800.1
MV5G251300.1
MV5G251700.1
MV5G252400.1
MV5G252600.1
MV5G252700.1
MV5G253300.1
MV5G257800.1
MV5G258700.1
MV5G261400.1
MV5G261500.1
MV5G261700.1
MV5G263300.1
MV5G263800.1
MV5G264300.1
MV5G264800.1
MV5G265200.1
MV5G265300.1
MV5G266200.1
MV5G266800.1
MV5G267900.1
MV5G268200.1
MV5G268700.1
MV5G269600.1
MV5G270900.1
MV5G271700.1
MV5G272700.1
MV5G272800.1
MV5G273200.1
MV5G273300.1
MV5G274200.1
MV5G274300.1
MV5G274400.1
MV5G275100.1
MV5G279700.1
MV5G281400.1
MV5G282200.1
MV5G282600.1
MV5G283300.1
MV5G283300.2
MV5G283400.1
MV5G284000.1
MV5G284200.1
MV5G284300.1
MV5G284400.1
MV5G285300.1
MV5G289800.1
MV5G290700.1
MV5G290800.1
MV5G290900.1
MV5G291000.1
MV5G293000.1
MV5G294500.1
MV5G296000.1
MV5G296100.1
MV5G296700.1
MV5G297100.1
MV5G299700.1
MV5G302300.1
MV5G303000.1
MV5G305700.1
MV5G305900.1
MV5G308600.1
MV5G308700.1
MV5G308800.1
MV5G309400.1
MV5G312100.1
MV5G312400.2
MV5G313200.1
MV5G314600.1
MV5G315200.1
MV5G315300.1
MV5G318700.1
MV5G319500.1
MV5G320200.1
MV5G323600.1
MV5G323700.1
MV5G324100.1
MV5G324400.1
MV5G324400.2
MV5G325500.1
MV5G327600.3
MV5G327900.1
MV5G328200.1
MV5G331000.1
MV5G337700.1
MV6G000200.2
MV6G000200.3
MV6G002700.1
MV6G003200.1
MV6G003500.1
MV6G005000.1
MV6G005600.1
MV6G005700.1
MV6G005800.1
MV6G009400.1
MV6G009500.1
MV6G009900.1
MV6G010800.1
MV6G011100.1
MV6G011800.1
MV6G011900.1
MV6G013500.1
MV6G015700.1
MV6G016900.1
MV6G017300.1
MV6G017400.1
MV6G019500.1
MV6G019600.1
MV6G021000.1
MV6G024600.1
MV6G024700.1
MV6G024900.1
MV6G026500.1
MV6G026600.1
MV6G028800.2
MV6G030700.1
MV6G033700.1
MV6G034700.1
MV6G038200.1
MV6G038500.1
MV6G038700.1
MV6G039400.2
MV6G043300.1
MV6G043800.1
MV6G044200.2
MV6G045000.1
MV6G045900.1
MV6G046000.1
MV6G048900.1
MV6G049200.1
MV6G052400.1
MV6G053400.1
MV6G053700.1
MV6G055800.1
MV6G056200.1
MV6G057200.1
MV6G057900.1
MV6G058500.1
MV6G058800.1
MV6G059700.1
MV6G060200.1
MV6G061200.1
MV6G061700.1
MV6G063800.1
MV6G065600.1
MV6G066600.1
MV6G066700.1
MV6G067300.1
MV6G068000.1
MV6G069800.1
MV6G069900.1
MV6G070200.1
MV6G071600.1
MV6G072500.1
MV6G072700.1
MV6G073600.1
MV6G074500.1
MV6G075300.1
MV6G075800.1
MV6G076200.1
MV6G076200.2
MV6G076400.1
MV6G078800.1
MV6G079500.1
MV6G080200.1
MV6G081000.1
MV6G082400.1
MV6G082700.2
MV6G083800.1
MV6G085900.1
MV6G086800.1
MV6G087000.1
MV6G087100.2
MV6G088300.1
MV6G089700.1
MV6G089900.1
MV6G090200.1
MV6G091700.1
MV6G091800.1
MV6G094100.1
MV6G095200.1
MV6G097400.1
MV6G099000.1
MV6G099200.1
MV6G100400.1
MV6G101400.1
MV6G101500.2
MV6G102800.1
MV6G106700.1
MV6G107600.1
MV6G109200.1
MV6G109200.2
MV6G109700.1
MV6G109900.1
MV6G111700.1
MV6G111900.1
MV6G112200.1
MV6G113600.1
MV6G117800.1
MV6G119300.1
MV6G119300.2
MV6G120400.1
MV6G120600.1
MV6G121300.1
MV6G122900.1
MV6G124200.1
MV6G126600.1
MV6G126900.1
MV6G130200.1
MV6G132200.1
MV6G132300.1
MV6G132400.1
MV6G133300.1
MV6G134100.1
MV6G134300.1
MV6G135400.1
MV6G138700.1
MV6G139300.1
MV6G139900.1
MV6G147600.1
MV6G147700.2
MV6G147800.1
MV6G147900.1
MV6G148300.2
MV6G148800.2
MV6G148900.2
MV6G149600.1
MV6G150100.1
MV6G151100.1
MV6G151500.1
MV6G152800.2
MV6G156500.1
MV6G158300.1
MV6G158700.1
MV6G159800.1
MV6G159800.3
MV6G160200.1
MV6G162200.1
MV6G165500.1
MV6G166100.1
MV6G167800.1
MV6G168000.1
MV6G168800.1
MV6G169500.1
MV6G171200.1
MV6G173200.1
MV6G174500.1
MV6G174700.1
MV6G175500.1
MV6G180600.3
MV6G181500.1
MV6G182600.1
MV6G183000.1
MV6G183100.1
MV6G186800.1
MV6G188000.1
MV6G189000.1
MV6G189800.1
MV6G191200.1
MV6G191600.1
MV6G191900.1
MV6G192000.1
MV6G192200.1
MV6G192300.1
MV6G193700.1
MV6G194400.1
MV6G194800.1
MV6G196200.1
MV6G196300.1
MV6G197500.1
MV6G197800.1
MV6G199000.1
MV6G199100.1
MV6G199400.1
MV6G201500.1
MV6G201500.2
MV6G201800.1
MV6G202200.2
MV6G203000.1
MV6G204300.1
MV6G205300.1
MV6G206000.1
MV6G206200.1
MV6G206500.1
MV6G207400.2
MV6G207700.1
MV6G208000.1
MV6G208900.1
MV6G210600.1
MV6G211700.1
MV6G212900.1
MV6G213600.1
MV6G218400.1
MV6G218700.1
MV6G219500.1
MV6G221200.1
MV6G221400.1
MV6G222300.1
MV6G226200.1
MV6G226400.1
MV6G226500.1
MV6G227100.1
MV6G228000.4
MV6G232900.1
MV6G233200.1
MV6G233500.1
MV6G235100.1
MV6G236500.1
MV6G236700.1
MV6G238100.1
MV6G240600.1
MV6G241100.2
MV6G241100.3
MV6G243400.1
MV6G243800.1
MV6G245100.1
MV6G245200.1
MV6G245600.1
MV6G247700.1
MV6G248000.1
MV6G249800.1
MV6G249900.1
MV6G253000.1
MV6G253100.1
MV6G254900.1
MV6G255900.1
MV6G256500.1
MV6G257500.1
MV6G257800.2
MV6G259100.1
MV6G260400.1
MV6G260500.1
MV6G260500.2
MV6G260600.1
MV6G261400.2
MV6G264300.1
MV6G265800.1
MV6G265900.1
MV6G266000.1
MV6G269900.1
MV6G271000.1
MV6G271400.1
MV6G271700.1
MV6G273500.1
MV6G274500.1
MV6G275500.1
MV6G281100.1
MV6G281200.1
MV6G281400.1
MV6G282700.6
MV6G283500.1
MV6G284400.1
MV6G285100.1
MV6G285300.1
MV6G285500.1
MV6G285600.1
MV6G287200.1
MV6G287500.3
MV6G290200.1
MV6G290700.1
MV6G291400.1
MV6G292700.1
MV6G293200.1
MV6G294100.1
MV6G295800.1
MV6G296000.1
MV6G296700.1
MV6G299400.1
MV6G299400.2
MV6G299600.1
MV6G300300.1
MV6G300900.1
MV6G301000.1
MV6G301100.1
MV6G301300.1
MV6G301500.1
MV6G301900.1
MV6G302000.1
MV6G303100.1
MV6G304600.1
MV6G305000.1
MV6G305500.1
MV6G305900.2
MV6G306500.2
MV6G307100.1
MV6G308800.1
MV6G309000.1
MV6G310000.1
MV6G310400.1
MV6G311300.1
MV6G315100.1
MV6G315100.2
MV6G315300.1
MV6G315900.1
MV6G317300.1
MV6G317600.1
MV6G318600.2
MV6G319200.1
MV6G319700.1
MV6G320100.1
MV6G320600.1
MV6G320900.1
MV6G321000.1
MV6G322800.1
MV6G326500.1
MV6G327700.1
MV6G329700.1
MV6G330000.1
MV6G330700.1
MV6G331200.1
MV6G332300.1
MV6G332800.1
MV6G332900.2
MV6G334000.1
MV6G335500.1
MV6G336600.1
MV6G337100.1
MV6G337100.2
MV6G337400.1
MV6G337800.1
MV6G338200.1
MV6G338700.1
MV6G338900.1
MV6G339100.1
MV6G340300.1
MV6G340600.1
MV6G340700.1
MV6G340700.2
MV6G341900.2
MV6G345400.1
MV6G347000.1
MV6G347400.1
MV6G347500.1
MV6G347700.1
MV6G351200.1
MV6G351900.1
MV6G352200.1
MV6G353300.1
MV6G353500.1
MV6G355000.1
MV6G355400.1
MV6G355400.2
MV6G357300.1
MV6G357400.1
MV6G357700.1
MV6G358000.1
MV6G358500.3
MV6G362700.1
MV6G364000.1
MV6G364100.1
MV6G364200.1
MV6G364200.2
MV6G365600.1
MV6G366200.1
MV6G368500.1
MV6G368700.1
MV6G369200.1
MV6G369300.1
MV6G369600.1
MV6G371300.1
MV6G378300.1
MV6G378400.1
MV6G380200.1
MV6G380800.1
MV6G381200.1
MV6G382100.1
MV6G384100.1
MV6G384600.1
MV6G386000.1
MV6G386500.1
MV6G386700.1
MV6G386800.1
MV6G387700.1
MV6G389000.1
MV6G391100.1
MV6G392700.1
MV6G392900.1
MV6G394700.1
MV6G395500.1
MV6G395600.1
MV6G396600.1
MV6G397000.1
MV6G397100.1
MV6G397200.1
MV6G399000.1
MV6G399100.1
MV6G400500.1
MV6G400900.1
MV6G401000.2
MV6G401300.1
MV6G403600.1
MV6G404900.1
MV6G405900.1
MV6G406400.1
MV6G406800.1
MV6G407300.1
MV6G411300.1
MV6G412300.1
MV6G412400.1
MV6G413100.1
MV6G413600.1
MV6G414200.1
MV6G414400.1
MV6G414400.2
MV6G414900.1
MV6G415700.1
MV6G419800.1
MV6G420900.1
MV6G421700.1
MV6G421800.1
MV6G422400.1
MV6G422600.1
MV6G423000.1
MV6G423100.1
MV6G425400.1
MV6G425500.1
MV6G425600.1
MV6G428500.1
MV6G429000.1
MV6G429900.1
MV6G430800.2
MV6G430900.1
MV6G433000.1
MV6G433700.1
MV6G434800.1
MV6G435000.1
MV6G435200.1
MV6G435800.1
MV6G435900.1
MV6G436300.1
MV6G436600.1
MV6G436900.1
MV6G437700.2
MV6G437900.1
MV6G438700.1
MV6G439900.1
MV6G440000.1
MV6G440100.1
MV6G440200.1
MV6G441100.1
MV6G442300.1
MV6G444000.1
MV6G445200.1
MV6G445800.1
MV6G446400.1
MV6G447000.1
MV6G451400.1
MV6G453500.1
MV6G456200.1
MV6G456700.1
MV6G457000.1
MV6G457100.1
MV6G459900.1
MV6G460000.2
MV6G461000.1
MV6G461200.1
MV6G461300.1
MV6G462300.1
MV6G462800.1
MV6G466600.1
MV6G467200.1
MV6G467300.1
MV6G468100.1
MV6G468600.2
MV6G469200.1
MV6G471500.1
MV6G471500.2
MV6G473000.1
MV6G473600.1
MV6G474800.1
MV6G475400.1
MV6G476600.1
MV6G478100.1
MV6G478200.1
MV6G478400.1
MV6G479600.1
MV6G479700.1
MV6G480400.1
MV6G481100.1
MV6G483400.2
MV6G487100.1
MV6G491900.1
MV6G492900.1
MV6G495300.1
MV7G000100.2
MV7G001000.1
MV7G001000.2
MV7G001700.1
MV7G002500.1
MV7G003100.1
MV7G005200.1
MV7G005300.1
MV7G008700.1
MV7G008700.2
MV7G009100.1
MV7G009200.1
MV7G009300.1
MV7G010500.1
MV7G010500.3
MV7G012000.1
MV7G012300.1
MV7G012800.1
MV7G014100.1
MV7G017800.1
MV7G020000.1
MV7G020100.1
MV7G022500.1
MV7G024000.1
MV7G024200.1
MV7G024700.1
MV7G026500.1
MV7G028000.1
MV7G028400.1
MV7G028500.1
MV7G028600.1
MV7G029600.1
MV7G030700.1
MV7G031400.1
MV7G031500.1
MV7G032500.1
MV7G033000.1
MV7G035500.1
MV7G036700.1
MV7G040500.1
MV7G041200.1
MV7G043800.1
MV7G044600.1
MV7G045100.1
MV7G048200.1
MV7G048600.1
MV7G048700.1
MV7G049200.1
MV7G049400.1
MV7G052000.1
MV7G053300.1
MV7G053700.1
MV7G054200.1
MV7G054400.1
MV7G054700.1
MV7G054900.1
MV7G055400.1
MV7G055700.1
MV7G056500.1
MV7G058900.1
MV7G059200.1
MV7G059700.1
MV7G059800.1
MV7G061300.1
MV7G061800.1
MV7G064400.1
MV7G064600.1
MV7G065900.1
MV7G068000.1
MV7G068100.1
MV7G069400.2
MV7G071500.1
MV7G071700.1
MV7G072700.1
MV7G072900.1
MV7G072900.2
MV7G073800.1
MV7G073900.1
MV7G074100.1
MV7G074100.2
MV7G074100.3
MV7G074300.1
MV7G075300.1
MV7G075600.1
MV7G076300.1
MV7G076800.1
MV7G077000.1
MV7G077500.1
MV7G078300.1
MV7G078600.1
MV7G080000.1
MV7G080400.1
MV7G081000.1
MV7G082300.1
MV7G082500.1
MV7G082800.1
MV7G083200.1
MV7G083300.2
MV7G083500.1
MV7G083600.1
MV7G083800.1
MV7G084100.1
MV7G084100.2
MV7G086300.1
MV7G086500.1
MV7G086600.1
MV7G086700.1
MV7G087600.1
MV7G089700.1
MV7G090300.1
MV7G092300.1
MV7G092900.1
MV7G093300.1
MV7G094100.1
MV7G096100.1
MV7G098200.1
MV7G098200.2
MV7G098700.1
MV7G098800.1
MV7G099700.1
MV7G100400.1
MV7G103400.1
MV7G103900.1
MV7G104000.1
MV7G104200.1
MV7G106000.1
MV7G106100.1
MV7G106300.1
MV7G106800.1
MV7G108200.1
MV7G110900.3
MV7G111100.2
MV7G112700.1
MV7G114900.2
MV7G116100.1
MV7G117200.1
MV7G120100.1
MV7G121400.1
MV7G121700.1
MV7G121900.1
MV7G122000.1
MV7G122200.1
MV7G122300.1
MV7G122500.1
MV7G124300.1
MV7G124700.1
MV7G125300.1
MV7G126000.1
MV7G126900.1
MV7G127000.1
MV7G129400.1
MV7G130000.1
MV7G130800.1
MV7G131000.1
MV7G131900.1
MV7G132200.1
MV7G136900.1
MV7G137200.1
MV7G138100.1
MV7G138200.1
MV7G139700.1
MV7G140000.1
MV7G141900.1
MV7G143200.1
MV7G145700.1
MV7G148600.1
MV7G148700.1
MV7G148800.1
MV7G150700.1
MV7G152000.1
MV7G153000.1
MV7G153500.1
MV7G154400.1
MV7G154400.2
MV7G155200.1
MV7G155300.1
MV7G155400.1
MV7G155700.1
MV7G155800.1
MV7G157500.1
MV7G157800.2
MV7G157900.1
MV7G159800.1
MV7G160200.1
MV7G161700.2
MV7G162200.1
MV7G164200.1
MV7G165500.1
MV7G166100.1
MV7G167200.1
MV7G167700.1
MV7G167800.1
MV7G168800.1
MV7G170700.1
MV7G171700.1
MV7G174800.1
MV7G174900.1
MV7G175500.1
MV7G175800.2
MV7G175900.1
MV7G177300.1
MV7G177600.1
MV7G178100.1
MV7G179000.1
MV7G179200.1
MV7G179400.1
MV7G180300.1
MV7G182400.1
MV7G182700.1
MV7G183900.1
MV7G184600.1
MV7G185400.1
MV7G185500.1
MV7G186200.1
MV7G187100.1
MV7G188300.1
MV7G188600.1
MV7G189800.1
MV7G190200.1
MV7G190500.1
MV7G191600.1
MV7G191700.1
MV7G191900.1
MV7G194500.1
MV7G196800.1
MV7G197600.1
MV7G198600.1
MV7G200100.2
MV7G200500.1
MV7G200900.1
MV7G201100.1
MV7G201900.1
MV7G203900.1
MV7G204000.1
MV7G204100.1
MV7G204600.1
MV7G206500.1
MV7G206600.1
MV7G207300.2
MV7G207600.1
MV7G209800.1
MV7G211600.1
MV7G211800.1
MV7G215400.1
MV7G216600.1
MV7G216700.1
MV7G216900.1
MV7G218200.1
MV7G221500.1
MV7G222600.1
MV7G224000.1
MV7G224900.1
MV7G225600.1
MV7G227400.1
MV7G228600.1
MV7G229500.1
MV7G229800.1
MV7G231100.1
MV7G232000.1
MV7G232100.1
MV7G232400.1
MV7G233700.1
MV7G234600.1
MV7G234700.1
MV7G235600.1
MV7G237400.1
MV7G237600.1
MV7G242800.1
MV7G243500.1
MV7G246000.1
MV7G246500.2
MV7G249200.2
MV7G259900.1
MV7G260300.1
MV7G260400.1
MV7G260500.1
MV7G265900.1
MV7G267000.1
MV7G267000.2
MV7G267400.2
MV7G267600.1
MV7G270100.1
MV7G271800.1
MV7G275700.1
MV7G277100.1
MV7G277400.1
MV7G277400.2
MV7G280500.1
MV7G281600.1
MV7G282800.1
MV7G284300.1
MV7G284800.2
MV7G286600.1
MV7G289400.1
MV7G289700.1
MV7G292300.1
MV7G293400.1
MV7G293500.1
MV7G294400.1
MV7G296300.1
MV7G296800.1
MV7G299500.1
MV7G299900.1
MV7G303200.1
MV7G306000.2
MV7G306200.1
MV7G307200.1
MV7G310000.1
MV7G310300.1
MV7G310400.1
MV7G313000.1
MV7G314600.1
MV7G314800.1
MV7G316100.1
MV7G316200.1
MV7G317300.1
MV7G317800.1
MV7G318900.1
MV7G320600.2
MV7G321900.1
MV7G324500.1
MV7G325200.1
MV7G325300.1
MV7G325400.1
MV7G325500.1
MV7G326200.2
MV7G326900.1
MV7G327200.1
MV7G328000.1
MV7G328500.1
MV7G330000.1
MV7G331600.1
MV7G333800.1
MV7G337500.1
MV7G337700.2
MV7G340000.1
MV7G340600.1
MV7G341200.1
MV7G342200.1
MV7G342500.1
MV7G344200.1
MV7G346300.1
MV7G346700.1
MV7G346800.1
MV7G347000.2
MV7G347100.1
MV7G347700.1
MV7G349200.1
MV7G349900.2
MV7G353400.1
MV7G353900.1
MV7G354000.1
MV7G354100.1
MV7G354400.1
MV7G354900.1
MV7G355000.1
MV7G355200.1
MV7G355400.1
MV7G355500.1
MV7G355700.1
MV7G355900.1
MV7G357400.2
MV7G359500.1
MV7G359700.1
MV7G361400.1
MV7G361700.1
MV7G364900.1
MV7G365300.1
MV7G366100.1
MV7G368200.1
MV7G368700.1
MV7G370700.1
MV7G370900.1
MV7G371800.1
MV7G371900.1
MV7G373300.1
MV7G374300.1
MV7G379100.1
MV7G379400.1
MV7G379500.1
MV7G379600.1
MV7G381400.1
MV7G381600.1
MV7G381800.1
MV7G382100.1
MV7G382400.1
MV7G385200.1
MV7G385300.1
MV7G385500.1
MV7G385600.1
MV7G386400.1
MV7G386600.1
MV7G387300.1
MV7G388100.1
MV7G388400.1
MV7G388500.1
MV7G390400.1
MV7G391600.1
MV7G392200.1
MV7G393700.2
MV7G396900.1
MV7G398700.1
MV7G399500.1
MV7G399800.1
MV7G400000.1
MV7G400100.1
MV7G401100.1
MV7G404700.1
MV7G405600.1
MV7G407400.1
MV7G407600.1
MV7G407700.1
MV7G408800.1
MV7G409100.1
MV7G409400.1
MV7G409700.1
MV7G410600.1
MV7G411100.2
MV7G411700.1
MV7G411800.1
MV7G412000.1
MV7G412400.1
MV7G413600.1
MV7G414200.1
MV7G414300.1
MV7G414400.1
MV7G415200.1
MV7G416100.1
MV7G416400.1
MV7G416500.1
MV7G417000.1
MV7G417400.1
MV7G417500.1
MV7G420000.1
MV7G421200.1
MV7G421300.1
MV7G423400.1
MV7G423400.2
MV7G424100.1
MV7G424600.1
MV7G426200.1
MV7G426300.1
MV8G000300.1
MV8G000800.1
MV8G001200.1
MV8G001300.1
MV8G002300.1
MV8G002400.1
MV8G004100.1
MV8G004900.1
MV8G007100.1
MV8G007500.1
MV8G011600.1
MV8G011800.1
MV8G013700.1
MV8G016100.1
MV8G019500.1
MV8G021900.1
MV8G022600.1
MV8G024200.1
MV8G024400.2
MV8G024800.1
MV8G026000.1
MV8G026500.1
MV8G028200.1
MV8G029400.1
MV8G029500.1
MV8G029600.1
MV8G031000.1
MV8G032400.1
MV8G033100.1
MV8G034500.1
MV8G035500.1
MV8G035600.1
MV8G035700.1
MV8G035800.1
MV8G036700.1
MV8G038400.1
MV8G039000.1
MV8G039300.1
MV8G042200.1
MV8G043800.1
MV8G044200.1
MV8G044900.1
MV8G047200.1
MV8G047300.1
MV8G047600.1
MV8G048000.1
MV8G048700.1
MV8G049600.1
MV8G049700.1
MV8G049700.2
MV8G049800.1
MV8G050400.1
MV8G050800.1
MV8G051400.1
MV8G051600.4
MV8G053600.1
MV8G055500.1
MV8G059200.1
MV8G059300.1
MV8G061200.1
MV8G062300.1
MV8G063100.1
MV8G063500.1
MV8G064000.1
MV8G065600.1
MV8G066200.1
MV8G067500.1
MV8G067900.1
MV8G073100.1
MV8G076700.1
MV8G076800.1
MV8G077800.1
MV8G077900.1
MV8G080000.1
MV8G080700.1
MV8G081100.1
MV8G082500.1
MV8G082600.1
MV8G083500.1
MV8G083800.1
MV8G085600.1
MV8G085700.1
MV8G086000.1
MV8G086300.1
MV8G087800.1
MV8G088300.1
MV8G091700.1
MV8G092200.1
MV8G094200.1
MV8G094500.1
MV8G095500.1
MV8G096100.1
MV8G097800.1
MV8G098000.1
MV8G098100.1
MV8G098200.1
MV8G099100.1
MV8G099400.1
MV8G099600.1
MV8G100800.1
MV8G102500.1
MV8G103900.1
MV8G104200.2
MV8G104900.1
MV8G105400.1
MV8G107400.1
MV8G108300.1
MV8G108500.1
MV8G109500.1
MV8G109600.1
MV8G109800.1
MV8G110000.1
MV8G110700.1
MV8G112900.1
MV8G114200.1
MV8G114500.1
MV8G114700.1
MV8G114800.1
MV8G118800.1
MV8G118900.1
MV8G119500.1
MV8G121100.1
MV8G121400.1
MV8G123700.1
MV8G125500.1
MV8G126500.1
MV8G126800.1
MV8G127500.1
MV8G128100.1
MV8G130800.1
MV8G131300.1
MV8G131800.2
MV8G134000.1
MV8G135700.1
MV8G136400.1
MV8G136800.2
MV8G138100.1
MV8G138600.1
MV8G138700.1
MV8G140400.1
MV8G140400.2
MV8G141500.1
MV8G142100.1
MV8G142200.1
MV8G142300.1
MV8G144000.1
MV8G144500.2
MV8G145500.1
MV8G146000.1
MV8G147200.1
MV8G147900.1
MV8G148900.1
MV8G150800.1
MV8G151200.2
MV8G151500.1
MV8G151800.1
MV8G153000.1
MV8G153900.1
MV8G155500.1
MV8G156000.1
MV8G156100.1
MV8G158800.1
MV8G160200.1
MV8G161400.1
MV8G161500.1
MV8G162000.1
MV8G162900.1
MV8G163400.1
MV8G163700.1
MV8G163800.1
MV8G168000.1
MV8G168200.1
MV8G168700.1
MV8G169500.1
MV8G170400.1
MV8G170500.1
MV8G171300.1
MV8G172300.1
MV8G172500.1
MV8G172900.1
MV8G173500.1
MV8G175300.1
MV8G175600.1
MV8G178400.3
MV8G179800.1
MV8G181400.1
MV8G181900.1
MV8G182000.1
MV8G182600.1
MV8G183100.1
MV8G184200.1
MV8G184300.1
MV8G184400.1
MV8G185400.2
MV8G185500.1
MV8G185800.1
MV8G185900.1
MV8G186900.1
MV8G189900.1
MV8G190300.1
MV8G190600.1
MV8G192100.1
MV8G192200.1
MV8G193900.1
MV8G194600.1
MV8G194800.1
MV8G195100.1
MV8G196500.2
MV8G196700.1
MV8G196800.1
MV8G206900.1
MV8G207400.1
MV8G207500.1
MV8G207700.1
MV8G207800.1
MV8G207900.1
MV8G208300.1
MV8G208700.1
MV8G211100.1
MV8G212500.1
MV8G213300.1
MV8G213600.1
MV8G213800.1
MV8G214800.1
MV8G216300.1
MV8G217200.1
MV8G217300.1
MV8G219400.1
MV8G220700.1
MV8G220800.1
MV8G223200.1
MV8G226100.1
MV8G226300.1
MV8G226900.1
MV8G228900.1
MV8G230100.1
MV8G230300.1
MV8G231100.2
MV8G232700.1
MV8G234100.2
MV8G235400.1
MV8G236000.1
MV8G238700.1
MV8G242000.1
MV8G245200.1
MV8G246000.1
MV8G246400.1
MV8G247300.1
MV8G247400.1
MV8G247800.2
MV8G248300.1
MV8G254800.1
MV8G255600.1
MV8G256400.1
MV8G256500.1
MV8G257600.1
MV8G258100.1
MV8G259200.1
MV8G264300.1
MV8G264400.1
MV8G265200.1
MV8G270400.1
MV8G271100.1
MV8G271500.1
MV8G272500.1
MV8G272600.1
MV8G272800.1
MV8G273800.1
MV8G274200.1
MV8G275200.1
MV8G276800.1
MV8G278300.1
MV8G279400.1
MV8G280000.1
MV8G280600.1
MV8G280700.1
MV8G281800.1
MV8G281900.1
MV8G282000.1
MV8G282200.1
MV8G283600.1
MV8G285000.1
MV8G286800.1
MV8G287500.1
MV8G288300.1
MV8G289700.1
MV8G290200.1
MV8G290300.1
MV8G290800.1
MV8G291200.1
MV8G292700.1
MV8G292700.2
MV8G294200.1
MV8G294700.1
MV8G294800.1
MV8G297400.2
MV8G298800.1
MV8G300400.1
MV8G300700.1
MV8G300700.2
MV8G302000.1
MV8G302500.1
MV8G302700.1
MV8G303000.1
MV8G304700.1
MV8G305100.1
MV8G305200.1
MV8G305300.1
MV8G305600.2
MV8G305700.1
MV8G307700.1
MV8G308900.1
MV8G311100.1
MV8G312800.1
MV8G313200.1
MV8G313500.1
MV8G313600.1
MV8G314900.1
MV8G315300.1
MV8G315700.1
MV8G317200.1
MV8G318000.1
MV8G318100.1
MV8G318600.1
MV8G318900.1
MV8G321000.1
MV8G321400.1
MV8G323500.1
MV8G324500.1
MV8G324600.1
MV8G324900.1
MV8G325200.1
MV8G325400.1
MV8G325900.1
MV8G326400.1
MV8G326600.1
MV8G327000.1
MV8G328100.1
MV8G328900.1
MV8G329200.1
MV8G331100.1
MV8G331900.1
MV8G332500.1
MV8G332700.1
MV8G334400.1
MV8G334500.1
MV8G335900.1
MV8G336000.1
MV8G336500.1
MV8G337800.1
MV8G337900.1
MV8G338300.1
MV8G338600.1
MV8G338800.1
MV8G341000.1
MV8G342000.1
MV8G342900.2
MV8G344400.1
MV8G344500.1
MV8G346700.1
MV8G347000.1
MV8G347100.1
MV8G349300.1
MV8G349800.1
MV8G350300.1
MV8G350400.1
MV8G351400.1
MV8G352400.1
MV8G353100.1
MV8G353200.1
MV8G353500.1
MV8G354200.1
MV8G354400.1
MV8G354500.1
MV8G354600.1
MV8G354900.1
MV8G355200.1
MV8G357200.1
MV8G358800.1
MV8G358900.1
MV8G359000.1
MV8G359100.1
MV8G359500.1
MV8G359500.2
MV8G361800.1
MV8G362200.1
MV8G364000.1
MV8G364300.1
MV8G364600.1
MV8G364800.1
MV8G365000.1
MV8G366800.1
MV8G369300.1
MV8G370100.1
MV8G370300.1
MV8G370500.2
MV8G371200.1
MV8G372100.1
MV8G372600.1
MV8G372700.1
MV8G374400.1
MV8G374800.1
MV8G374900.1
MV8G375500.2
MV8G375700.1
MV8G375800.1
MV8G376000.1
MV8G376200.1
MV8G376700.1
MV8G376800.1
MV8G376900.1
MV8G377600.1
MV8G378800.1
MV8G379800.1
MV8G380200.1
MV8G382300.1
MV8G382600.1
MV8G382900.1
MV8G383000.1
MV8G383300.1
MV8G383400.1
MVNG001600.1
MVNG003900.1
MVNG004500.1
MVNG004600.1
MVNG005200.2
MVNG009700.1
MVNG009800.1
MVNG013900.1
MVNG016500.1
MVNG016700.1
MVNG017800.1
MVNG017900.1
MVNG018100.1
MVNG021700.1
MVNG022400.1
MVNG025800.1
MVNG029500.1
MVNG032800.1
MVNG032900.1
MVNG034200.1
MVNG034300.1
MVNG035500.1
MVNG036000.2
MVNG036300.1
