{
  "variables": {
    "iso_url": "",
    "iso_checksum": "",
    "iso_checksum_type": "",
    "ssh_username": "",
    "ssh_password": "{{ env `PACKER_SSH_PASSWORD` }}",
    "esxi_host": ""
  },
  "builders": [
    {
      "type": "vmware-iso",
      "iso_url": "{{ user `iso_url` }}",
      "iso_checksum": "{{ user `iso_checksum` }}",
      "iso_checksum_type": "{{ user `iso_checksum_type` }}",
      "ssh_username": "{{ user `ssh_username` }}",
      "ssh_password": "{{ user `ssh_password` }}",
      "shutdown_command": "shutdown -P now",
      "remote_type": "esx5",
      "remote_host": "{{ user `esxi_host` }}",
      "remote_password": "{{ user `ssh_password` }}"
    }
  ]
}