util/DbConnection.class
steps/inmetrics/Cadastro.class
enums/Browser.class
util/Tools$1.class
util/Hook$1.class
util/dbActions/dbCaixas.class
pom/inmetrics/PageNovoFuncionario.class
data/UserData.class
enums/UserEnum.class
util/Utilitarios.class
data/cadastro/PessoaFisica.class
util/Tools.class
pom/inmetrics/PageFuncionario.class
steps/inmetrics/Acesso.class
util/UserUtil.class
util/Hook.class
steps/inmetrics/NovoFuncionario.class
steps/inmetrics/Funcionario.class
pom/inmetrics/PageInicial.class
pom/inmetrics/PageAcesso.class
enums/Enviroments.class
pom/inmetrics/PageCadastro.class
util/UserUtil$1.class
