{
    "email": "hihoj38854@nzaif.com",
    "password": "123456",
    "firstName": "Steve",
    "lastName": "Araya",
    "emailUser": "adel@gmail.com",
    "telephone": "85858585",
    "changePassword": "123456",
    "changePasswordConfirm": "123456",
    "addressFirstName": "Steve",
    "addressLastName": "Araya",
    "addressCompanyName": "Company S.A",
    "addressAddress1": "San Carlos / La Tigra",
    "addressAddress2": "San Jose de La Tigra",
    "addressCity": "La Tigra",
    "addressPostCode": "21008",
    "addressCountry": "Costa Rica",
    "addressRegionState": "Alajuela",
    "affiliateCompany": "Company Test",
    "affiliateWebSite": "CompanyTest.com",
    "affiliateTaxID": "TAX21008",
    "affiliateChequePayeeName": "Usuario de beneficiario",
    "affiliatePaymentMethod": "cheque"
 }