  {
     "euro": "EUR",
     "pound": "GBP",
     "dolar": "USD",
     "euroCurrency": "€",
     "poundCurrency": "£",
     "dolarCurrency": "$",
     "itemToSearch": "MacBook",
     "email": "sicap36722@iconzap.com",
     "password": "12345678"
  }