Id,SalePrice
1461,117788.8927454768
1462,153277.37930505603
1463,175208.67689543788
1464,184425.4319767454
1465,192160.9053111888
1466,180876.62449161944
1467,175049.7280358253
1468,171107.75718312242
1469,187976.30198007546
1470,128020.53863525362
1471,187216.2459852093
1472,94522.55369769121
1473,98633.30362026863
1474,148049.02147005772
1475,114420.50070313024
1476,389635.236093684
1477,255263.44925982357
1478,305940.2763431846
1479,289721.21188195137
1480,465714.9131830946
1481,304419.7336144133
1482,205039.76480061602
1483,180866.02167565766
1484,169279.08553094126
1485,181810.38163838937
1486,189256.09534959483
1487,315275.0359883171
1488,238404.1693840881
1489,199636.33845901318
1490,238638.5565893551
1491,197928.62390947944
1492,96146.89390065489
1493,196877.93874092575
1494,295968.48951825965
1495,286439.2580635752
1496,248309.11501737149
1497,179032.0016260406
1498,162481.0877836331
1499,159218.78382267736
1500,159522.18282781105
1501,177035.39601709403
1502,151906.815980797
1503,289193.33246758796
1504,241333.51138647468
1505,223729.40441411373
1506,182057.29758019757
1507,250191.56057267732
1508,189751.37247352645
1509,159068.8531015096
1510,150399.871460928
1511,152749.2255082695
1512,170623.69782165057
1513,153666.7984704462
1514,153609.55229575976
1515,195892.55466150516
1516,154582.94566439115
1517,156823.2906259574
1518,132071.1235914363
1519,220532.7340953491
1520,135139.435777639
1521,135465.90816702737
1522,171521.61240703744
1523,111685.07538977692
1524,126234.2227912921
1525,118908.49883755136
1526,117505.24335445109
1527,105583.6293807026
1528,126530.14944067044
1529,149154.3980414863
1530,185227.27477966476
1531,139707.3967400655
1532,103523.79942690641
1533,148364.02940717616
1534,122367.37690517813
1535,144771.95865911874
1536,105940.88241156065
1537,80756.37943056945
1538,156873.12244211347
1539,200414.53557575762
1540,120240.74202064602
1541,140213.0569062049
1542,136397.3471192418
1543,176622.0806428294
1544,87363.16189024864
1545,116953.55589310692
1546,135498.46456354758
1547,132308.2679027639
1548,136895.56807245532
1549,119323.67034149184
1550,140071.273219697
1551,112307.34154406702
1552,154608.53262426463
1553,140677.35719433345
1554,118587.83589771339
1555,154309.9455200355
1556,91325.22952483632
1557,106132.64373937174
1558,97767.24745870796
1559,106376.98738159065
1560,135975.40424730824
1561,141499.97067809966
1562,126751.54761599505
1563,128262.00304140308
1564,153617.05376695527
1565,151166.10983280608
1566,235635.3193919414
1567,80341.37823529248
1568,228053.38407317692
1569,127790.47990789771
1570,142932.61209429457
1571,116910.85730691538
1572,142962.329506993
1573,239303.15396867026
1574,126872.31531951381
1575,235814.6273487624
1576,238534.3437889611
1577,188576.67969008765
1578,148771.36272327678
1579,138504.3403858642
1580,185427.008038628
1581,147881.38351598402
1582,132485.1074043179
1583,306136.9731551781
1584,232716.6294213009
1585,141123.73875790872
1586,71424.98720596073
1587,116910.93638766788
1588,155709.96560753134
1589,100797.58704076479
1590,132143.56017107892
1591,99151.11249511602
1592,124745.80719294594
1593,130285.24042546343
1594,148797.26903815626
1595,118718.37919422243
1596,223575.75890856367
1597,188999.63257839388
1598,198186.41202181156
1599,180610.15318764572
1600,178096.6103120213
1601,74022.35619497171
1602,121610.53131202131
1603,87994.01033197361
1604,284820.0041702463
1605,242727.44681274274
1606,159994.82160020535
1607,168493.45482251083
1608,208197.4313715174
1609,185450.38271262075
1610,159100.75063944398
1611,143179.78371545117
1612,179289.5600874681
1613,172804.72248451546
1614,132674.99486979685
1615,93252.70426778779
1616,84906.15199245201
1617,88281.92494644245
1618,127066.20947940946
1619,138161.31519480524
1620,168293.10512290485
1621,136821.1872835498
1622,150475.56164624268
1623,269749.05064307916
1624,205697.65879925623
1625,127408.40497252745
1626,168674.76171328672
1627,181346.83127286605
1628,276575.62813880556
1629,180466.12671966918
1630,343744.57744633144
1631,217917.41755103224
1632,230819.27301268175
1633,175488.97365040515
1634,184709.6378138528
1635,179394.30286924195
1636,159604.42935914086
1637,187344.62584249087
1638,186083.3644999445
1639,178917.18361693862
1640,243505.00082509156
1641,172910.99348815077
1642,247153.9163636086
1643,217288.14674741923
1644,231151.85947574646
1645,195812.6610114886
1646,161348.10940309687
1647,164407.80067099567
1648,134802.65285478404
1649,139155.19543018081
1650,124298.71076112775
1651,124083.35527444772
1652,94633.25606560106
1653,95135.98166350316
1654,151642.24175252524
1655,136037.15733588638
1656,147289.37068292822
1657,152996.8131611167
1658,151198.7285963204
1659,130647.67825574422
1660,150651.80528876683
1661,444422.24712565215
1662,377442.7914011266
1663,375122.35151148855
1664,433795.62206981896
1665,309433.69462254416
1666,339548.2308689645
1667,373658.3478212622
1668,349224.96674464433
1669,304917.5470244755
1670,356797.9387722279
1671,263927.5224923687
1672,425093.58781604504
1673,297825.87989862915
1674,252600.87878479858
1675,198942.66011621707
1676,199526.93906637802
1677,213681.356015984
1678,472063.6256944165
1679,400591.92566799856
1680,321405.6148576422
1681,274769.2262970363
1682,312640.103986014
1683,192179.62484795752
1684,174214.45707670107
1685,175061.08010309137
1686,171006.40689665882
1687,170724.0589627317
1688,184678.71935267508
1689,190698.3300719004
1690,188476.79089907318
1691,178556.3642673438
1692,257575.58896780995
1693,174414.5803016982
1694,180645.56710345208
1695,172176.2806564547
1696,265913.62560223107
1697,172353.83021406372
1698,334583.23683510924
1699,329420.12312678975
1700,256890.43186266517
1701,272593.18956068926
1702,240347.4949064547
1703,244148.58652644567
1704,273638.67463486514
1705,253126.95469946723
1706,393104.5140588577
1707,227413.20811968585
1708,202366.87317299366
1709,263600.4336663059
1710,228309.86777711177
1711,272979.4527717559
1712,249819.10870898556
1713,274977.7611324231
1714,216161.91745310248
1715,208285.61449605957
1716,178736.76149428348
1717,168579.3426585915
1718,143303.98763472636
1719,217508.15029331777
1720,250232.47959118668
1721,160211.69665981244
1722,119783.26096223219
1723,157201.01844422249
1724,212482.97421925302
1725,232910.15449059274
1726,191700.1832498057
1727,171018.94149972254
1728,177428.87337670664
1729,167138.9682953713
1730,159238.000031191
1731,125450.77673726271
1732,130464.47792790538
1733,116588.10115440116
1734,132015.80324744695
1735,128064.61694067043
1736,109435.35104281828
1737,308016.17378488166
1738,243984.807011766
1739,274973.14442490845
1740,214008.98920759794
1741,181412.0694871517
1742,173521.38780863583
1743,172977.1990318016
1744,307817.9552245254
1745,224162.22137484737
1746,217349.43801420805
1747,208715.63985495066
1748,214907.688517316
1749,145525.00118392715
1750,136498.78492246644
1751,227186.84206182708
1752,122319.86766117219
1753,149034.52143217894
1754,192351.02422965915
1755,167185.30662537468
1756,135383.35168226218
1757,124949.42374375624
1758,152797.74105033846
1759,160524.9832829393
1760,162768.71327639034
1761,150561.95295737594
1762,178512.0808394384
1763,174579.73468731268
1764,122787.2380167055
1765,170267.55940148744
1766,171115.04399278495
1767,209373.54521711622
1768,144929.42957589639
1769,163687.64937465315
1770,148920.025255994
1771,129481.95172902095
1772,135676.35867610163
1773,134410.7667213065
1774,144227.291985015
1775,139544.77176573424
1776,137305.52880169832
1777,120690.047223915
1778,139922.89183563658
1779,124703.64743856147
1780,168594.81432761683
1781,128214.24315437341
1782,93451.90773976027
1783,140340.60324317354
1784,103185.38548079696
1785,133435.80186477414
1786,144897.65275585526
1787,159525.4601683317
1788,61819.92654656455
1789,97807.34605497279
1790,86236.7073674104
1791,193452.74578443778
1792,159025.99835858578
1793,139722.39569691417
1794,150633.85708402708
1795,136032.8620359085
1796,142423.95694258518
1797,122058.483511211
1798,128828.0117167555
1799,109229.16320024419
1800,129034.54454478854
1801,124375.37903330002
1802,130226.40229406705
1803,155388.81114574318
1804,134706.8466307026
1805,139021.7072363747
1806,123932.68977269954
1807,141570.99492021865
1808,123077.33345604397
1809,123461.01175679879
1810,144247.0280699856
1811,104381.7106093906
1812,104178.41505311355
1813,131558.2571347541
1814,100351.32935392382
1815,59808.007974137014
1816,99330.45359074263
1817,125658.23416253192
1818,154909.42776276506
1819,122518.55941294819
1820,81490.47047632924
1821,116010.66418931069
1822,154107.98123285052
1823,64646.00465689869
1824,135438.90914391165
1825,139787.24969291818
1826,100038.13839341217
1827,107964.89233771783
1828,135459.30223865027
1829,137428.5893928294
1830,135321.7826123599
1831,143885.84329437237
1832,107049.63410733709
1833,143877.99536077815
1834,122096.90332914304
1835,133384.58338905536
1836,122665.22576814849
1837,94278.31948912202
1838,117727.08603063604
1839,105544.6122050727
1840,165654.50059590407
1841,138520.98209274057
1842,96607.24491086691
1843,135258.1471305083
1844,145886.85486430238
1845,146135.4732319903
1846,156447.92473720724
1847,168403.75081055053
1848,61524.46631524032
1849,120907.09198412698
1850,126017.24500754796
1851,149938.83175657675
1852,128470.21060200915
1853,130900.09921398047
1854,158368.34363836164
1855,158498.48301456877
1856,230917.32065179257
1857,145426.62913225667
1858,137884.59006105008
1859,115604.64284526586
1860,151609.99105114327
1861,119284.85249644802
1862,302570.01265540015
1863,298616.8854122544
1864,298616.8854122544
1865,363189.49496231554
1866,322464.7791241537
1867,227730.25112307127
1868,298529.4200068542
1869,197869.0919934233
1870,230767.16028823954
1871,262855.3246787102
1872,173421.98297743924
1873,232404.60650380177
1874,144086.92372599625
1875,186470.9364695305
1876,196987.45365578856
1877,202321.69980855263
1878,207274.91589463304
1879,133651.29022222222
1880,131299.22350954602
1881,244082.6776392496
1882,241466.4652171162
1883,189449.01939144186
1884,209181.14212504166
1885,240101.03852242202
1886,295853.9851788212
1887,208895.04806085586
1888,271713.79246694973
1889,168423.90089627038
1890,115931.59816219889
1891,140168.4511053391
1892,108351.11126551224
1893,129593.2542874071
1894,126228.3514189699
1895,139114.689567044
1896,125718.03194155845
1897,119094.09697485855
1898,107894.68897585748
1899,160090.4451668887
1900,151531.7864375347
1901,179852.80075621602
1902,154782.97423310016
1903,225046.09000438455
1904,148799.24129367855
1905,192601.2638630259
1906,150684.84174261853
1907,209598.5973671329
1908,109394.61478149626
1909,140620.7251826784
1910,124427.96693897764
1911,212109.36132850486
1912,286309.58509715286
1913,149078.79139019313
1914,63464.579745310264
1915,336121.31179989444
1916,70418.8739046787
1917,243686.4812861583
1918,141499.85418872794
1919,156706.38597985348
1920,162798.07258547013
1921,409609.8594040403
1922,320224.6260136807
1923,224362.4830694861
1924,207942.38303124654
1925,211907.35912451445
1926,384392.2674901765
1927,133167.70891175486
1928,159492.10067021864
1929,110970.19893872793
1930,135011.2114165557
1931,137766.68452897103
1932,137327.08778033077
1933,187695.9178431013
1934,177040.58137498613
1935,173390.8849982518
1936,193412.81586430233
1937,180615.50513680754
1938,177636.5273337218
1939,261604.7530508103
1940,192285.68178554781
1941,172652.03675407925
1942,182551.44605033856
1943,219656.4851631147
1944,357436.65238789
1945,409439.05516758235
1946,142336.6081406093
1947,301868.61383508163
1948,161786.36670579424
1949,247677.42190237538
1950,176799.620549062
1951,243469.79664590955
1952,210301.34365603837
1953,171784.3494183317
1954,182926.61080100457
1955,134767.24340770338
1956,280710.96300682635
1957,156489.15605616607
1958,277570.6425180653
1959,142474.8687148684
1960,109710.36965875789
1961,123530.52423024198
1962,95397.57555083804
1963,98615.84190476192
1964,108361.21195199246
1965,141758.2247720335
1966,141595.0655023865
1967,305280.75290537236
1968,420993.64836283145
1969,383077.27750402375
1970,402232.7879718614
1971,430933.5061340604
1972,356046.8481080588
1973,287768.3260184815
1974,324592.40547824395
1975,450788.35779512144
1976,277924.32020784763
1977,386894.91308805085
1978,332886.53719980014
1979,326105.9329323732
1980,188459.26487839932
1981,316518.37532128976
1982,218427.63611741032
1983,213278.76312196135
1984,171255.72948543128
1985,227007.53071797662
1986,206658.91410819738
1987,188593.40906562886
1988,178287.67614654798
1989,186434.16945521143
1990,217936.1639575424
1991,226580.5967507493
1992,226008.46824839045
1993,170935.14714252413
1994,231454.3119934233
1995,180039.38919649782
1996,269139.8828968253
1997,316580.97041194915
1998,331507.3072009657
1999,276788.0622386225
2000,310665.7704190254
2001,282473.2313313353
2002,252135.11329109778
2003,262083.82526254305
2004,270982.8982835776
2005,225326.43280938512
2006,221930.143013653
2007,250040.18572460872
2008,221237.11320313025
2009,207986.2026219614
2010,190652.0671678877
2011,144814.53025341322
2012,175201.33364060937
2013,183064.85794039295
2014,189093.72779184702
2015,203411.4895263348
2016,197200.10042846043
2017,202139.28257914304
2018,125113.81290459535
2019,132208.72003330002
2020,103764.57478837828
2021,110970.3400729826
2022,192066.89949383948
2023,140623.3156313964
2024,280271.50528582546
2025,360691.99443167937
2026,181833.97344447215
2027,162156.40999836277
2028,153347.66708016983
2029,172195.70366855376
2030,277146.71420202014
2031,245903.74000518926
2032,269392.98439976684
2033,263095.979779748
2034,170482.228973471
2035,217820.5344640082
2036,181561.7847348485
2037,190532.81438644696
2038,309080.0454504385
2039,224184.264219475
2040,355491.48061197135
2041,287766.94613081357
2042,206548.81356809862
2043,165520.2292127317
2044,163173.53617410373
2045,207181.97579184707
2046,141389.47976850934
2047,143071.95394344546
2048,136361.39636641138
2049,135960.0101648074
2050,168757.83442809968
2051,105619.2833952991
2052,130775.96122366514
2053,146792.59375860254
2054,85858.99468426016
2055,162203.09134607058
2056,142231.1743481796
2057,114949.87618220669
2058,214496.6343466256
2059,133751.98346339772
2060,162852.67326012877
2061,165329.21541902545
2062,132863.04642982016
2063,123899.39831734932
2064,132605.87544946722
2065,121211.02268714618
2066,171742.0741916417
2067,130967.65496520151
2068,141959.68724750253
2069,87854.16300543901
2070,114433.53764602063
2071,99027.05646420245
2072,138724.17138583638
2073,133589.72259226884
2074,167174.75788655793
2075,152017.7114175269
2076,123066.15288955491
2077,151449.16573537572
2078,131302.58715034963
2079,138878.9443498446
2080,111511.5002854923
2081,125075.68917585193
2082,128246.6826979687
2083,147619.24100496728
2084,109375.88902963704
2085,116307.93567099566
2086,117319.02121461868
2087,118428.27951492953
2088,101381.82282373184
2089,90399.59217443668
2090,127796.16013564215
2091,111943.7811870352
2092,127558.01018362195
2093,142120.9260191198
2094,110249.2266593129
2095,146575.0468420191
2096,90856.83265684318
2097,98543.23663098014
2098,147805.4696874514
2099,60390.67174839052
2100,101754.13817171719
2101,114776.65760028857
2102,128469.33374123096
2103,106447.46769796869
2104,134544.32312914863
2105,130059.03436158286
2106,77269.54714857366
2107,186496.29516533468
2108,121970.40269869014
2109,109522.5124705295
2110,117887.17057412032
2111,136575.28730208683
2112,140223.29614491065
2113,121249.61640270839
2114,106080.29632828283
2115,156155.8773812299
2116,119859.66586702186
2117,143384.0057771395
2118,128191.40317587968
2119,107962.14934609832
2120,107955.15197327672
2121,102912.34581041182
2122,114927.10704545456
2123,91329.2926772117
2124,161827.90661616164
2125,125401.80158258411
2126,153312.9615458153
2127,157188.8451263181
2128,128947.0840198135
2129,93944.0188929959
2130,138383.94147277728
2131,141790.46735053833
2132,116125.85373776224
2133,120803.84010392393
2134,123047.33310977911
2135,99344.54380849707
2136,89692.6127667333
2137,110190.35109745806
2138,133916.1032031857
2139,150196.45159088133
2140,140292.55203102453
2141,157510.2219992508
2142,136583.33562534684
2143,148793.9053017538
2144,115933.9138829504
2145,135314.91032745028
2146,174827.2238528138
2147,147479.43572008546
2148,140160.89345565543
2149,146276.82360855813
2150,230022.249970807
2151,122668.70122644026
2152,178006.71700777006
2153,167587.47560356313
2154,101497.78088314463
2155,146644.55893351094
2156,256574.07888394938
2157,234788.81125194248
2158,243230.15324278505
2159,221320.5020375458
2160,171684.36328857258
2161,244063.31785742025
2162,387625.3570359639
2163,327906.2817054611
2164,257834.50016561226
2165,199418.3810794761
2166,150816.333777639
2167,208112.70410728166
2168,195206.57694022637
2169,191405.70532040182
2170,218612.3800908813
2171,150867.0105242813
2172,142626.90332031864
2173,184390.61874508832
2174,223444.88430411258
2175,284719.8986862859
2176,320590.3624706128
2177,250140.45507295482
2178,218205.20108222327
2179,143797.60518387167
2180,216040.9431438839
2181,194477.44466353097
2182,227625.35721334218
2183,191681.07850721508
2184,131311.32797843823
2185,128654.04469372299
2186,143593.7351421634
2187,150489.09912698413
2188,157475.9196928627
2189,259682.09765159848
2190,86824.2267396215
2191,82202.3262248862
2192,95495.6316125541
2193,114247.42111383057
2194,98774.64686732712
2195,107872.15441852593
2196,108719.00508544229
2197,111014.69535073257
2198,160713.4747846598
2199,172665.9581273726
2200,146819.11050796427
2201,143945.78807806084
2202,190359.82334840167
2203,151960.4209063159
2204,178354.11449683656
2205,124968.22007375957
2206,144488.0427630425
2207,208389.95654007103
2208,253046.21632761694
2209,231800.17634321234
2210,125177.16432803309
2211,118298.83873426575
2212,118851.63545629369
2213,102445.57013808415
2214,147789.20217837716
2215,101654.49169669219
2216,145932.21722766125
2217,72417.32223021424
2218,83982.59386524587
2219,74531.95366222666
2220,81141.1836597569
2221,334743.1562321289
2222,289108.60180222546
2223,291233.07875377405
2224,215975.29998149068
2225,133424.65636022307
2226,187557.57364108117
2227,197847.53707586863
2228,282057.39482076257
2229,237011.5607766955
2230,166110.5349758297
2231,212162.95874589306
2232,184886.27595876344
2233,181402.96247591294
2234,251574.41197533027
2235,232194.34733621927
2236,264736.7441531525
2237,333157.7886529304
2238,200158.95803923847
2239,106600.9187089022
2240,161249.87543503716
2241,138887.38283846705
2242,127932.50240648238
2243,129152.69717937623
2244,95817.11960109335
2245,114774.52406704407
2246,139300.67653757348
2247,117180.71595571091
2248,125496.61509934507
2249,114760.9449226607
2250,130445.00891242089
2251,121648.43616422464
2252,174584.9677913754
2253,166755.37589973919
2254,179753.0113480963
2255,181289.99009981685
2256,177532.3509613443
2257,204070.23529664782
2258,163306.26705497282
2259,178967.25740531684
2260,155188.6558405483
2261,203038.32370576638
2262,217260.65947200023
2263,360097.5660248087
2264,437572.98175338545
2265,152367.75043234543
2266,294489.6738314184
2267,375087.33918287256
2268,402848.438677073
2269,159621.18849378396
2270,180580.37666458543
2271,211415.46866605608
2272,199224.84134892884
2273,158940.02264679768
2274,174020.40127344872
2275,156745.09995510045
2276,177807.57723970475
2277,172544.84671828168
2278,151201.21129043176
2279,127946.20519480514
2280,111189.61700027753
2281,176295.7185629093
2282,181081.13302350428
2283,109737.07747619046
2284,116073.61923470971
2285,137723.3179044289
2286,127773.93751415251
2287,356792.57355439
2288,284087.8843509823
2289,354109.55154761905
2290,434053.86353335547
2291,353920.8891026751
2292,435084.8402816905
2293,468951.30726909207
2294,410318.11857437005
2295,455879.6649919801
2296,271072.6849457487
2297,345747.67269527697
2298,347555.9597685371
2299,384099.311148657
2300,323623.524626013
2301,313733.75677591853
2302,250508.55664901758
2303,249376.51232742265
2304,249693.35106568434
2305,195135.85486657784
2306,192881.47737942613
2307,200097.12988253406
2308,221216.2071851759
2309,289679.6101650016
2310,223519.69861521816
2311,205279.01172927077
2312,174838.1428868909
2313,175014.0888851149
2314,172528.70806721057
2315,174928.5397060995
2316,200227.47952267178
2317,180444.30455985677
2318,175500.75573115778
2319,173895.53438050844
2320,178024.78365048842
2321,243950.05283058612
2322,179557.30025782547
2323,184094.16841564
2324,176074.72329118103
2325,209953.61515709292
2326,170546.84955422353
2327,201359.45208830055
2328,221054.53363708511
2329,184136.62406815405
2330,177985.24270146515
2331,340307.0224900653
2332,405471.8055156788
2333,314691.39243700745
2334,276890.47038616944
2335,283142.6125100177
2336,320982.0730637696
2337,192253.83397555223
2338,263588.95917307696
2339,229065.72504051498
2340,385575.5199627316
2341,210343.06934620932
2342,228317.1135150405
2343,228499.78812340443
2344,235111.28059632034
2345,234121.13429531571
2346,215109.4408231768
2347,194245.1358308636
2348,243919.51611272062
2349,190307.45884532135
2350,311911.5301984127
2351,273242.4340531135
2352,245764.43151964713
2353,264118.41481429694
2354,138625.79451451325
2355,143987.66201767675
2356,151544.07277528034
2357,191806.95622882663
2358,205023.37568792314
2359,129188.2939811855
2360,120961.5124124209
2361,142907.64599178603
2362,253173.96145343554
2363,146917.05440853589
2364,154160.92507858804
2365,206720.7686177157
2366,182474.11897854923
2367,218061.0333772617
2368,215646.15653504845
2369,208217.29105477856
2370,172014.3783047786
2371,168474.92741378068
2372,181837.9151350871
2373,281022.8145294981
2374,303340.47950979567
2375,250883.33759473872
2376,272711.30395734805
2377,321476.11953371635
2378,150523.32338841716
2379,202347.98008630265
2380,142211.1958220946
2381,162045.6949814075
2382,200669.16485797524
2383,197610.839763431
2384,233958.08169494398
2385,159704.7142080142
2386,136583.92914163615
2387,133758.1686147186
2388,113883.26546214898
2389,127000.74583327783
2390,156623.05421078918
2391,138509.5507644578
2392,117910.87237351535
2393,165049.63387418143
2394,148460.8155222556
2395,198581.8637140638
2396,149861.9295010268
2397,207346.45356310354
2398,125877.48273984343
2399,68732.94809157509
2400,67272.6842629315
2401,121895.32501404149
2402,142752.67862948167
2403,137653.4754710567
2404,153689.58555067156
2405,159227.29688450438
2406,140104.31093351095
2407,129110.12396062267
2408,143329.44888969365
2409,121604.79229756357
2410,165370.95408480408
2411,126839.81621853143
2412,153273.57777278277
2413,132142.4647198635
2414,153162.3723937174
2415,134999.8605995116
2416,134487.16319641468
2417,139075.15490440116
2418,132775.4088357476
2419,129702.05460106557
2420,128705.44897313797
2421,148591.54238694636
2422,112910.96596900321
2423,127488.12341969142
2424,144107.82673357197
2425,209870.20477622375
2426,135074.67280100455
2427,133411.390015651
2428,180875.96898101896
2429,111253.49454420581
2430,133519.9686096126
2431,112019.2810930736
2432,143671.47242451995
2433,149668.60404040402
2434,148030.9445535853
2435,155524.37217760013
2436,104780.2472099567
2437,105614.28306116104
2438,127063.67522852148
2439,101324.24945399047
2440,123703.6047385947
2441,100382.49827167278
2442,100039.3133785659
2443,132036.4056867577
2444,118600.24740595515
2445,91066.45493384397
2446,136489.37437756694
2447,188245.05913500392
2448,136157.58078527023
2449,115716.55680758132
2450,155689.67334965034
2451,118314.53010625487
2452,201811.47254245757
2453,97930.05932084579
2454,113928.6063458486
2455,117249.21795715396
2456,131641.21073384944
2457,135529.71700563323
2458,133456.37958594188
2459,111593.13531063379
2460,139456.11672349874
2461,132018.44865762017
2462,127612.41224300709
2463,130743.06522660673
2464,165298.2585214785
2465,135851.88056027307
2466,121794.56511865911
2467,131522.92206898655
2468,91908.43052281054
2469,90134.75017027419
2470,199922.13567671223
2471,201955.80234057616
2472,165551.7738494006
2473,116152.32122943722
2474,93967.65793978244
2475,209589.18747180598
2476,114740.74621056723
2477,118800.17049930623
2478,152061.06301487397
2479,109579.54788675213
2480,150919.81814857363
2481,130088.62409398933
2482,121563.45343026417
2483,113096.03082595182
2484,126556.52815584413
2485,127108.13164960036
2486,153186.06377927624
2487,182657.59551151627
2488,155419.2116008714
2489,157959.4087390387
2490,153325.35795618265
2491,93209.02304861805
2492,187580.46729298477
2493,152712.04926570642
2494,147096.40160409035
2495,90602.93109315686
2496,229850.4186225164
2497,147635.62446941948
2498,120986.93373348875
2499,87983.7412087635
2500,126418.40951173825
2501,141001.49072843825
2502,140750.93837182267
2503,103908.76874814075
2504,191716.51086607837
2505,226483.9696455488
2506,253487.6518530081
2507,291365.1243389388
2508,252901.34074883454
2509,221732.62683830064
2510,220143.66189280167
2511,183532.64847990897
2512,215288.76075044397
2513,215842.15897435896
2514,259183.49575430132
2515,152583.63571506276
2516,170203.5481729937
2517,140900.12985639364
2518,149658.31501737155
2519,241025.88940009996
2520,219526.13509851255
2521,189219.89337753915
2522,218288.08247430343
2523,120188.09374178601
2524,142618.32397233322
2525,143168.13866999664
2526,147384.887001332
2527,124829.86838788987
2528,130963.19347957597
2529,143129.06076640033
2530,124249.47859640358
2531,257799.49284573764
2532,220514.01639918415
2533,195962.0918323344
2534,243976.90554667558
2535,274404.8185375181
2536,217563.761711261
2537,242949.36726720503
2538,178634.9101363914
2539,182349.23505427912
2540,176929.84909135307
2541,177047.29403146857
2542,172741.9481575924
2543,119572.98188073035
2544,120322.87029748032
2545,133463.55425499496
2546,136734.68722186144
2547,141878.72325904656
2548,155967.02854340107
2549,157339.06669960602
2550,389814.35037903755
2551,144599.65037809408
2552,129687.88370573871
2553,84912.89809867911
2554,103096.35109978907
2555,108570.65265320789
2556,101764.15943339994
2557,112103.04690573314
2558,169104.85833921633
2559,144812.88347982574
2560,151457.04606529587
2561,141608.589233461
2562,146892.03268367742
2563,153704.42483816185
2564,198564.7538827839
2565,156636.6221735764
2566,145045.5117103175
2567,138818.90781934737
2568,205458.19809274058
2569,214243.67477233883
2570,124287.4804419192
2571,189554.5385919636
2572,161269.26694172493
2573,209309.17394189152
2574,303525.35343925527
2575,137448.66464779663
2576,130215.93294488844
2577,158575.4199928682
2578,85220.60286835388
2579,78362.47306132758
2580,116735.88902189476
2581,125297.90366169938
2582,117536.28689424465
2583,272904.14553948824
2584,162368.44942310464
2585,187631.59872996443
2586,203542.4578233156
2587,195656.53521578416
2588,137138.851730131
2589,145811.64679542682
2590,203006.906774531
2591,227531.11703690764
2592,215962.19709665337
2593,257738.54412928742
2594,174594.76145202023
2595,216014.61628768448
2596,306445.51223720727
2597,199469.9650208125
2598,284789.04479131976
2599,309103.9154710567
2600,158372.85075924074
2601,142375.12042529698
2602,83495.45538772338
2603,93760.7070702631
2604,91544.8705681541
2605,84836.60677522476
2606,145651.92867898766
2607,210830.06212398713
2608,198190.3032197802
2609,160566.11179767456
2610,105702.86313003665
2611,129629.96132398158
2612,155193.5183476524
2613,129095.80192837716
2614,126967.74168303916
2615,158088.79934412809
2616,145664.973499889
2617,191667.99409951162
2618,209487.0667959263
2619,205135.7928586413
2620,185637.15573357194
2621,181354.95590723158
2622,183034.54063325553
2623,239934.4733621934
2624,282924.91148401605
2625,296216.8837834388
2626,170524.02347322123
2627,175194.96870715395
2628,432678.32677358744
2629,527125.1889314576
2630,358899.0698401875
2631,468600.3471436618
2632,423102.8254946443
2633,303568.23339951714
2634,428811.78549267404
2635,150518.35220584975
2636,178520.47652874902
2637,182609.05698790096
2638,257074.3973811745
2639,182576.8177899878
2640,154826.37371411923
2641,107847.0243889166
2642,186769.1848870574
2643,104437.30595734817
2644,120298.00395934623
2645,99259.22564879565
2646,94730.86021617275
2647,96663.56262765014
2648,139176.27593906096
2649,149478.0058405484
2650,132995.82126759354
2651,149168.5603205128
2652,407157.0744155012
2653,254283.25823673554
2654,264833.3963284771
2655,415265.0815553058
2656,318853.010480575
2657,329956.6981519314
2658,292556.1969722777
2659,309915.0032967311
2660,354295.4525636863
2661,361457.72804187477
2662,363572.04616236547
2663,277398.47485891887
2664,289067.5221414141
2665,310358.2204906759
2666,293769.653537074
2667,171543.2054566545
2668,176118.1287543013
2669,177329.8396782107
2670,271807.89517854364
2671,178358.52757831063
2672,190899.12355916307
2673,200191.83289504942
2674,194501.5772736707
2675,177963.78322782778
2676,186874.97182414812
2677,201842.5027977578
2678,256234.35994577646
2679,286029.22220043844
2680,283954.2812342102
2681,428136.09472200036
2682,325817.42529631476
2683,531748.9293757356
2684,314282.1434448051
2685,330331.1087090686
2686,251436.90779537134
2687,316975.4715134033
2688,216157.79412509716
2689,199430.59856299256
2690,425874.7222928737
2691,191721.21315429013
2692,144450.33108585858
2693,193822.50975660447
2694,139431.41130466753
2695,196566.62669963372
2696,182577.89308477635
2697,189110.58458388824
2698,205340.07672688417
2699,177491.84312487513
2700,164402.57579970025
2701,155970.24124433903
2702,112504.92465176486
2703,124751.10942846043
2704,144723.443249556
2705,124291.59526448546
2706,110296.26053629705
2707,126323.12102047948
2708,137844.27833083586
2709,110349.37813189586
2710,133416.56477161727
2711,279705.3596933065
2712,408353.4901409979
2713,164962.53815756468
2714,149350.2583523976
2715,172312.08215467868
2716,148688.3632571873
2717,181360.6585260018
2718,216774.57011502385
2719,147140.82950302472
2720,168735.81407647915
2721,135507.06170662667
2722,156820.5441025641
2723,145023.4302967588
2724,130012.60748038074
2725,136887.2621547896
2726,137356.95756632258
2727,165714.1290027473
2728,175102.6184921745
2729,152593.65465909088
2730,148078.30029734148
2731,129935.23560828058
2732,132959.4551082251
2733,153754.7952323787
2734,143556.5562914863
2735,135862.32128113555
2736,140451.51252494723
2737,124613.2019473305
2738,133745.0440860528
2739,158149.68177489183
2740,142290.51826298705
2741,148799.19748182368
2742,157768.3218165168
2743,152596.3385366855
2744,156436.74254009884
2745,140346.90951479078
2746,138932.32210095457
2747,162759.9885145965
2748,130831.60761763237
2749,136170.6039074814
2750,118639.07201665
2751,132057.14221667225
2752,212721.31413850043
2753,150554.02568686864
2754,229352.75074220213
2755,135769.97947116772
2756,93154.8222470585
2757,77416.02037565215
2758,92175.27921278722
2759,160440.71693908868
2760,131292.17122052945
2761,144062.3160165113
2762,136783.41968903318
2763,175574.1177761128
2764,155264.23207373184
2765,277820.7686419136
2766,129915.41309629254
2767,91548.31028135754
2768,132607.86646794868
2769,137935.68477114552
2770,143671.14636896434
2771,113080.89868101344
2772,112225.25575316347
2773,162411.9025459818
2774,142735.92504692532
2775,121641.41365884113
2776,139383.82122072374
2777,140214.62114280168
2778,107302.81595343539
2779,130724.90251104448
2780,102419.44413999892
2781,93333.90796398044
2782,101356.59063267287
2783,104737.45657373185
2784,125472.57151598403
2785,141228.544492341
2786,76483.94162481964
2787,121594.09296356421
2788,87008.0883237041
2789,160449.1291028694
2790,100653.86939360642
2791,115619.19090287492
2792,76462.41549897325
2793,157193.2292695915
2794,102729.4710934621
2795,122145.30132192807
2796,108238.80083533136
2797,184822.7360457043
2798,116163.60217626813
2799,113564.58380624933
2800,79897.05131587855
2801,118721.85969624815
2802,131174.67815195918
2803,155250.06830647134
2804,129868.89486638358
2805,101031.62341208791
2806,89610.91468664666
2807,155488.73347988122
2808,154523.7685556943
2809,132094.93460539458
2810,134411.89671800422
2811,169769.01029748033
2812,159229.58106665558
2813,151370.00473271176
2814,154173.70661088914
2815,102601.62201809304
2816,215265.55729392832
2817,157491.64313680763
2818,132941.4449063436
2819,174806.24697019643
2820,140607.47163100785
2821,105152.76166416919
2822,182989.6121517371
2823,307701.6142636809
2824,175340.3206737707
2825,154578.26851448553
2826,132326.29023473748
2827,133629.5200047452
2828,240840.17991808194
2829,204566.85284287934
2830,218930.4959603452
2831,184269.3900684871
2832,243187.32275776996
2833,301208.95525069366
2834,226707.06728779548
2835,224136.29275310796
2836,193942.35800810304
2837,157510.92603923846
2838,145851.88486646695
2839,172220.26540356872
2840,192917.02427086796
2841,204358.65704007103
2842,224977.7135497003
2843,153486.8966106949
2844,161241.82971278718
2845,125401.03768037519
2846,215601.82011124986
2847,209497.19774689194
2848,196848.34303479845
2849,201280.0280965146
2850,273546.33019794093
2851,216400.8304066767
2852,230773.06924417257
2853,237944.36371914195
2854,141406.2370956821
2855,196511.2176031469
2856,203007.01151040627
2857,186087.90817943172
2858,198557.9194283217
2859,115734.0447913753
2860,129822.2142316017
2861,125333.71190126539
2862,187067.97964724162
2863,129518.23071234315
2864,257515.7664346487
2865,142629.23970565543
2866,136585.59296237092
2867,95258.75049456098
2868,109184.33019513819
2869,114433.9057994783
2870,134721.54169277943
2871,94251.83075777
2872,62567.01015909093
2873,96096.20706895884
2874,137705.84964671443
2875,112281.13739993337
2876,163787.2002727272
2877,147878.98964979462
2878,155644.16353843382
2879,132832.79971334222
2880,106315.67765229216
2881,151582.02470229773
2882,184939.07673504273
2883,185330.30872360978
2884,195958.28372688428
2885,186357.19085420133
2886,224561.7912830503
2887,105174.77521867018
2888,139246.93192565764
2889,60738.00168933845
2890,89234.56786668887
2891,140426.11258663566
2892,61021.69220240871
2893,96704.55724991676
2894,64754.95957006883
2895,316685.8798012265
2896,298221.5832695359
2897,213436.3331491842
2898,145298.8015034133
2899,216216.89637515266
2900,156234.31551343098
2901,216918.5153996004
2902,186126.8936212676
2903,328842.2728250084
2904,337497.18114202464
2905,102526.55742712844
2906,198939.52712554103
2907,111855.87376187701
2908,129835.51787462532
2909,144558.53737351537
2910,83356.63144522149
2911,83690.79116305917
2912,155098.02621184368
2913,84916.95646742146
2914,85472.61501554007
2915,86212.68514041517
2916,83460.81856143857
2917,159606.70467377064
2918,105532.47942440891
2919,230714.99529981133
